log

age author description
Tue, 24 Dec 2013 18:37:24 +0400 pchelko 7154841: [macosx] Popups appear behind taskbar
Mon, 23 Dec 2013 11:57:03 -0800 dbuck 6571600: JNI use results in UnsatisfiedLinkError looking for libmawt.so
Mon, 23 Dec 2013 19:03:37 +0400 serb 8009919: [macosx] NPE in AquaSingleImagePainter.paint()
Mon, 23 Dec 2013 18:54:50 +0400 serb 8030953: SelectionVisible test should test multiline selection in case of TextArea
Mon, 23 Dec 2013 16:37:21 +0400 malenkov 8030118: Document listeners fired outside document lock
Sun, 22 Dec 2013 21:12:43 +0400 serb 8001472: api/java_awt/Window/indexTGF_* tests fail because expected colors aren't equal
Fri, 20 Dec 2013 14:42:37 +0400 pchelko 8007220: [macosx] Setting popupmenu on TrayIcon do not work if done *after* adding TrayIcon
Thu, 19 Dec 2013 16:49:27 +0400 pchelko 7159566: The choice positioned in the top of applet when clicking the choice.
Thu, 19 Dec 2013 16:40:28 +0400 pchelko 8024185: [macosx] Fullscreen button freezes application when started with -splash
Wed, 18 Dec 2013 18:52:07 +0400 serb 8029045: Regression - Unsatisfied Link Error when the Java Access Bridge is started
Wed, 18 Dec 2013 11:01:33 +0000 azvegint 8029263: user's default browser can not launch after we click the button, and there is an IOException shown in the log text (java.io.IOException)
Wed, 18 Dec 2013 10:41:11 +0000 azvegint 8029923: Many Swing tests and SwingSet2 are failing under Solaris using GTK LaF - "Unable to load native GTK libraries"
Tue, 17 Dec 2013 18:41:58 +0400 anthony 8029979: Allow multiple calls to DropTargetDropEvent.acceptDrop()
Tue, 17 Dec 2013 11:44:25 +0400 pchelko 8026869: [macosx] Support apple.awt.use-file-dialog-packages property
Tue, 17 Dec 2013 11:19:27 +0400 pchelko 8023148: [macosx] java.util.NoSuchElementException at java.util.LinkedList.getFirst
Mon, 16 Dec 2013 17:35:08 +0400 pchelko 8029565: java.awt.dnd.InvalidDnDOperationException: data translation failed on file drop
Fri, 07 Mar 2014 10:40:03 -0800 juh 8036844: test failures due to wrong keystore paths
Fri, 07 Mar 2014 15:01:32 +0100 erikj 8036611: Cleanup of handling of properties and other java resources in the build
Fri, 07 Mar 2014 09:18:15 +0100 sla 8034025: Remove JPLIS agent dependency on canonicalize_md.c
Thu, 20 Mar 2014 13:44:28 -0700 katleman Added tag jdk9-b05 for changeset da7dce5b111a
Wed, 05 Jul 2017 19:33:12 +0200 duke Merge
Tue, 25 Mar 2014 12:32:07 -0700 lana Merge
Tue, 18 Mar 2014 17:49:11 -0700 lana Merge
Fri, 14 Mar 2014 10:31:11 -0700 amurillo Merge
Fri, 14 Mar 2014 13:27:18 +0100 ehelin Merge
Fri, 14 Mar 2014 09:18:39 +0100 ehelin Merge
Wed, 12 Mar 2014 13:02:47 +0100 ehelin Merge
Wed, 05 Mar 2014 07:34:35 -0800 jmasa 7098155: Resize young gen at full collections for UseParallelGC
Tue, 11 Mar 2014 15:14:46 +0100 ehelin Merge
Fri, 21 Feb 2014 09:48:52 +0100 sjohanss 8035057: NewSize ergonomics wrong when setting small or unaligned size on command line
Fri, 31 Jan 2014 13:38:01 +0100 jwilhelm 8023899: Typo in TraceCPUTime message
Fri, 14 Mar 2014 09:26:27 +0100 neliasso Merge
Mon, 10 Mar 2014 12:58:02 +0100 goetz 8036976: PPC64: implement the template interpreter
Wed, 12 Mar 2014 11:24:26 -0700 iveresov 8031321: Support Intel bit manipulation instructions
Tue, 11 Mar 2014 14:54:47 -0700 twisti 8037043: put Method flag bits in predictable positions
Tue, 11 Mar 2014 10:59:26 -0700 drchase Merge
Tue, 11 Mar 2014 13:38:32 -0400 drchase 8028037: [parfait] warnings from b114 for hotspot.src.share.vm
Tue, 11 Mar 2014 11:26:14 -0400 neliasso Merge
Mon, 10 Mar 2014 11:09:02 -0700 iveresov 8025644: java/util/stream/test/org/openjdk/tests/java/util/stream/ToArrayOpTest.java fails with TestData$OfRef): failure java.lang.AssertionError: expected [true] but found [false]
Fri, 07 Mar 2014 07:42:40 +0100 anoll 8029799: vm/mlvm/anonloader/stress/oome prints warning: CodeHeap: # of free blocks > 10000
Thu, 06 Mar 2014 14:35:26 +0100 simonis 8036777: AIX: Adapt implementation after '6546236: Thread interrupt() of Thread.sleep() can be lost on Solaris.'
Thu, 06 Mar 2014 11:12:45 -0800 kvn Merge
Thu, 06 Mar 2014 10:55:28 -0800 goetz 8035647: PPC64: Support for elf v2 abi.
Thu, 06 Mar 2014 09:53:14 -0800 vlivanov 8036667: "assert(adr->is_AddP() && adr->in(AddPNode::Offset)->is_Con()) failed: offset is a constant" with FoldStableValues on
Thu, 06 Mar 2014 02:37:44 -0800 roland Merge
Thu, 06 Mar 2014 11:11:04 +0100 roland 8032633: Enable type speculation by default
Thu, 06 Mar 2014 12:47:45 +0400 iignatyev 8027124: [TESTBUG] NonTieredLevelsTest: java.lang.RuntimeException: private TestCase$Helper(java.lang.Object) must be osr_compiled
Thu, 06 Mar 2014 12:46:04 +0400 iignatyev 8027257: [TESTBUG] compiler/ciReplay/TestVM.sh : Error: Could not find or load main class negative_test
Thu, 06 Mar 2014 12:45:59 +0400 iignatyev 8028482: [TESTBUG] tests that use JMX should be in need_compact3 test group
Wed, 05 Mar 2014 16:21:22 -0800 kvn 8035983: Fix "Native frames:" in crash report (hs_err file)
Wed, 05 Mar 2014 15:14:25 +0100 roland 8036146: make CPP interpreter build again
Wed, 05 Mar 2014 02:41:57 -0800 roland Merge
Wed, 05 Mar 2014 09:29:12 +0100 roland 8035841: assert(dp_src->tag() == dp_dst->tag()) failed: should be same tags 1 != 0 at ciMethodData.cpp:90
Wed, 05 Mar 2014 01:26:52 -0800 anoll Merge
Wed, 05 Mar 2014 10:20:30 +0100 anoll 8036091: compiler/membars/DekkerTest.java fails with -XX:CICompilerCount=1
Tue, 04 Mar 2014 21:15:33 -0800 anoll Merge
Wed, 05 Mar 2014 06:08:19 +0100 anoll 8036092: [TESTBUG] compiler/uncommontrap/TestSpecTrapClassUnloading.java fails with: Unrecognized VM option 'UseTypeSpeculation'
Tue, 04 Mar 2014 18:52:06 -0800 neugens 8036619: Shark: add LLVM 3.4 support
Tue, 04 Mar 2014 17:14:00 +0100 simonis 8036614: AIX: fix adjust-mflags.sh to build with GNU Make 4.0 (adapt 8028407 for AIX)
Tue, 04 Mar 2014 02:33:10 -0800 vlivanov 8036100: Default method returns true for a while, and then returns false