annotate test/ProblemList.txt @ 2812:8503c7f3a354

6987114: Fix top level "test" Makefile logic, add jdk/make/Makefile test target 6987113: Remove SCCS logic from makefiles Reviewed-by: mchung
author ohair
date Fri, 24 Sep 2010 14:22:01 -0700
parents 6586ab5b79f4
children d5489d652f6f
rev   line source
ohair@1821 1 ###########################################################################
ohair@1821 2 #
ohair@2362 3 # Copyright (c) 2009, 2010, Oracle and/or its affiliates. All rights reserved.
ohair@1821 4 # DO NOT ALTER OR REMOVE COPYRIGHT NOTICES OR THIS FILE HEADER.
ohair@1821 5 #
ohair@1821 6 # This code is free software; you can redistribute it and/or modify it
ohair@1821 7 # under the terms of the GNU General Public License version 2 only, as
ohair@2362 8 # published by the Free Software Foundation. Oracle designates this
ohair@1821 9 # particular file as subject to the "Classpath" exception as provided
ohair@2362 10 # by Oracle in the LICENSE file that accompanied this code.
ohair@1821 11 #
ohair@1821 12 # This code is distributed in the hope that it will be useful, but WITHOUT
ohair@1821 13 # ANY WARRANTY; without even the implied warranty of MERCHANTABILITY or
ohair@1821 14 # FITNESS FOR A PARTICULAR PURPOSE. See the GNU General Public License
ohair@1821 15 # version 2 for more details (a copy is included in the LICENSE file that
ohair@1821 16 # accompanied this code).
ohair@1821 17 #
ohair@1821 18 # You should have received a copy of the GNU General Public License version
ohair@1821 19 # 2 along with this work; if not, write to the Free Software Foundation,
ohair@1821 20 # Inc., 51 Franklin St, Fifth Floor, Boston, MA 02110-1301 USA.
ohair@1821 21 #
ohair@2362 22 # Please contact Oracle, 500 Oracle Parkway, Redwood Shores, CA 94065 USA
ohair@2362 23 # or visit www.oracle.com if you need additional information or have any
ohair@2362 24 # questions.
ohair@1821 25 #
ohair@1821 26 ###########################################################################
ohair@1821 27 #
ohair@1821 28 # List of tests that should not be run by test/Makefile, for various reasons:
ohair@1821 29 # 1. Does not run with jtreg -samevm mode
ohair@1821 30 # 2. Causes problems in jtreg -samevm mode for jtreg or tests that follow it
ohair@1821 31 # 3. The test is too slow or consumes too many system resources
ohair@1821 32 # 4. The test fails when run on any official build systems
ohair@1821 33 #
ohair@1821 34 # It is possible that a test being on this list is a mistake, and that some
ohair@1821 35 # other test in samevm mode caused tests to fail, mistakes happen.
ohair@1821 36 #
ohair@1821 37 # Tests marked @ignore are not run by test/Makefile, but harmless to be listed.
ohair@1821 38 #
ohair@1821 39 # Tests that explicitly state "@run main/othervm ...", and are not listed here,
ohair@1821 40 # will be run in the same batch as the samevm tests.
ohair@1821 41 #
ohair@1821 42 # Shell tests are othervm by default.
ohair@1821 43 #
ohair@1821 44 # List items are testnames followed by labels, all MUST BE commented
ohair@1821 45 # as to why they are here and use a label:
ohair@1821 46 # generic-all Problems on all platforms
ohair@1821 47 # generic-ARCH Where ARCH is one of: sparc, sparcv9, x64, i586, etc.
ohair@1821 48 # OSNAME-all Where OSNAME is one of: solaris, linux, windows
ohair@1821 49 # OSNAME-ARCH Specific on to one OSNAME and ARCH, e.g. solaris-x64
ohair@1821 50 # OSNAME-REV Specific on to one OSNAME and REV, e.g. solaris-5.8
ohair@1821 51 #
ohair@1821 52 # More than one label is allowed but must be on the same line.
ohair@1821 53 #
ohair@1821 54 #############################################################################
ohair@1821 55 #
ohair@1821 56 # Running the tests:
ohair@1821 57 # cd test && make JT_HOME=jtreg_home PRODUCT_HOME=jdk_home jdk_all
ohair@1821 58 # Or instead of jdk_all, use any of the jdk_* targets.
ohair@1821 59 #
ohair@1821 60 # Samevm Notes:
ohair@1821 61 # * Although some tests may have only been seen to fail on some platforms,
ohair@1821 62 # they might be flagged as 'generic-all' because the problem they have
ohair@1821 63 # could cause hidden slowdowns on other platforms.
ohair@1821 64 # Most samevm problems will be generic-all, but windows usually dislikes
ohair@1821 65 # them the most.
ohair@1821 66 # Address already in use or connection errors indicate a generic port issue.
ohair@1821 67 # (this is not necessarily a samevm issue, but an issue for running the tests
ohair@1821 68 # on shared machines, two people or two test runs will collide).
ohair@1821 69 # * Samevm problem (windows in particular) is not closing all input/output
ohair@1821 70 # * Samevm problem when a test calls setSecurityManager()
ohair@1821 71 # * Samevm problem with setHttps*() is used? (not exactly sure here)
ohair@1821 72 # * Samevm problem when stuffing system properties with non Strings or anything
ohair@1821 73 # * Samevm problem when changing vm settings, or registering any vm actions
ohair@1821 74 # * Samevm problems with deleteOnExit(), if it must happen at end of test
ohair@1821 75 # * Samevm problems with URLClassLoader? (no details here)
ohair@1821 76 # * Samevm problems with dependence on predictable GC or finalizations
ohair@1821 77 #
ohair@1821 78 # Any of the above problems may mean the test needs to be flagged as "othervm".
ohair@1821 79 #
ohair@1821 80 #############################################################################
ohair@1821 81 #
ohair@1821 82 # Fixing the tests:
ohair@1821 83 #
ohair@1821 84 # Some tests just may need to be run with "othervm", and that can easily be
ohair@1821 85 # done my adding a @run line (or modifying any existing @run):
ohair@1821 86 # @run main/othervm NameOfMainClass
ohair@1821 87 # Make sure this @run follows any use of @library.
ohair@1821 88 # Otherwise, if the test is a samevm possibility, make sure the test is
ohair@1821 89 # cleaning up after itself, closing all streams, deleting temp files, etc.
ohair@1821 90 #
ohair@1821 91 # Keep in mind that the bug could be in many places, and even different per
ohair@1821 92 # platform, it could be a bug in any one of:
ohair@1821 93 # - the testcase
ohair@1821 94 # - the jdk (jdk classes, native code, or hotspot)
ohair@1821 95 # - the native compiler
ohair@1821 96 # - the javac compiler
ohair@1821 97 # - the OS (depends on what the testcase does)
ohair@1821 98 #
ohair@1821 99 # If you managed to really fix one of these tests, here is how you can
ohair@1821 100 # remove tests from this list:
ohair@1821 101 # 1. Make sure test passes on all platforms with samevm, or mark it othervm
ohair@1821 102 # 2. Make sure test passes on all platforms when run with it's entire group
ohair@1821 103 # 3. Make sure both VMs are tested, -server and -client, if possible
ohair@1821 104 # 4. Make sure you try the -d64 option on Solaris
ohair@1821 105 # 5. Use a tool like JPRT or something to verify these results
ohair@1821 106 # 6. Delete lines in this file, include the changes with your test changes
ohair@1821 107 #
ohair@1821 108 # You may need to repeat your testing 2 or even 3 times to verify good
ohair@1821 109 # results, some of these samevm failures are not very predictable.
ohair@1821 110 #
ohair@1821 111 #############################################################################
ohair@1821 112
ohair@1821 113 ############################################################################
ohair@1821 114
ohair@1821 115 # jdk_awt
ohair@1821 116
ohair@1821 117 # None of the awt tests are using samevm, might not be worth the effort due
ohair@1821 118 # to the vm overhead not being enough to make a difference.
ohair@1821 119 # In general, the awt tests are problematic with or without samevm, and there
ohair@1821 120 # are issues with using a Xvfb display.
ohair@1821 121
ohair@1821 122 # Fails on solaris sparc, timedout? in othervm mode
ohair@1821 123 java/awt/event/MouseEvent/AcceptExtraButton/AcceptExtraButton.java generic-all
ohair@1821 124
ohair@1821 125 # Causes hang in samevm mode??? Solaris 11 i586
ohair@1821 126 java/awt/FullScreen/SetFSWindow/FSFrame.java generic-all
ohair@1821 127
ohair@1821 128 # Fails on solaris 11 i586, -client, in othervm mode not sure why
ohair@1821 129 java/awt/Component/PrintAllXcheckJNI/PrintAllXcheckJNI.java generic-all
ohair@1821 130 java/awt/Focus/CloseDialogActivateOwnerTest/CloseDialogActivateOwnerTest.java generic-all
ohair@1821 131 java/awt/FontClass/FontAccess.java generic-all
ohair@1821 132 java/awt/Mixing/HWDisappear.java generic-all
ohair@1821 133 java/awt/Mixing/MixingInHwPanel.java generic-all
ohair@1821 134 java/awt/Mouse/MaximizedFrameTest/MaximizedFrameTest.html generic-all
ohair@1821 135 java/awt/Robot/AcceptExtraMouseButtons/AcceptExtraMouseButtons.java generic-all
ohair@1821 136 java/awt/Toolkit/SecurityTest/SecurityTest2.java generic-all
ohair@1821 137 java/awt/image/mlib/MlibOpsTest.java generic-all
ohair@1821 138
ohair@1821 139 # Fails on windows, othervm mode, various errors
ohair@1821 140 java/awt/Focus/NonFocusableWindowTest/NonfocusableOwnerTest.java generic-all
ohair@1821 141 java/awt/Focus/OwnedWindowFocusIMECrashTest/OwnedWindowFocusIMECrashTest.java generic-all
ohair@1821 142 java/awt/FullScreen/NoResizeEventOnDMChangeTest/NoResizeEventOnDMChangeTest.java generic-all
ohair@1821 143 java/awt/Mouse/MouseModifiersUnitTest/MouseModifiersUnitTest_Standard.java generic-all
ohair@1821 144 java/awt/event/KeyEvent/KeyTyped/CtrlASCII.html generic-all
ohair@1821 145 java/awt/font/Threads/FontThread.java generic-all
ohair@1821 146 java/awt/print/PrinterJob/PrtException.java generic-all
ohair@1821 147
ohair@1821 148 # Fails with windows X64, othervm, -server
ohair@1821 149 com/sun/awt/Translucency/WindowOpacity.java generic-all
ohair@1821 150 java/awt/EventDispatchThread/HandleExceptionOnEDT/HandleExceptionOnEDT.java generic-all
ohair@1821 151 java/awt/EventDispatchThread/LoopRobustness/LoopRobustness.html generic-all
ohair@1821 152 java/awt/Focus/AppletInitialFocusTest/AppletInitialFocusTest1.html generic-all
ohair@1821 153 java/awt/Focus/FocusEmbeddedFrameTest/FocusEmbeddedFrameTest.java generic-all
ohair@1821 154 java/awt/Frame/LayoutOnMaximizeTest/LayoutOnMaximizeTest.java generic-all
ohair@1821 155 java/awt/FullScreen/TranslucentWindow/TranslucentWindow.java generic-all
ohair@1821 156 java/awt/Mixing/MixingOnShrinkingHWButton.java generic-all
ohair@1821 157 java/awt/Mouse/MouseModifiersUnitTest/ExtraButtonDrag.java generic-all
ohair@1821 158
ohair@1821 159 ############################################################################
ohair@1821 160
ohair@1821 161 # jdk_beans
ohair@1821 162
ohair@1821 163 # A large set of the beans tests set the security manager, which would seem
ohair@1821 164 # to indicate that a large number of them should be "othervm", yet are all
ohair@1821 165 # very small tests and could greatly benefit from a samevm test run.
ohair@1821 166 # So a large batch of beans tests are currently run with othervm mode.
ohair@1821 167
ohair@2812 168 # Filed 6986807
ohair@2812 169 java/beans/Introspector/TestTypeResolver.java generic-all
ohair@2812 170
ohair@2812 171 # Filed 6986813
ohair@2812 172 java/beans/Introspector/memory/Test4508780.java generic-all
ohair@2812 173
ohair@1821 174 # Linux, some kind of problems with X11 display
ohair@1821 175 java/beans/PropertyChangeSupport/Test4682386.java generic-all
ohair@1821 176 java/beans/PropertyChangeSupport/TestSynchronization.java generic-all
ohair@1821 177 java/beans/Statement/Test4653179.java generic-all
ohair@1821 178
ohair@1821 179 # Runs REALLY slow on Solaris sparc for some reason, both -client and -server
ohair@1821 180 java/beans/XMLEncoder/Test4625418.java solaris-sparc
ohair@1821 181
ohair@1821 182 # Problems with samevm and setting security manager (speculation partially)
ohair@1821 183 java/beans/Introspector/4168475/Test4168475.java generic-all
ohair@1821 184 java/beans/Introspector/4520754/Test4520754.java generic-all
ohair@1821 185 java/beans/Introspector/6380849/TestBeanInfo.java generic-all
ohair@1821 186 java/beans/Introspector/Test4144543.java generic-all
ohair@1821 187
ohair@1821 188 # Failed to call method solaris-sparc???
ohair@1821 189 java/beans/EventHandler/Test6788531.java generic-all
ohair@1821 190
ohair@1821 191 # Jar or class not found???
ohair@1821 192 java/beans/XMLEncoder/6329581/Test6329581.java generic-all
ohair@1821 193
ohair@1821 194 ############################################################################
ohair@1821 195
ohair@1821 196 # jdk_lang
ohair@1821 197
ohair@1821 198 # Times out on solaris 10 sparc
ohair@1821 199 java/lang/ClassLoader/Assert.java generic-all
ohair@1821 200
ohair@1821 201 # Solaris sparc, samevm, java.lang.Exception: Read from closed pipe hangs
ohair@1821 202 java/lang/Runtime/exec/SleepyCat.java generic-all
ohair@1821 203
ohair@1821 204 # Times out on solaris sparc -server
ohair@1821 205 java/lang/ThreadLocal/MemoryLeak.java solaris-all
ohair@1821 206
ohair@1821 207 # Windows X64, RuntimeException: MyThread expected to have RUNNABLE but got WAITING
ohair@1821 208 java/lang/Thread/ThreadStateTest.java generic-all
ohair@1821 209
ohair@1821 210 ############################################################################
ohair@1821 211
ohair@1821 212 # jdk_management
ohair@1821 213
ohair@2500 214 # Failing, bug was filed: 6959636
ohair@2500 215 javax/management/loading/LibraryLoader/LibraryLoaderTest.java generic-all
ohair@2500 216
ohair@2402 217 # Access denied messages on windows/mks, filed 6954450
ohair@2402 218 sun/management/jmxremote/bootstrap/RmiSslNoKeyStoreTest.sh windows-all
ohair@2402 219
ohair@2203 220 # Fails on linux: KO: StringMonitor notification missed or not emitted
ohair@2203 221 javax/management/monitor/NonComparableAttributeValueTest.java generic-all
ohair@2203 222
ohair@2203 223 # Port conflict? Fails with communication error
ohair@2203 224 sun/management/jmxremote/bootstrap/PasswordFilePermissionTest.sh generic-all
ohair@2203 225
ohair@2017 226 # Fails on Windows 2000, Test failed for iiop java.lang.NullPointerException
ohair@2017 227 # at org.omg.stub.javax.management.remote.rmi._RMIConnectionImpl_Tie._invoke(Unknown Source)
ohair@2017 228 # at com.sun.corba.se.impl.protocol.CorbaServerRequestDispatcherImpl.dispatchToServant(CorbaServerRequestDispatcherImpl.java:653)
ohair@2017 229 javax/management/remote/mandatory/connection/ReconnectTest.java generic-all
ohair@2017 230
ohair@1821 231 # Solaris 10 sparc, NPE from org.omg.stub.javax.management.remote.rmi._RMIConnectionImpl_Tie._invoke
ohair@1821 232 javax/management/remote/mandatory/threads/ExecutorTest.java generic-all
ohair@1821 233
ohair@1821 234 # Linux 32bit Fedora 9, IllegalStateException
ohair@1821 235 javax/management/monitor/RuntimeExceptionTest.java generic-all
ohair@1821 236
ohair@1821 237 # Problems with rmi connection, othervm
ohair@1821 238 javax/management/remote/mandatory/subjectDelegation/SubjectDelegation2Test.java generic-all
ohair@1821 239
ohair@1821 240 # Fails with port already in use
ohair@1821 241 sun/management/jmxremote/bootstrap/SSLConfigFilePermissionTest.sh generic-all
ohair@1821 242
ohair@1821 243 # Fails with port already in use
ohair@1821 244 sun/management/jmxremote/bootstrap/RmiRegistrySslTest.sh generic-all
ohair@1821 245
ohair@1821 246 # Windows, connection can't last that long
ohair@1821 247 javax/management/eventService/LeaseTest.java generic-all
ohair@1821 248
ohair@1821 249 # Linux othervm, X64, java.lang.Exception: Failed: ratio=102.4027795593753
ohair@1821 250 javax/management/remote/mandatory/notif/ListenerScaleTest.java generic-all
ohair@1821 251
ohair@1821 252 # Windows run seems to have triggered a hotspot gc error (see 6801625)
ohair@1821 253 com/sun/management/HotSpotDiagnosticMXBean/DumpHeap.sh generic-all
ohair@1821 254
ohair@1821 255 # rmi problem? othervm, java.lang.reflect.UndeclaredThrowableException
ohair@1821 256 javax/management/remote/mandatory/subjectDelegation/SubjectDelegation3Test.java generic-all
ohair@1821 257
ohair@1821 258 # Linux Fedora 9 32bit NPE in rmi server somehere??? othervm
ohair@1821 259 javax/management/remote/mandatory/notif/NotificationBufferDeadlockTest.java generic-all
ohair@1821 260
ohair@1821 261 # Times out on solaris sparc, with othervm
ohair@1821 262 javax/management/eventService/AddRemoveListenerTest.java generic-all
ohair@1821 263
ohair@1821 264 # Linux i586 and x64 -server, timed out waiting for threads to expire? othervm
ohair@1821 265 javax/management/eventService/EventClientThreadTest.java generic-all
ohair@1821 266
ohair@1821 267 # Linux i586 -server, Expected to receive 20, but got 21, othervm
ohair@1821 268 # Fails on Linux X64 -server 20!=21
ohair@1821 269 javax/management/eventService/FetchingTest.java generic-all
ohair@1821 270
ohair@1821 271 # NPE on windows 2000 i586 -client and -server
ohair@1821 272 javax/management/eventService/CustomForwarderTest.java windows-all
ohair@1821 273
ohair@1821 274 # Windows i586 failure, callback did not complete
ohair@1821 275 javax/management/eventService/LeaseManagerDeadlockTest.java windows-all
ohair@1821 276
ohair@1821 277 # Port already in use
ohair@1821 278 sun/management/jmxremote/bootstrap/LocalManagementTest.sh generic-all
ohair@1821 279
ohair@1821 280 # Failed to initialize connector (also overflowing jtreg io buffers)
ohair@1821 281 sun/management/jmxremote/bootstrap/RmiBootstrapTest.sh generic-all
ohair@1821 282 sun/management/jmxremote/bootstrap/RmiSslBootstrapTest.sh generic-all
ohair@1821 283
ohair@1821 284 # Windows X64, java.lang.IllegalStateException
ohair@1821 285 javax/management/monitor/AttributeArbitraryDataTypeTest.java generic-all
ohair@1821 286
ohair@1821 287 ############################################################################
ohair@1821 288
ohair@1821 289 # jdk_math
ohair@1821 290
ohair@1821 291 # Problems with rounding add failures on solaris-sparcv9 and -server
ohair@1821 292 java/math/BigDecimal/AddTests.java solaris-sparcv9
ohair@1821 293
ohair@1821 294 # Should be samevm? But seems problematic with samevm on windows
ohair@1821 295 java/math/BigInteger/ModPow65537.java generic-all
ohair@1821 296
ohair@1821 297 ############################################################################
ohair@1821 298
ohair@1821 299 # jdk_misc
ohair@1821 300
ohair@1821 301 # Need to be marked othervm, or changed to be samevm safe
ohair@1821 302 com/sun/jndi/ldap/ReadTimeoutTest.java generic-all
ohair@1821 303 com/sun/jndi/rmi/registry/RegistryContext/UnbindIdempotent.java generic-all
ohair@1821 304
ohair@1821 305 # Need to be marked othervm, or changed to be samevm safe
ohair@1821 306 com/sun/org/apache/xml/internal/security/transforms/ClassLoaderTest.java generic-all
ohair@1821 307
ohair@1821 308 # Solaris sparc and others, exception in initializer
ohair@1821 309 javax/imageio/CachePremissionsTest/CachePermissionsTest.java generic-all
ohair@1821 310
ohair@1821 311 # Leaves file rgba_* open, fails with windows samevm
ohair@1821 312 javax/imageio/plugins/png/PngOutputTypeTest.java generic-all
ohair@1821 313
ohair@1821 314 # Suspect test.png file is left open, windows samevm problems
ohair@1821 315 javax/imageio/plugins/png/ITXtTest.java generic-all
ohair@1821 316
ohair@1821 317 # Solaris sparc and others, failed to compile testcase
ohair@1821 318 javax/imageio/metadata/DOML3Node.java generic-all
ohair@1821 319
ohair@1821 320 # One of these tests is leaving file IMGP1001.JPG open, windows samevm
ohair@1821 321 javax/imageio/plugins/jpeg/ConcurrentReadingTest.java generic-all
ohair@1821 322 javax/imageio/plugins/jpeg/ReadingInterruptionTest.java generic-all
ohair@1821 323
ohair@1821 324 # One of these files is missing a close on writer_* files, windows samevm
ohair@1821 325 javax/imageio/plugins/jpeg/ConcurrentWritingTest.java generic-all
ohair@1821 326 javax/imageio/plugins/jpeg/WritingInterruptionTest.java generic-all
ohair@1821 327
ohair@1821 328 # Leaving file test.jpg open, windows samevm
ohair@1821 329 javax/imageio/plugins/jpeg/ReadAsGrayTest.java generic-all
ohair@1821 330
ohair@1821 331 # Missing close on file wbmp*, windows samevm
ohair@1821 332 javax/imageio/plugins/wbmp/CanDecodeTest.java generic-all
ohair@1821 333
ohair@1934 334 # Failures on OpenSolaris, cannot read input files? samevm issues?
ohair@1934 335 javax/imageio/metadata/BooleanAttributes.java generic-all
ohair@1934 336 javax/imageio/plugins/bmp/BMPSubsamplingTest.java generic-all
ohair@1934 337 javax/imageio/plugins/bmp/TopDownTest.java generic-all
ohair@1934 338 javax/imageio/plugins/gif/EncodeSubImageTest.java generic-all
ohair@1934 339 javax/imageio/plugins/gif/GifTransparencyTest.java generic-all
ohair@1934 340 javax/imageio/plugins/png/GrayPngTest.java generic-all
ohair@1934 341 javax/imageio/plugins/png/ItxtUtf8Test.java generic-all
ohair@1934 342 javax/imageio/plugins/png/MergeStdCommentTest.java generic-all
ohair@1934 343 javax/imageio/plugins/png/ShortHistogramTest.java generic-all
ohair@1934 344 javax/imageio/plugins/shared/BitDepth.java generic-all
ohair@1934 345
ohair@1821 346 # Exclude all javax/print tests, even if they passed, they may need samevm work
ohair@1821 347
ohair@1821 348 # Times out on solaris-sparc, sparcv9, x64 -server, some on i586 -client
ohair@1821 349 javax/print/attribute/autosense/PrintAutoSenseData.java generic-all
ohair@1821 350 javax/print/attribute/Chroma.java generic-all
ohair@1821 351 javax/print/attribute/CollateAttr.java generic-all
ohair@1821 352 javax/print/attribute/PSCopiesFlavorTest.java generic-all
ohair@1821 353 javax/print/LookupServices.java generic-all
ohair@1821 354 javax/print/TestRaceCond.java generic-all
ohair@1821 355
ohair@1821 356 # These tests really require a printer (might all be windows only tests?)
ohair@1821 357 javax/print/CheckDupFlavor.java generic-all
ohair@1821 358 javax/print/PrintSE/PrintSE.sh generic-all
ohair@1821 359 javax/print/attribute/ChromaticityValues.java generic-all
ohair@1821 360 javax/print/attribute/GetCopiesSupported.java generic-all
ohair@1821 361 javax/print/attribute/SidesPageRangesTest.java generic-all
ohair@1821 362 javax/print/attribute/SupportedPrintableAreas.java generic-all
jgodinez@2043 363 javax/print/attribute/AttributeTest.java generic-all
ohair@1821 364
ohair@1821 365 # Only print test left, excluding just because all print tests have been
ohair@1821 366 javax/print/attribute/MediaMappingsTest.java generic-all
ohair@1821 367
ohair@1821 368 ############################################################################
ohair@1821 369
ohair@1821 370 # jdk_net
ohair@1821 371
ohair@1821 372 ############################################################################
ohair@1821 373
alanb@2546 374 # jdk_io
alanb@2546 375
alanb@2546 376 # 6962637
alanb@2546 377 java/io/File/MaxPathLength.java windows-all
alanb@2546 378
alanb@2546 379 ############################################################################
alanb@2546 380
ohair@1821 381 # jdk_nio
ohair@1821 382
alanb@2546 383 # 6944810
alanb@2546 384 java/nio/channels/FileChannel/ReleaseOnCloseDeadlock.java windows-all
ohair@1821 385
alanb@2546 386 # 6963118
alanb@2546 387 java/nio/channels/Selector/Wakeup.java windows-all
ohair@2203 388
alanb@2546 389 # The asynchronous I/O implementation on Windows requires Windows XP or newer.
alanb@2546 390 # We can remove the following once all Windows 2000 machines have been
alanb@2546 391 # decommissioned.
alanb@2546 392 java/nio/channels/AsynchronousChannelGroup/Basic.java windows-5.0
alanb@2546 393 java/nio/channels/AsynchronousChannelGroup/GroupOfOne.java windows-5.0
alanb@2546 394 java/nio/channels/AsynchronousChannelGroup/Identity.java windows-5.0
alanb@2546 395 java/nio/channels/AsynchronousChannelGroup/Restart.java windows-5.0
alanb@2546 396 java/nio/channels/AsynchronousChannelGroup/Unbounded.java windows-5.0
alanb@2546 397 java/nio/channels/AsynchronousDatagramChannel/Basic.java windows-5.0
alanb@2546 398 java/nio/channels/AsynchronousFileChannel/Lock.java windows-5.0
alanb@2546 399 java/nio/channels/AsynchronousServerSocketChannel/Basic.java windows-5.0
alanb@2546 400 java/nio/channels/AsynchronousServerSocketChannel/WithSecurityManager.java windows-5.0
alanb@2546 401 java/nio/channels/AsynchronousSocketChannel/Basic.java windows-5.0
alanb@2546 402 java/nio/channels/AsynchronousSocketChannel/DieBeforeComplete.java windows-5.0
alanb@2546 403 java/nio/channels/AsynchronousSocketChannel/Leaky.java windows-5.0
alanb@2546 404 java/nio/channels/AsynchronousSocketChannel/StressLoopback.java windows-5.0
alanb@2546 405 java/nio/channels/Channels/Basic2.java windows-5.0
alanb@2546 406
alanb@2546 407 # 6959891
alanb@2546 408 com/sun/nio/sctp/SctpChannel/SocketOptionTests.java
ohair@2203 409
ohair@2020 410 # Fails with -ea -esa, Assertion error, but only on Solaris 10 machines?
ohair@2020 411 com/sun/nio/sctp/SctpChannel/Send.java generic-all
ohair@2020 412 com/sun/nio/sctp/SctpChannel/Shutdown.java generic-all
ohair@2020 413
ohair@1821 414 # Fails on OpenSolaris, IllegalStateException: Cannot add or remove addresses
ohair@1821 415 # from a channel that is bound to the wildcard address
ohair@1821 416 com/sun/nio/sctp/SctpChannel/Bind.java generic-all
ohair@1821 417
ohair@1821 418 # Failed on OpenSolaris, java.lang.AssertionError: Unknown event type
ohair@1821 419 com/sun/nio/sctp/SctpChannel/Receive.java generic-all
ohair@1821 420
ohair@1821 421 # Solaris 11 gave assert error and "connection refused", samevm issues?
ohair@1821 422 com/sun/nio/sctp/SctpServerChannel/NonBlockingAccept.java generic-all
ohair@1821 423
ohair@1821 424 # Fails with othervm on solaris 11 i586
ohair@1821 425 com/sun/nio/sctp/SctpChannel/CommUp.java generic-all
ohair@1821 426 com/sun/nio/sctp/SctpChannel/Connect.java generic-all
ohair@1821 427 com/sun/nio/sctp/SctpMultiChannel/Branch.java generic-all
ohair@1821 428 com/sun/nio/sctp/SctpMultiChannel/Send.java generic-all
ohair@1821 429 com/sun/nio/sctp/SctpMultiChannel/SocketOptionTests.java generic-all
ohair@1821 430
ohair@1821 431 ############################################################################
ohair@1821 432
ohair@1821 433 # jdk_rmi
ohair@1821 434
ohair@1821 435 # Port already in use, fails on sparc, othervm
ohair@1821 436 java/rmi/reliability/benchmark/runRmiBench.sh generic-all
ohair@1821 437
ohair@1821 438 # Already in use port issues? othervm solaris
ohair@1821 439 java/rmi/activation/rmidViaInheritedChannel/InheritedChannelNotServerSocket.java generic-all
ohair@1821 440 java/rmi/activation/rmidViaInheritedChannel/RmidViaInheritedChannel.java generic-all
ohair@1821 441
ohair@1821 442 # Address already in use, othervm mode, solaris
ohair@1821 443 java/rmi/activation/Activatable/elucidateNoSuchMethod/ElucidateNoSuchMethod.java generic-all
ohair@1821 444 java/rmi/activation/Activatable/forceLogSnapshot/ForceLogSnapshot.java generic-all
ohair@1821 445
ohair@1821 446 # Registry already running on port, solaris
ohair@1821 447 java/rmi/Naming/legalRegistryNames/LegalRegistryNames.java generic-all
ohair@1821 448
ohair@1821 449 # Fails on Linux 32 and 64bit -server?, impl not garbage collected???
ohair@1821 450 java/rmi/transport/pinLastArguments/PinLastArguments.java generic-all
ohair@1821 451
ohair@1821 452 # Times out on solaris sparc
ohair@1821 453 java/rmi/server/RemoteServer/AddrInUse.java generic-all
ohair@1821 454
ohair@1821 455 # Connection error on Windows i586 -server
ohair@1821 456 # Also connection errors in othervm on Solaris 10 sparc, same port???
ohair@1821 457 sun/rmi/transport/tcp/DeadCachedConnection.java generic-all
ohair@1821 458
ohair@1821 459 # Connection errors in othervm on Solaris 10 sparc, same port???
ohair@1821 460 java/rmi/activation/Activatable/checkActivateRef/CheckActivateRef.java generic-all
ohair@1821 461 java/rmi/activation/Activatable/checkAnnotations/CheckAnnotations.java generic-all
ohair@1821 462 java/rmi/activation/Activatable/checkImplClassLoader/CheckImplClassLoader.java generic-all
ohair@1821 463 java/rmi/activation/Activatable/checkRegisterInLog/CheckRegisterInLog.java generic-all
ohair@1821 464 java/rmi/activation/Activatable/createPrivateActivable/CreatePrivateActivatable.java generic-all
ohair@1821 465 java/rmi/activation/Activatable/downloadParameterClass/DownloadParameterClass.java generic-all
ohair@1821 466 java/rmi/activation/Activatable/extLoadedImpl/ext.sh generic-all
ohair@1821 467 java/rmi/activation/Activatable/inactiveGroup/InactiveGroup.java generic-all
ohair@1821 468 java/rmi/activation/Activatable/lookupActivationSystem/LookupActivationSystem.java generic-all
ohair@1821 469 java/rmi/activation/Activatable/nestedActivate/NestedActivate.java generic-all
ohair@1821 470 java/rmi/activation/Activatable/restartCrashedService/RestartCrashedService.java generic-all
ohair@1821 471 java/rmi/activation/Activatable/restartLatecomer/RestartLatecomer.java generic-all
ohair@1821 472 java/rmi/activation/Activatable/shutdownGracefully/ShutdownGracefully.java generic-all
ohair@1821 473 java/rmi/activation/Activatable/unregisterInactive/UnregisterInactive.java generic-all
ohair@1821 474 java/rmi/activation/ActivateFailedException/activateFails/ActivateFails.java generic-all
ohair@1821 475 java/rmi/activation/ActivationGroup/downloadActivationGroup/DownloadActivationGroup.java generic-all
ohair@1821 476 java/rmi/activation/ActivationSystem/activeGroup/IdempotentActiveGroup.java generic-all
ohair@1821 477 java/rmi/reliability/juicer/AppleUserImpl.java generic-all
ohair@1821 478 java/rmi/server/RMISocketFactory/useSocketFactory/unicast/UseCustomSocketFactory.java generic-all
ohair@1821 479 java/rmi/server/UnicastRemoteObject/keepAliveDuringCall/KeepAliveDuringCall.java generic-all
ohair@1821 480 java/rmi/transport/handshakeTimeout/HandshakeTimeout.java generic-all
ohair@1821 481 java/rmi/activation/Activatable/restartService/RestartService.java generic-all
ohair@1821 482 java/rmi/activation/ActivationSystem/modifyDescriptor/ModifyDescriptor.java generic-all
ohair@1821 483 java/rmi/activation/ActivationSystem/stubClassesPermitted/StubClassesPermitted.java generic-all
ohair@1821 484 java/rmi/activation/ActivationSystem/unregisterGroup/UnregisterGroup.java generic-all
ohair@1821 485 java/rmi/activation/CommandEnvironment/SetChildEnv.java generic-all
ohair@1821 486 java/rmi/registry/classPathCodebase/ClassPathCodebase.java generic-all
ohair@1821 487 java/rmi/registry/reexport/Reexport.java generic-all
ohair@1821 488 java/rmi/server/Unreferenced/finiteGCLatency/FiniteGCLatency.java generic-all
ohair@1821 489 java/rmi/server/Unreferenced/leaseCheckInterval/LeaseCheckInterval.java generic-all
ohair@1821 490 java/rmi/server/Unreferenced/unreferencedContext/UnreferencedContext.java generic-all
ohair@1821 491 java/rmi/server/useCustomRef/UseCustomRef.java generic-all
ohair@1821 492 java/rmi/transport/checkFQDN/CheckFQDN.java generic-all
ohair@1821 493 java/rmi/transport/checkLeaseInfoLeak/CheckLeaseLeak.java generic-all
ohair@1821 494 java/rmi/server/RMISocketFactory/useSocketFactory/activatable/UseCustomSocketFactory.java generic-all
ohair@1821 495 java/rmi/server/RMISocketFactory/useSocketFactory/registry/UseCustomSocketFactory.java generic-all
ohair@1821 496 java/rmi/server/UnicastRemoteObject/unexportObject/UnexportLeak.java generic-all
ohair@1821 497
ohair@1821 498 ############################################################################
ohair@1821 499
ohair@1821 500 # jdk_security
ohair@1821 501
ohair@2812 502 # Filed 6986868
ohair@2812 503 sun/security/tools/jarsigner/crl.sh generic-all
ohair@2812 504
ohair@2391 505 # Filed 6951285, not sure how often this fails, last was Linux 64bit Fedora 9
ohair@2391 506 sun/security/krb5/auto/MaxRetries.java generic-all
ohair@2391 507
ohair@2391 508 # Filed 6950930, fails on windows 32bit c1 and windows 64bit
ohair@2391 509 sun/security/krb5/auto/IgnoreChannelBinding.java windows-all
ohair@2391 510
ohair@2391 511 # Filed 6950931, failing on all windows systems
ohair@2391 512 sun/security/tools/jarsigner/crl.sh windows-all
ohair@2391 513
ohair@2391 514 # Filed 6950929, only seemed to fail on solaris sparcv9 (-d64)
ohair@2391 515 # Failed on Linux -server 32bit too, making generic
ohair@2391 516 sun/security/krb5/auto/BadKdc4.java generic-all
ohair@2391 517
ohair@2228 518 # Failing on Solaris i586, 3/9/2010, not a -samevm issue (jdk_security3)
ohair@2228 519 sun/security/pkcs11/Secmod/AddPrivateKey.java solaris-i586
ohair@2228 520 sun/security/pkcs11/ec/ReadCertificates.java solaris-i586
ohair@2228 521 sun/security/pkcs11/ec/ReadPKCS12.java solaris-i586
ohair@2228 522 sun/security/pkcs11/ec/TestCurves.java solaris-i586
ohair@2228 523 sun/security/pkcs11/ec/TestECDSA.java solaris-i586
ohair@2228 524 sun/security/pkcs11/ec/TestECGenSpec.java solaris-i586
ohair@2228 525 sun/security/pkcs11/ec/TestKeyFactory.java solaris-i586
ohair@2228 526
ohair@2203 527 # Unknown problem, could be a jtreg -samevm issue?
ohair@2203 528 # Error while cleaning up threads after test
ohair@2203 529 java/security/Security/SynchronizedAccess.java generic-all
ohair@2203 530
ohair@2203 531 # Failing on Solaris X64 (-d64 -server) with:
ohair@2203 532 # GSSException: Failure unspecified at GSS-API level
ohair@2203 533 # (Mechanism level: Specified version of key is not available (44))
ohair@2203 534 sun/security/krb5/auto/BasicKrb5Test.java generic-all
ohair@2203 535
ohair@2203 536 # Solaris X86 failures, readjar.jks: No such file or directory
ohair@2203 537 sun/security/tools/keytool/readjar.sh generic-all
ohair@2203 538
ohair@2020 539 # Fails with -ea -esa, but only on Solaris sparc? Suspect it is timing out
ohair@2020 540 sun/security/tools/keytool/standard.sh generic-all
ohair@2020 541
ohair@2017 542 # Fails on Solaris 10 X64, address already in use
ohair@2017 543 sun/security/krb5/auto/HttpNegotiateServer.java generic-all
ohair@2017 544
ohair@2017 545 # Fails on almost all platforms
ohair@2017 546 # java.lang.UnsupportedClassVersionError: SerialTest :
ohair@2017 547 # Unsupported major.minor version 51.0
ohair@2017 548 # at java.lang.ClassLoader.defineClass1(Native Method)
ohair@2017 549 sun/security/util/Oid/S11N.sh generic-all
ohair@2017 550
ohair@2017 551 # Fails on Fedora 9 32bit
ohair@2017 552 # GSSException: Failure unspecified at GSS-API level (Mechanism level:
ohair@2017 553 # Invalid argument (400) - Cannot find key of appropriate type to decrypt
ohair@2017 554 # AP REP - DES CBC mode with MD5)
ohair@2017 555 # at sun.security.jgss.krb5.Krb5Context.acceptSecContext(Krb5Context.java:778)
ohair@2017 556 sun/security/krb5/auto/NonMutualSpnego.java generic-all
ohair@2017 557
ohair@2017 558 # Fails on Solaris 10 sparc, GSSException: Failure unspecified at GSS-API level
ohair@2017 559 # Also fails on Windows 2000 similar way
ohair@2017 560 sun/security/krb5/auto/ok-as-delegate.sh generic-all
ohair@2017 561
ohair@2017 562 # Fails on Windows 2000, GSSException: Failure unspecified at GSS-API level
ohair@2017 563 # (Mechanism level: Request is a replay (34))
ohair@2017 564 sun/security/krb5/auto/ok-as-delegate-xrealm.sh generic-all
ohair@2017 565
ohair@2017 566 # Fails on Windows 2000, ExceptionInInitializerError
ohair@2017 567 sun/security/mscapi/AccessKeyStore.sh generic-all
ohair@2017 568
ohair@2017 569 # Fails on Solaris 10, KrbException: Additional pre-authentication required (25)
ohair@2017 570 sun/security/krb5/auto/basic.sh generic-all
ohair@2017 571
ohair@2017 572 # Fails on Fedora 9 64bit, PKCS11Exception: CKR_DEVICE_ERROR
ohair@2017 573 sun/security/pkcs11/KeyAgreement/TestDH.java generic-all
ohair@2017 574
ohair@1821 575 # Run too slow on Solaris 10 sparc
ohair@1821 576 sun/security/ssl/com/sun/net/ssl/internal/ssl/InputRecord/SSLSocketTimeoutNulls.java solaris-sparc
ohair@1821 577 sun/security/ssl/com/sun/net/ssl/internal/ssl/SSLSocketImpl/ClientTimeout.java solaris-sparc
ohair@1821 578 sun/security/ssl/com/sun/net/ssl/internal/ssl/SSLSocketImpl/ServerTimeout.java solaris-sparc
ohair@1821 579 sun/security/ssl/sun/net/www/protocol/https/HttpsURLConnection/ReadTimeout.java solaris-sparc
ohair@1821 580 sun/security/ssl/com/sun/net/ssl/internal/ssl/SSLSocketImpl/NotifyHandshakeTest.sh solaris-sparc
ohair@1821 581 sun/security/tools/keytool/AltProviderPath.sh solaris-sparc
ohair@1821 582
ohair@1821 583 # Solaris 10 sparc, passed/failed confusion? java.security.ProviderException: update() failed
ohair@1821 584 sun/security/ssl/com/sun/net/ssl/internal/ssl/SSLSocketImpl/AsyncSSLSocketClose.java generic-all
ohair@1821 585
ohair@1821 586 # Seem really slow on Solaris sparc, being excluded just for timing reasons
ohair@1821 587 sun/security/tools/jarsigner/AlgOptions.sh solaris-sparc
ohair@1821 588 sun/security/tools/jarsigner/nameclash.sh solaris-sparc
ohair@1821 589 sun/security/krb5/auto/basic.sh solaris-sparc
ohair@1821 590 sun/security/provider/PolicyFile/getinstance/getinstance.sh solaris-sparc
ohair@1821 591 sun/security/tools/jarsigner/samename.sh solaris-sparc
ohair@1821 592
ohair@1821 593 # Timed out, Solaris 10 64bit sparcv9
ohair@1821 594 com/sun/crypto/provider/Cipher/DES/PaddingTest.java generic-all
ohair@1821 595
ohair@1821 596 # Othervm, sparc, NoRouteToHostException: Cannot assign requested address
ohair@1821 597 sun/security/ssl/javax/net/ssl/NewAPIs/SessionCacheSizeTests.java generic-all
ohair@1821 598
ohair@1821 599 # Times out on windows X64, othervm mode
ohair@1821 600 # Solaris sparc and sparcv9 -server, timeout
ohair@1821 601 sun/security/ssl/javax/net/ssl/NewAPIs/SessionTimeOutTests.java generic-all
ohair@1821 602
ohair@1821 603 # Failed on solaris 10 sparc, othervm mode, "js.jks: No such file or directory"
ohair@1821 604 # Also, cannot verify signature on solaris i586 -server
ohair@1821 605 sun/security/tools/jarsigner/concise_jarsigner.sh generic-all
ohair@1821 606
ohair@1821 607 # Various failures on Linux Fedora 9 X64, othervm mode
ohair@1821 608 lib/security/cacerts/VerifyCACerts.java generic-all
ohair@1821 609 sun/security/ssl/javax/net/ssl/NewAPIs/SSLEngine/TestAllSuites.java generic-all
ohair@1821 610 sun/security/ssl/sanity/ciphersuites/CheckCipherSuites.java generic-all
ohair@1821 611 sun/security/tools/jarsigner/oldsig.sh generic-all
ohair@1821 612
ohair@1821 613 # Various failures on Linux Fedora 9 X64, othervm mode
ohair@1821 614 sun/security/ssl/sanity/interop/ClientJSSEServerJSSE.java generic-all
ohair@1821 615
ohair@1821 616 # Linux i586 -server, buffer too short to hold shared secret?
ohair@1821 617 com/sun/crypto/provider/KeyAgreement/DHKeyAgreement2.java generic-all
ohair@1821 618
ohair@1821 619 # Solaris sparcv9: Failed to parse input emptysubject.jks: No such file or directory
ohair@1821 620 sun/security/tools/keytool/emptysubject.sh generic-all
ohair@1821 621
ohair@1821 622 # Timeout on solaris-sparcv9 or exception thrown
ohair@1821 623 com/sun/crypto/provider/Cipher/RSA/TestOAEP_KAT.java solaris-all
ohair@1821 624
ohair@1821 625 # File 6535697.test input stream left open? windows samevm
ohair@1821 626 java/security/cert/CertificateFactory/openssl/OpenSSLCert.java generic-all
ohair@1821 627
ohair@1821 628 # Leaving file open: SerialVersion.current, windows samevm
ohair@1821 629 java/security/BasicPermission/SerialVersion.java generic-all
ohair@1821 630
ohair@1821 631 # Solaris 11 i586, these all fail with samevm, need to be othervm???
ohair@1821 632 java/security/BasicPermission/NullOrEmptyName.java generic-all
ohair@1821 633
ohair@1821 634 # Suspect missing close() on file PermClass.current, windows samevm cascade
ohair@1821 635 java/security/BasicPermission/PermClass.java generic-all
ohair@1821 636
ohair@1821 637 # Solaris 11 i586, these all fail with samevm, need to be othervm???
ohair@1821 638 java/security/KeyPairGenerator/Failover.java generic-all
ohair@1821 639 java/security/Provider/DefaultPKCS11.java generic-all
ohair@1821 640 java/security/SecureClassLoader/DefineClassByteBuffer.java generic-all
ohair@1821 641 java/security/SecureRandom/GetAlgorithm.java generic-all
ohair@1821 642 java/security/Security/removing/RemoveProviders.java generic-all
ohair@1821 643 java/security/Signature/ByteBuffers.java generic-all
ohair@1821 644 java/security/Signature/NONEwithRSA.java generic-all
ohair@1821 645 java/security/Signature/SignWithOutputBuffer.java generic-all
ohair@1821 646 java/security/Signature/TestInitSignWithMyOwnRandom.java generic-all
ohair@1821 647 java/security/UnresolvedPermission/AccessorMethods.java generic-all
ohair@1821 648 java/security/UnresolvedPermission/Equals.java generic-all
ohair@1821 649
ohair@1821 650 # Fails on OpenSolaris, missing classes, slow on Solaris sparc
ohair@1821 651 sun/security/ec/TestEC.java generic-all
ohair@1821 652
ohair@1821 653 # Problems with windows x64
ohair@1821 654 sun/security/mscapi/IsSunMSCAPIAvailable.sh windows-x64
ohair@1821 655 sun/security/mscapi/RSAEncryptDecrypt.sh windows-x64
ohair@1821 656
ohair@1821 657 # Exception in test solaris-sparc -client -server, no windows
ohair@2391 658 sun/security/pkcs11/KeyGenerator/TestKeyGenerator.java solaris-all
ohair@1821 659
ohair@1821 660 # Solaris sparc client, fails to compile?
ohair@1821 661 sun/security/pkcs11/KeyStore/SecretKeysBasic.sh solaris-all
ohair@1821 662
ohair@1821 663 # Fails on OpenSolaris java.net.BindException: Address already in use
ohair@1821 664 sun/security/pkcs11/sslecc/ClientJSSEServerJSSE.java generic-all
ohair@1821 665
ohair@1821 666 # Timeout on solaris-sparcv9 or ArrayIndexOutOfBoundsException?
ohair@1821 667 sun/security/rsa/TestKeyPairGeneratorLength.java solaris-all
ohair@1821 668 sun/security/rsa/TestSignatures.java solaris-all
ohair@1821 669
ohair@1821 670 # Timeout on solaris-sparc and i586 and x64, -client and -server
ohair@1821 671 sun/security/ssl/com/sun/net/ssl/internal/ssl/InputRecord/InterruptedIO.java solaris-all
ohair@1821 672
ohair@1821 673 # Do not seem to run on windows machines? dll missing?
ohair@1821 674 sun/security/tools/jarsigner/emptymanifest.sh windows-all
ohair@1821 675
ohair@1821 676 # Files does not exist or no encoding? solaris-sparcv9
ohair@1821 677 sun/security/tools/keytool/importreadall.sh solaris-all
ohair@1821 678 sun/security/tools/keytool/selfissued.sh solaris-all
ohair@1821 679
ohair@1821 680 ############################################################################
ohair@1821 681
ohair@1821 682 # jdk_swing (not using samevm)
ohair@1821 683
ohair@1821 684 # Fails on solaris 11 i586, with othervm
ohair@1821 685 javax/swing/JFileChooser/6570445/bug6570445.java generic-all
ohair@1821 686 javax/swing/JFileChooser/6738668/bug6738668.java generic-all
ohair@1821 687 javax/swing/JPopupMenu/6675802/bug6675802.java generic-all
ohair@1821 688 javax/swing/system/6799345/TestShutdown.java generic-all
ohair@1821 689
ohair@1821 690 ############################################################################
ohair@1821 691
ohair@1821 692 # jdk_text
ohair@1821 693
ohair@1821 694 # Linux x64 occasional errors, no details
ohair@1821 695 java/text/Bidi/Bug6665028.java linux-x64
ohair@1821 696
ohair@1821 697 ############################################################################
ohair@1821 698
ohair@1821 699 # jdk_tools
ohair@1821 700
ohair@2812 701 # Filed 6952105
ohair@2812 702 com/sun/jdi/SuspendThreadTest.java generic-all
ohair@2812 703
ohair@2812 704 # Filed 6986875
ohair@2812 705 sun/tools/jps/jps-Vvml.sh generic-all
ohair@2812 706
ohair@2812 707 # Filed 6979016
ohair@2812 708 sun/tools/jconsole/ResourceCheckTest.sh generic-all
ohair@2812 709
ohair@1821 710 ############################################################################
ohair@1821 711
ohair@1821 712 # jdk_util
ohair@1821 713
ohair@2812 714 # Filed 6933803
ohair@2812 715 java/util/concurrent/ThreadPoolExecutor/CoreThreadTimeOut.java generic-all
ohair@2812 716
ohair@2203 717 # Fails with assertion error on windows
ohair@2203 718 # 11 separate stacktraces created... file reuse problem?
ohair@2203 719 java/util/zip/ZipFile/ReadLongZipFileName.java generic-all
ohair@2203 720
ohair@2020 721 # Failing on all -client 32bit platforms starting with b77? See 6908348.
ohair@2020 722 java/util/concurrent/BlockingQueue/CancelledProducerConsumerLoops.java generic-all
ohair@2020 723
ohair@1821 724 # Assert error, failures, on Linux Fedora 9 -server
ohair@1821 725 # Windows samevm failure, assert error "Passed = 134, failed = 2"
ohair@1821 726 java/util/Arrays/ArrayObjectMethods.java generic-all
ohair@1821 727
ohair@1821 728 # Windows 2000, -client, samevm, java.lang.Error: Completed != 2
ohair@1821 729 java/util/concurrent/locks/ReentrantLock/CancelledLockLoops.java generic-all
ohair@1821 730
ohair@1821 731 # Windows X64, Executor Stuck samevm mode:
ohair@1821 732 java/util/concurrent/FutureTask/BlockingTaskExecutor.java generic-all
ohair@1821 733
ohair@1821 734 # Problems on windows, jmap.exe hangs? (these run jmap), fails on Solaris 10 x86
ohair@1821 735 java/util/concurrent/locks/Lock/TimedAcquireLeak.java generic-all
ohair@1821 736
ohair@1821 737 # Solaris sparc client, some failures, "1 not equal to 3"?
ohair@1821 738 # also Linux problems with samevm mode, -server linux i586? 1 not equal to 3?
ohair@1821 739 java/util/concurrent/Executors/AutoShutdown.java generic-all
ohair@1821 740
ohair@1821 741 # Fails on solaris-sparc -server (Set not equal to copy. 1)
ohair@1821 742 java/util/EnumSet/EnumSetBash.java solaris-sparc
ohair@1821 743
ohair@1821 744 # Failing to close an input stream? "foo", triggers samevm windows failures
ohair@1821 745 java/util/Formatter/Constructors.java generic-all
ohair@1821 746
ohair@1821 747 # Need to be marked othervm, or changed to be samevm safe
ohair@1821 748 java/util/WeakHashMap/GCDuringIteration.java generic-all
ohair@1821 749
ohair@1821 750 ############################################################################
ohair@1821 751