annotate test/ProblemList.txt @ 2546:eb84b89ef3ff

6963027: TEST_BUG: channels and buffer tests need to run in samevm mode Reviewed-by: ohair, sherman, chegar
author alanb
date Wed, 23 Jun 2010 20:19:29 +0100
parents 848e69fcf2f3
children 7c3da1f0e17c
rev   line source
ohair@1821 1 ###########################################################################
ohair@1821 2 #
ohair@2362 3 # Copyright (c) 2009, 2010, Oracle and/or its affiliates. All rights reserved.
ohair@1821 4 # DO NOT ALTER OR REMOVE COPYRIGHT NOTICES OR THIS FILE HEADER.
ohair@1821 5 #
ohair@1821 6 # This code is free software; you can redistribute it and/or modify it
ohair@1821 7 # under the terms of the GNU General Public License version 2 only, as
ohair@2362 8 # published by the Free Software Foundation. Oracle designates this
ohair@1821 9 # particular file as subject to the "Classpath" exception as provided
ohair@2362 10 # by Oracle in the LICENSE file that accompanied this code.
ohair@1821 11 #
ohair@1821 12 # This code is distributed in the hope that it will be useful, but WITHOUT
ohair@1821 13 # ANY WARRANTY; without even the implied warranty of MERCHANTABILITY or
ohair@1821 14 # FITNESS FOR A PARTICULAR PURPOSE. See the GNU General Public License
ohair@1821 15 # version 2 for more details (a copy is included in the LICENSE file that
ohair@1821 16 # accompanied this code).
ohair@1821 17 #
ohair@1821 18 # You should have received a copy of the GNU General Public License version
ohair@1821 19 # 2 along with this work; if not, write to the Free Software Foundation,
ohair@1821 20 # Inc., 51 Franklin St, Fifth Floor, Boston, MA 02110-1301 USA.
ohair@1821 21 #
ohair@2362 22 # Please contact Oracle, 500 Oracle Parkway, Redwood Shores, CA 94065 USA
ohair@2362 23 # or visit www.oracle.com if you need additional information or have any
ohair@2362 24 # questions.
ohair@1821 25 #
ohair@1821 26 ###########################################################################
ohair@1821 27 #
ohair@1821 28 # List of tests that should not be run by test/Makefile, for various reasons:
ohair@1821 29 # 1. Does not run with jtreg -samevm mode
ohair@1821 30 # 2. Causes problems in jtreg -samevm mode for jtreg or tests that follow it
ohair@1821 31 # 3. The test is too slow or consumes too many system resources
ohair@1821 32 # 4. The test fails when run on any official build systems
ohair@1821 33 #
ohair@1821 34 # It is possible that a test being on this list is a mistake, and that some
ohair@1821 35 # other test in samevm mode caused tests to fail, mistakes happen.
ohair@1821 36 #
ohair@1821 37 # Tests marked @ignore are not run by test/Makefile, but harmless to be listed.
ohair@1821 38 #
ohair@1821 39 # Tests that explicitly state "@run main/othervm ...", and are not listed here,
ohair@1821 40 # will be run in the same batch as the samevm tests.
ohair@1821 41 #
ohair@1821 42 # Shell tests are othervm by default.
ohair@1821 43 #
ohair@1821 44 # List items are testnames followed by labels, all MUST BE commented
ohair@1821 45 # as to why they are here and use a label:
ohair@1821 46 # generic-all Problems on all platforms
ohair@1821 47 # generic-ARCH Where ARCH is one of: sparc, sparcv9, x64, i586, etc.
ohair@1821 48 # OSNAME-all Where OSNAME is one of: solaris, linux, windows
ohair@1821 49 # OSNAME-ARCH Specific on to one OSNAME and ARCH, e.g. solaris-x64
ohair@1821 50 # OSNAME-REV Specific on to one OSNAME and REV, e.g. solaris-5.8
ohair@1821 51 #
ohair@1821 52 # More than one label is allowed but must be on the same line.
ohair@1821 53 #
ohair@1821 54 #############################################################################
ohair@1821 55 #
ohair@1821 56 # Running the tests:
ohair@1821 57 # cd test && make JT_HOME=jtreg_home PRODUCT_HOME=jdk_home jdk_all
ohair@1821 58 # Or instead of jdk_all, use any of the jdk_* targets.
ohair@1821 59 #
ohair@1821 60 # Samevm Notes:
ohair@1821 61 # * Although some tests may have only been seen to fail on some platforms,
ohair@1821 62 # they might be flagged as 'generic-all' because the problem they have
ohair@1821 63 # could cause hidden slowdowns on other platforms.
ohair@1821 64 # Most samevm problems will be generic-all, but windows usually dislikes
ohair@1821 65 # them the most.
ohair@1821 66 # Address already in use or connection errors indicate a generic port issue.
ohair@1821 67 # (this is not necessarily a samevm issue, but an issue for running the tests
ohair@1821 68 # on shared machines, two people or two test runs will collide).
ohair@1821 69 # * Samevm problem (windows in particular) is not closing all input/output
ohair@1821 70 # * Samevm problem when a test calls setSecurityManager()
ohair@1821 71 # * Samevm problem with setHttps*() is used? (not exactly sure here)
ohair@1821 72 # * Samevm problem when stuffing system properties with non Strings or anything
ohair@1821 73 # * Samevm problem when changing vm settings, or registering any vm actions
ohair@1821 74 # * Samevm problems with deleteOnExit(), if it must happen at end of test
ohair@1821 75 # * Samevm problems with URLClassLoader? (no details here)
ohair@1821 76 # * Samevm problems with dependence on predictable GC or finalizations
ohair@1821 77 #
ohair@1821 78 # Any of the above problems may mean the test needs to be flagged as "othervm".
ohair@1821 79 #
ohair@1821 80 #############################################################################
ohair@1821 81 #
ohair@1821 82 # Fixing the tests:
ohair@1821 83 #
ohair@1821 84 # Some tests just may need to be run with "othervm", and that can easily be
ohair@1821 85 # done my adding a @run line (or modifying any existing @run):
ohair@1821 86 # @run main/othervm NameOfMainClass
ohair@1821 87 # Make sure this @run follows any use of @library.
ohair@1821 88 # Otherwise, if the test is a samevm possibility, make sure the test is
ohair@1821 89 # cleaning up after itself, closing all streams, deleting temp files, etc.
ohair@1821 90 #
ohair@1821 91 # Keep in mind that the bug could be in many places, and even different per
ohair@1821 92 # platform, it could be a bug in any one of:
ohair@1821 93 # - the testcase
ohair@1821 94 # - the jdk (jdk classes, native code, or hotspot)
ohair@1821 95 # - the native compiler
ohair@1821 96 # - the javac compiler
ohair@1821 97 # - the OS (depends on what the testcase does)
ohair@1821 98 #
ohair@1821 99 # If you managed to really fix one of these tests, here is how you can
ohair@1821 100 # remove tests from this list:
ohair@1821 101 # 1. Make sure test passes on all platforms with samevm, or mark it othervm
ohair@1821 102 # 2. Make sure test passes on all platforms when run with it's entire group
ohair@1821 103 # 3. Make sure both VMs are tested, -server and -client, if possible
ohair@1821 104 # 4. Make sure you try the -d64 option on Solaris
ohair@1821 105 # 5. Use a tool like JPRT or something to verify these results
ohair@1821 106 # 6. Delete lines in this file, include the changes with your test changes
ohair@1821 107 #
ohair@1821 108 # You may need to repeat your testing 2 or even 3 times to verify good
ohair@1821 109 # results, some of these samevm failures are not very predictable.
ohair@1821 110 #
ohair@1821 111 #############################################################################
ohair@1821 112
ohair@1821 113 ############################################################################
ohair@1821 114
ohair@1821 115 # jdk_awt
ohair@1821 116
ohair@1821 117 # None of the awt tests are using samevm, might not be worth the effort due
ohair@1821 118 # to the vm overhead not being enough to make a difference.
ohair@1821 119 # In general, the awt tests are problematic with or without samevm, and there
ohair@1821 120 # are issues with using a Xvfb display.
ohair@1821 121
ohair@1821 122 # Fails on solaris sparc, timedout? in othervm mode
ohair@1821 123 java/awt/event/MouseEvent/AcceptExtraButton/AcceptExtraButton.java generic-all
ohair@1821 124
ohair@1821 125 # Causes hang in samevm mode??? Solaris 11 i586
ohair@1821 126 java/awt/FullScreen/SetFSWindow/FSFrame.java generic-all
ohair@1821 127
ohair@1821 128 # Fails on solaris 11 i586, -client, in othervm mode not sure why
ohair@1821 129 java/awt/Component/PrintAllXcheckJNI/PrintAllXcheckJNI.java generic-all
ohair@1821 130 java/awt/Focus/CloseDialogActivateOwnerTest/CloseDialogActivateOwnerTest.java generic-all
ohair@1821 131 java/awt/FontClass/FontAccess.java generic-all
ohair@1821 132 java/awt/Mixing/HWDisappear.java generic-all
ohair@1821 133 java/awt/Mixing/MixingInHwPanel.java generic-all
ohair@1821 134 java/awt/Mouse/MaximizedFrameTest/MaximizedFrameTest.html generic-all
ohair@1821 135 java/awt/Robot/AcceptExtraMouseButtons/AcceptExtraMouseButtons.java generic-all
ohair@1821 136 java/awt/Toolkit/SecurityTest/SecurityTest2.java generic-all
ohair@1821 137 java/awt/image/mlib/MlibOpsTest.java generic-all
ohair@1821 138
ohair@1821 139 # Fails on windows, othervm mode, various errors
ohair@1821 140 java/awt/Focus/NonFocusableWindowTest/NonfocusableOwnerTest.java generic-all
ohair@1821 141 java/awt/Focus/OwnedWindowFocusIMECrashTest/OwnedWindowFocusIMECrashTest.java generic-all
ohair@1821 142 java/awt/FullScreen/NoResizeEventOnDMChangeTest/NoResizeEventOnDMChangeTest.java generic-all
ohair@1821 143 java/awt/Mouse/MouseModifiersUnitTest/MouseModifiersUnitTest_Standard.java generic-all
ohair@1821 144 java/awt/event/KeyEvent/KeyTyped/CtrlASCII.html generic-all
ohair@1821 145 java/awt/font/Threads/FontThread.java generic-all
ohair@1821 146 java/awt/print/PrinterJob/PrtException.java generic-all
ohair@1821 147
ohair@1821 148 # Fails with windows X64, othervm, -server
ohair@1821 149 com/sun/awt/Translucency/WindowOpacity.java generic-all
ohair@1821 150 java/awt/EventDispatchThread/HandleExceptionOnEDT/HandleExceptionOnEDT.java generic-all
ohair@1821 151 java/awt/EventDispatchThread/LoopRobustness/LoopRobustness.html generic-all
ohair@1821 152 java/awt/Focus/AppletInitialFocusTest/AppletInitialFocusTest1.html generic-all
ohair@1821 153 java/awt/Focus/FocusEmbeddedFrameTest/FocusEmbeddedFrameTest.java generic-all
ohair@1821 154 java/awt/Frame/LayoutOnMaximizeTest/LayoutOnMaximizeTest.java generic-all
ohair@1821 155 java/awt/FullScreen/TranslucentWindow/TranslucentWindow.java generic-all
ohair@1821 156 java/awt/Mixing/MixingOnShrinkingHWButton.java generic-all
ohair@1821 157 java/awt/Mouse/MouseModifiersUnitTest/ExtraButtonDrag.java generic-all
ohair@1821 158
ohair@1821 159 ############################################################################
ohair@1821 160
ohair@1821 161 # jdk_beans
ohair@1821 162
ohair@1821 163 # A large set of the beans tests set the security manager, which would seem
ohair@1821 164 # to indicate that a large number of them should be "othervm", yet are all
ohair@1821 165 # very small tests and could greatly benefit from a samevm test run.
ohair@1821 166 # So a large batch of beans tests are currently run with othervm mode.
ohair@1821 167
ohair@1821 168 # Linux, some kind of problems with X11 display
ohair@1821 169 java/beans/PropertyChangeSupport/Test4682386.java generic-all
ohair@1821 170 java/beans/PropertyChangeSupport/TestSynchronization.java generic-all
ohair@1821 171 java/beans/Statement/Test4653179.java generic-all
ohair@1821 172
ohair@1821 173 # Runs REALLY slow on Solaris sparc for some reason, both -client and -server
ohair@1821 174 java/beans/XMLEncoder/Test4625418.java solaris-sparc
ohair@1821 175
ohair@1821 176 # Problems with samevm and setting security manager (speculation partially)
ohair@1821 177 java/beans/Introspector/4168475/Test4168475.java generic-all
ohair@1821 178 java/beans/Introspector/4520754/Test4520754.java generic-all
ohair@1821 179 java/beans/Introspector/6380849/TestBeanInfo.java generic-all
ohair@1821 180 java/beans/Introspector/Test4144543.java generic-all
ohair@1821 181
ohair@1821 182 # Failed to call method solaris-sparc???
ohair@1821 183 java/beans/EventHandler/Test6788531.java generic-all
ohair@1821 184
ohair@1821 185 # Jar or class not found???
ohair@1821 186 java/beans/XMLEncoder/6329581/Test6329581.java generic-all
ohair@1821 187
ohair@1821 188 ############################################################################
ohair@1821 189
ohair@1821 190 # jdk_lang
ohair@1821 191
ohair@1821 192 # Times out on solaris 10 sparc
ohair@1821 193 java/lang/ClassLoader/Assert.java generic-all
ohair@1821 194
ohair@1821 195 # Solaris sparc, samevm, java.lang.Exception: Read from closed pipe hangs
ohair@1821 196 java/lang/Runtime/exec/SleepyCat.java generic-all
ohair@1821 197
ohair@1821 198 # Times out on solaris sparc -server
ohair@1821 199 java/lang/ThreadLocal/MemoryLeak.java solaris-all
ohair@1821 200
ohair@1821 201 # Windows X64, RuntimeException: MyThread expected to have RUNNABLE but got WAITING
ohair@1821 202 java/lang/Thread/ThreadStateTest.java generic-all
ohair@1821 203
ohair@1821 204 # Timeout on windows 64bit
ohair@1821 205 java/lang/ClassLoader/deadlock/TestCrossDelegate.sh generic-all
ohair@1821 206
ohair@1821 207 ############################################################################
ohair@1821 208
ohair@1821 209 # jdk_management
ohair@1821 210
ohair@2500 211 # Failing, bug was filed: 6959636
ohair@2500 212 javax/management/loading/LibraryLoader/LibraryLoaderTest.java generic-all
ohair@2500 213
ohair@2402 214 # Access denied messages on windows/mks, filed 6954450
ohair@2402 215 sun/management/jmxremote/bootstrap/RmiSslNoKeyStoreTest.sh windows-all
ohair@2402 216
ohair@2203 217 # Fails on linux: KO: StringMonitor notification missed or not emitted
ohair@2203 218 javax/management/monitor/NonComparableAttributeValueTest.java generic-all
ohair@2203 219
ohair@2203 220 # Port conflict? Fails with communication error
ohair@2203 221 sun/management/jmxremote/bootstrap/PasswordFilePermissionTest.sh generic-all
ohair@2203 222
ohair@2017 223 # Fails on Windows 2000, Test failed for iiop java.lang.NullPointerException
ohair@2017 224 # at org.omg.stub.javax.management.remote.rmi._RMIConnectionImpl_Tie._invoke(Unknown Source)
ohair@2017 225 # at com.sun.corba.se.impl.protocol.CorbaServerRequestDispatcherImpl.dispatchToServant(CorbaServerRequestDispatcherImpl.java:653)
ohair@2017 226 javax/management/remote/mandatory/connection/ReconnectTest.java generic-all
ohair@2017 227
ohair@1821 228 # Solaris 10 sparc, NPE from org.omg.stub.javax.management.remote.rmi._RMIConnectionImpl_Tie._invoke
ohair@1821 229 javax/management/remote/mandatory/threads/ExecutorTest.java generic-all
ohair@1821 230
ohair@1821 231 # Linux 32bit Fedora 9, IllegalStateException
ohair@1821 232 javax/management/monitor/RuntimeExceptionTest.java generic-all
ohair@1821 233
ohair@1821 234 # Problems with rmi connection, othervm
ohair@1821 235 javax/management/remote/mandatory/subjectDelegation/SubjectDelegation2Test.java generic-all
ohair@1821 236
ohair@1821 237 # Fails with port already in use
ohair@1821 238 sun/management/jmxremote/bootstrap/SSLConfigFilePermissionTest.sh generic-all
ohair@1821 239
ohair@1821 240 # Fails with port already in use
ohair@1821 241 sun/management/jmxremote/bootstrap/RmiRegistrySslTest.sh generic-all
ohair@1821 242
ohair@1821 243 # Windows, connection can't last that long
ohair@1821 244 javax/management/eventService/LeaseTest.java generic-all
ohair@1821 245
ohair@1821 246 # Linux othervm, X64, java.lang.Exception: Failed: ratio=102.4027795593753
ohair@1821 247 javax/management/remote/mandatory/notif/ListenerScaleTest.java generic-all
ohair@1821 248
ohair@1821 249 # Windows run seems to have triggered a hotspot gc error (see 6801625)
ohair@1821 250 com/sun/management/HotSpotDiagnosticMXBean/DumpHeap.sh generic-all
ohair@1821 251
ohair@1821 252 # rmi problem? othervm, java.lang.reflect.UndeclaredThrowableException
ohair@1821 253 javax/management/remote/mandatory/subjectDelegation/SubjectDelegation3Test.java generic-all
ohair@1821 254
ohair@1821 255 # Linux Fedora 9 32bit NPE in rmi server somehere??? othervm
ohair@1821 256 javax/management/remote/mandatory/notif/NotificationBufferDeadlockTest.java generic-all
ohair@1821 257
ohair@1821 258 # Times out on solaris sparc, with othervm
ohair@1821 259 javax/management/eventService/AddRemoveListenerTest.java generic-all
ohair@1821 260
ohair@1821 261 # Linux i586 and x64 -server, timed out waiting for threads to expire? othervm
ohair@1821 262 javax/management/eventService/EventClientThreadTest.java generic-all
ohair@1821 263
ohair@1821 264 # Linux i586 -server, Expected to receive 20, but got 21, othervm
ohair@1821 265 # Fails on Linux X64 -server 20!=21
ohair@1821 266 javax/management/eventService/FetchingTest.java generic-all
ohair@1821 267
ohair@1821 268 # NPE on windows 2000 i586 -client and -server
ohair@1821 269 javax/management/eventService/CustomForwarderTest.java windows-all
ohair@1821 270
ohair@1821 271 # Windows i586 failure, callback did not complete
ohair@1821 272 javax/management/eventService/LeaseManagerDeadlockTest.java windows-all
ohair@1821 273
ohair@1821 274 # Port already in use
ohair@1821 275 sun/management/jmxremote/bootstrap/LocalManagementTest.sh generic-all
ohair@1821 276
ohair@1821 277 # Failed to initialize connector (also overflowing jtreg io buffers)
ohair@1821 278 sun/management/jmxremote/bootstrap/RmiBootstrapTest.sh generic-all
ohair@1821 279 sun/management/jmxremote/bootstrap/RmiSslBootstrapTest.sh generic-all
ohair@1821 280
ohair@1821 281 # Windows X64, java.lang.IllegalStateException
ohair@1821 282 javax/management/monitor/AttributeArbitraryDataTypeTest.java generic-all
ohair@1821 283
ohair@1821 284 ############################################################################
ohair@1821 285
ohair@1821 286 # jdk_math
ohair@1821 287
ohair@1821 288 # Problems with rounding add failures on solaris-sparcv9 and -server
ohair@1821 289 java/math/BigDecimal/AddTests.java solaris-sparcv9
ohair@1821 290
ohair@1821 291 # Should be samevm? But seems problematic with samevm on windows
ohair@1821 292 java/math/BigInteger/ModPow65537.java generic-all
ohair@1821 293
ohair@1821 294 ############################################################################
ohair@1821 295
ohair@1821 296 # jdk_misc
ohair@1821 297
ohair@1821 298 # On Windows com.sun.java.swing.plaf.gtk does not exist, always fails there
ohair@1821 299 com/sun/java/swing/plaf/gtk/Test6635110.java windows-all
ohair@1821 300
ohair@1821 301 # Need to be marked othervm, or changed to be samevm safe
ohair@1821 302 com/sun/jndi/ldap/ReadTimeoutTest.java generic-all
ohair@1821 303 com/sun/jndi/rmi/registry/RegistryContext/UnbindIdempotent.java generic-all
ohair@1821 304
ohair@1821 305 # Need to be marked othervm, or changed to be samevm safe
ohair@1821 306 com/sun/org/apache/xml/internal/security/transforms/ClassLoaderTest.java generic-all
ohair@1821 307
ohair@1821 308 # Solaris sparc and others, exception in initializer
ohair@1821 309 javax/imageio/CachePremissionsTest/CachePermissionsTest.java generic-all
ohair@1821 310
ohair@1821 311 # Leaves file rgba_* open, fails with windows samevm
ohair@1821 312 javax/imageio/plugins/png/PngOutputTypeTest.java generic-all
ohair@1821 313
ohair@1821 314 # Suspect test.png file is left open, windows samevm problems
ohair@1821 315 javax/imageio/plugins/png/ITXtTest.java generic-all
ohair@1821 316
ohair@1821 317 # Solaris sparc and others, failed to compile testcase
ohair@1821 318 javax/imageio/metadata/DOML3Node.java generic-all
ohair@1821 319
ohair@1821 320 # One of these tests is leaving file IMGP1001.JPG open, windows samevm
ohair@1821 321 javax/imageio/plugins/jpeg/ConcurrentReadingTest.java generic-all
ohair@1821 322 javax/imageio/plugins/jpeg/ReadingInterruptionTest.java generic-all
ohair@1821 323
ohair@1821 324 # One of these files is missing a close on writer_* files, windows samevm
ohair@1821 325 javax/imageio/plugins/jpeg/ConcurrentWritingTest.java generic-all
ohair@1821 326 javax/imageio/plugins/jpeg/WritingInterruptionTest.java generic-all
ohair@1821 327
ohair@1821 328 # Leaving file test.jpg open, windows samevm
ohair@1821 329 javax/imageio/plugins/jpeg/ReadAsGrayTest.java generic-all
ohair@1821 330
ohair@1821 331 # Missing close on file wbmp*, windows samevm
ohair@1821 332 javax/imageio/plugins/wbmp/CanDecodeTest.java generic-all
ohair@1821 333
ohair@1934 334 # Failures on OpenSolaris, cannot read input files? samevm issues?
ohair@1934 335 javax/imageio/metadata/BooleanAttributes.java generic-all
ohair@1934 336 javax/imageio/plugins/bmp/BMPSubsamplingTest.java generic-all
ohair@1934 337 javax/imageio/plugins/bmp/TopDownTest.java generic-all
ohair@1934 338 javax/imageio/plugins/gif/EncodeSubImageTest.java generic-all
ohair@1934 339 javax/imageio/plugins/gif/GifTransparencyTest.java generic-all
ohair@1934 340 javax/imageio/plugins/png/GrayPngTest.java generic-all
ohair@1934 341 javax/imageio/plugins/png/ItxtUtf8Test.java generic-all
ohair@1934 342 javax/imageio/plugins/png/MergeStdCommentTest.java generic-all
ohair@1934 343 javax/imageio/plugins/png/ShortHistogramTest.java generic-all
ohair@1934 344 javax/imageio/plugins/shared/BitDepth.java generic-all
ohair@1934 345
ohair@1821 346 # Exclude all javax/print tests, even if they passed, they may need samevm work
ohair@1821 347
ohair@1821 348 # Times out on solaris-sparc, sparcv9, x64 -server, some on i586 -client
ohair@1821 349 javax/print/attribute/autosense/PrintAutoSenseData.java generic-all
ohair@1821 350 javax/print/attribute/Chroma.java generic-all
ohair@1821 351 javax/print/attribute/CollateAttr.java generic-all
ohair@1821 352 javax/print/attribute/PSCopiesFlavorTest.java generic-all
ohair@1821 353 javax/print/LookupServices.java generic-all
ohair@1821 354 javax/print/TestRaceCond.java generic-all
ohair@1821 355
ohair@1821 356 # These tests really require a printer (might all be windows only tests?)
ohair@1821 357 javax/print/CheckDupFlavor.java generic-all
ohair@1821 358 javax/print/PrintSE/PrintSE.sh generic-all
ohair@1821 359 javax/print/attribute/ChromaticityValues.java generic-all
ohair@1821 360 javax/print/attribute/GetCopiesSupported.java generic-all
ohair@1821 361 javax/print/attribute/SidesPageRangesTest.java generic-all
ohair@1821 362 javax/print/attribute/SupportedPrintableAreas.java generic-all
jgodinez@2043 363 javax/print/attribute/AttributeTest.java generic-all
ohair@1821 364
ohair@1821 365 # Only print test left, excluding just because all print tests have been
ohair@1821 366 javax/print/attribute/MediaMappingsTest.java generic-all
ohair@1821 367
ohair@1821 368 ############################################################################
ohair@1821 369
ohair@1821 370 # jdk_net
ohair@1821 371
ohair@1821 372 # Suspect many of these tests auffer from using fixed ports, no concrete
ohair@1821 373 # evidence.
ohair@1821 374
ohair@2203 375 # Times out on Windows X64
ohair@2203 376 sun/net/www/http/KeepAliveStream/KeepAliveStreamCloseWithWrongContentLength.java generic-all
ohair@2203 377
ohair@2020 378 # Dies on Solaris 10 sparc and sparcv9, Linux -ea -esa with
ohair@2020 379 # Interrupted or IO exception, maybe writing to non-unique named file?
ohair@2020 380 com/sun/net/httpserver/bugs/B6373555.java generic-all
ohair@2020 381
ohair@1821 382 # Fails on OpenSolaris, BindException unexpected
ohair@1821 383 java/net/BindException/Test.java generic-all
ohair@1821 384
ohair@1821 385 # Fails on OpenSolaris, times out
ohair@1821 386 java/net/MulticastSocket/SetOutgoingIf.java generic-all
ohair@1821 387
ohair@1821 388 # Timed out on Solaris 10 X86.
ohair@1821 389 com/sun/net/httpserver/Test3.java generic-all
ohair@1821 390
ohair@1821 391 # Exception in test on windows
ohair@1821 392 com/sun/net/httpserver/bugs/B6373555.java windows-all
ohair@1821 393
ohair@1821 394 # One of these pollutes the samevm on Linux, too many open files, kills jtreg
ohair@1821 395 com/sun/net/httpserver/bugs/B6339483.java generic-all
ohair@1821 396 com/sun/net/httpserver/bugs/B6341616.java generic-all
ohair@1821 397
ohair@1821 398 # Suspects in cascading samevm problem, solaris 11 i586 (needs othervm?)
ohair@1821 399 # Suspect use of setHttps*()?
ohair@1821 400 com/sun/net/httpserver/SelCacheTest.java generic-all
ohair@1821 401 com/sun/net/httpserver/Test1.java generic-all
ohair@1821 402 com/sun/net/httpserver/Test12.java generic-all
ohair@1821 403 com/sun/net/httpserver/Test13.java generic-all
ohair@1821 404 com/sun/net/httpserver/Test6a.java generic-all
ohair@1821 405 com/sun/net/httpserver/Test7a.java generic-all
ohair@1821 406 com/sun/net/httpserver/Test8a.java generic-all
ohair@1821 407 com/sun/net/httpserver/Test9.java generic-all
ohair@1821 408 com/sun/net/httpserver/Test9a.java generic-all
ohair@1821 409
ohair@1821 410 # 10,000 connections, fails on Linux and makes tests&jtreg fail with samevm
ohair@1821 411 com/sun/net/httpserver/bugs/B6361557.java generic-all
ohair@1821 412
ohair@1821 413 # Address already in use with samevm? Always? Solaris sparc, probably ports
ohair@1821 414 java/net/Authenticator/B4933582.sh generic-all
ohair@1821 415 java/net/DatagramSocket/SendSize.java generic-all
ohair@1821 416
ohair@1821 417 # Solaris 11: exception wrong address???
ohair@1821 418 java/net/Inet6Address/B6558853.java generic-all
ohair@1821 419
ohair@1821 420 # Not closing stream on file i6a1, windows samevm problem
ohair@1821 421 java/net/Inet6Address/serialize/Serialize.java generic-all
ohair@1821 422
ohair@1821 423 # Linux x64 fails "network unreachable"?
ohair@1821 424 java/net/ipv6tests/TcpTest.java generic-all
ohair@1821 425
ohair@1821 426 # Linux i586, fails with unexpected output
ohair@1821 427 java/net/MulticastSocket/NoLoopbackPackets.java linux-i586
ohair@1821 428
ohair@1821 429 # Address already in use
ohair@1821 430 java/net/DatagramSocket/DatagramTimeout.java generic-all
ohair@1821 431
ohair@1821 432 # Fails on windows, takes too long and fails
ohair@1821 433 # Solaris 10 sparcv9, samevm, java.lang.Exception: Takes too long. Dead lock
ohair@1821 434 java/net/Socket/DeadlockTest.java generic-all
ohair@1821 435
ohair@1821 436 # Linux i586 address already in use or connection error, samevm issues
ohair@1821 437 java/net/Socket/AccurateTimeout.java generic-all
ohair@1821 438 java/net/Socket/asyncClose/BrokenPipe.java generic-all
ohair@1821 439 java/net/Socket/CloseAvailable.java generic-all
ohair@1821 440
ohair@1821 441 # Linux X64 address already in use, samevm issues
ohair@1821 442 java/net/Socket/LingerTest.java generic-all
ohair@1821 443 java/net/Socket/LinkLocal.java generic-all
ohair@1821 444 java/net/Socket/NullHost.java generic-all
ohair@1821 445 java/net/Socket/ProxyCons.java generic-all
ohair@1821 446 java/net/Socket/ReadTimeout.java generic-all
ohair@1821 447
ohair@1821 448 # Linux X64 address already in use, samevm issues
ohair@1821 449 java/net/Socket/SetReceiveBufferSize.java generic-all
ohair@1821 450
ohair@1821 451 # Linux i586 address already in use or connection error, samevm issues
ohair@1821 452 java/net/Socket/setReuseAddress/Basic.java generic-all
ohair@1821 453 java/net/Socket/setReuseAddress/Restart.java generic-all
ohair@1821 454
ohair@1821 455 # Linux X64 address already in use, samevm issues
ohair@1821 456 java/net/Socket/SetSoLinger.java generic-all
ohair@1821 457
ohair@1821 458 # Address already in use, windows samevm
ohair@1821 459 java/net/Socket/Timeout.java generic-all
ohair@1821 460
ohair@1821 461 # Linux X64 address already in use, samevm issues
ohair@1821 462 java/net/Socket/ShutdownBoth.java generic-all
ohair@1821 463 java/net/Socket/SoTimeout.java generic-all
ohair@1821 464 java/net/Socket/TestClose.java generic-all
ohair@1821 465 java/net/Socket/UrgentDataTest.java generic-all
ohair@1821 466 java/net/SocketInputStream/SocketClosedException.java generic-all
ohair@1821 467 java/net/SocketInputStream/SocketTimeout.java generic-all
ohair@1821 468
ohair@1821 469 # Linux i586, address already in use or timeout, samevm issues
ohair@1821 470 java/net/URLConnection/DisconnectAfterEOF.java generic-all
ohair@1821 471 java/net/URLConnection/HandleContentTypeWithAttrs.java generic-all
ohair@1821 472 java/net/URLConnection/Responses.java generic-all
ohair@1821 473 java/net/URLConnection/TimeoutTest.java generic-all
ohair@1821 474 java/net/URLConnection/ZeroContentLength.java generic-all
ohair@1821 475
ohair@1821 476 # Solaris 11 i586 fails with samevm, not sure why
ohair@1821 477 java/net/ResponseCache/B6181108.java generic-all
ohair@1821 478 java/net/ResponseCache/ResponseCacheTest.java generic-all
ohair@1821 479 java/net/URL/GetContent.java generic-all
ohair@1821 480 java/net/URLConnection/HttpContinueStackOverflow.java generic-all
ohair@1821 481 java/net/URLConnection/Redirect307Test.java generic-all
ohair@1821 482 java/net/URLConnection/RedirectLimit.java generic-all
ohair@1821 483 java/net/URLConnection/ResendPostBody.java generic-all
ohair@1821 484 java/net/URL/OpenStream.java generic-all
ohair@1821 485 java/net/URLClassLoader/ClassLoad.java generic-all
ohair@1821 486 java/net/URLConnection/SetIfModifiedSince.java generic-all
ohair@1821 487 java/net/URLConnection/URLConnectionHeaders.java generic-all
ohair@1821 488
ohair@1821 489 # Linux i586 Connection refused or address already in use, samevm issues
ohair@1821 490 sun/net/ftp/B6427768.java generic-all
ohair@1821 491 sun/net/ftp/FtpGetContent.java generic-all
ohair@1821 492 sun/net/ftp/FtpURL.java generic-all
ohair@1821 493
ohair@1821 494 # Failed on solaris 10 i586, Exception: should have gotten HttpRetryException?
ohair@1821 495 sun/net/www/http/ChunkedOutputStream/Test.java generic-all
ohair@1821 496
ohair@1821 497 # Trouble cleaning up threads in samevm mode on solaris 11 i586
ohair@1821 498 sun/net/www/http/HttpClient/ProxyTest.java generic-all
ohair@1821 499 sun/net/www/http/ChunkedInputStream/ChunkedEncodingTest.java generic-all
ohair@1821 500 sun/net/www/http/ChunkedInputStream/ChunkedEncodingWithProgressMonitorTest.java generic-all
ohair@1821 501 sun/net/www/http/HttpClient/B6726695.java generic-all
ohair@1821 502 sun/net/www/http/HttpClient/MultiThreadTest.java generic-all
ohair@1821 503 sun/net/www/http/KeepAliveCache/KeepAliveTimerThread.java generic-all
ohair@1821 504
ohair@1821 505 # Connection refused, windows samevm
ohair@1821 506 sun/net/www/protocol/http/DigestTest.java generic-all
ohair@1821 507
ohair@1821 508 ############################################################################
ohair@1821 509
alanb@2546 510 # jdk_io
alanb@2546 511
alanb@2546 512 # 6962637
alanb@2546 513 java/io/File/MaxPathLength.java windows-all
alanb@2546 514
alanb@2546 515 ############################################################################
alanb@2546 516
ohair@1821 517 # jdk_nio
ohair@1821 518
alanb@2546 519 # 6944810
alanb@2546 520 java/nio/channels/FileChannel/ReleaseOnCloseDeadlock.java windows-all
ohair@1821 521
alanb@2546 522 # 6963118
alanb@2546 523 java/nio/channels/Selector/Wakeup.java windows-all
ohair@2203 524
alanb@2546 525 # The asynchronous I/O implementation on Windows requires Windows XP or newer.
alanb@2546 526 # We can remove the following once all Windows 2000 machines have been
alanb@2546 527 # decommissioned.
alanb@2546 528 java/nio/channels/AsynchronousChannelGroup/Basic.java windows-5.0
alanb@2546 529 java/nio/channels/AsynchronousChannelGroup/GroupOfOne.java windows-5.0
alanb@2546 530 java/nio/channels/AsynchronousChannelGroup/Identity.java windows-5.0
alanb@2546 531 java/nio/channels/AsynchronousChannelGroup/Restart.java windows-5.0
alanb@2546 532 java/nio/channels/AsynchronousChannelGroup/Unbounded.java windows-5.0
alanb@2546 533 java/nio/channels/AsynchronousDatagramChannel/Basic.java windows-5.0
alanb@2546 534 java/nio/channels/AsynchronousFileChannel/Lock.java windows-5.0
alanb@2546 535 java/nio/channels/AsynchronousServerSocketChannel/Basic.java windows-5.0
alanb@2546 536 java/nio/channels/AsynchronousServerSocketChannel/WithSecurityManager.java windows-5.0
alanb@2546 537 java/nio/channels/AsynchronousSocketChannel/Basic.java windows-5.0
alanb@2546 538 java/nio/channels/AsynchronousSocketChannel/DieBeforeComplete.java windows-5.0
alanb@2546 539 java/nio/channels/AsynchronousSocketChannel/Leaky.java windows-5.0
alanb@2546 540 java/nio/channels/AsynchronousSocketChannel/StressLoopback.java windows-5.0
alanb@2546 541 java/nio/channels/Channels/Basic2.java windows-5.0
alanb@2546 542
alanb@2546 543 # 6959891
alanb@2546 544 com/sun/nio/sctp/SctpChannel/SocketOptionTests.java
ohair@2203 545
ohair@2020 546 # Fails with -ea -esa, Assertion error, but only on Solaris 10 machines?
ohair@2020 547 com/sun/nio/sctp/SctpChannel/Send.java generic-all
ohair@2020 548 com/sun/nio/sctp/SctpChannel/Shutdown.java generic-all
ohair@2020 549
ohair@1821 550 # Fails on OpenSolaris, IllegalStateException: Cannot add or remove addresses
ohair@1821 551 # from a channel that is bound to the wildcard address
ohair@1821 552 com/sun/nio/sctp/SctpChannel/Bind.java generic-all
ohair@1821 553
ohair@1821 554 # Failed on OpenSolaris, java.lang.AssertionError: Unknown event type
ohair@1821 555 com/sun/nio/sctp/SctpChannel/Receive.java generic-all
ohair@1821 556
ohair@1821 557 # Solaris 11 gave assert error and "connection refused", samevm issues?
ohair@1821 558 com/sun/nio/sctp/SctpServerChannel/NonBlockingAccept.java generic-all
ohair@1821 559
ohair@1821 560 # Fails with othervm on solaris 11 i586
ohair@1821 561 com/sun/nio/sctp/SctpChannel/CommUp.java generic-all
ohair@1821 562 com/sun/nio/sctp/SctpChannel/Connect.java generic-all
ohair@1821 563 com/sun/nio/sctp/SctpMultiChannel/Branch.java generic-all
ohair@1821 564 com/sun/nio/sctp/SctpMultiChannel/Send.java generic-all
ohair@1821 565 com/sun/nio/sctp/SctpMultiChannel/SocketOptionTests.java generic-all
ohair@1821 566
ohair@1821 567 ############################################################################
ohair@1821 568
ohair@1821 569 # jdk_rmi
ohair@1821 570
ohair@1821 571 # Port already in use, fails on sparc, othervm
ohair@1821 572 java/rmi/reliability/benchmark/runRmiBench.sh generic-all
ohair@1821 573
ohair@1821 574 # Already in use port issues? othervm solaris
ohair@1821 575 java/rmi/activation/rmidViaInheritedChannel/InheritedChannelNotServerSocket.java generic-all
ohair@1821 576 java/rmi/activation/rmidViaInheritedChannel/RmidViaInheritedChannel.java generic-all
ohair@1821 577
ohair@1821 578 # Address already in use, othervm mode, solaris
ohair@1821 579 java/rmi/activation/Activatable/elucidateNoSuchMethod/ElucidateNoSuchMethod.java generic-all
ohair@1821 580 java/rmi/activation/Activatable/forceLogSnapshot/ForceLogSnapshot.java generic-all
ohair@1821 581
ohair@1821 582 # Registry already running on port, solaris
ohair@1821 583 java/rmi/Naming/legalRegistryNames/LegalRegistryNames.java generic-all
ohair@1821 584
ohair@1821 585 # Fails on Linux 32 and 64bit -server?, impl not garbage collected???
ohair@1821 586 java/rmi/transport/pinLastArguments/PinLastArguments.java generic-all
ohair@1821 587
ohair@1821 588 # Times out on solaris sparc
ohair@1821 589 java/rmi/server/RemoteServer/AddrInUse.java generic-all
ohair@1821 590
ohair@1821 591 # Connection error on Windows i586 -server
ohair@1821 592 # Also connection errors in othervm on Solaris 10 sparc, same port???
ohair@1821 593 sun/rmi/transport/tcp/DeadCachedConnection.java generic-all
ohair@1821 594
ohair@1821 595 # Connection errors in othervm on Solaris 10 sparc, same port???
ohair@1821 596 java/rmi/activation/Activatable/checkActivateRef/CheckActivateRef.java generic-all
ohair@1821 597 java/rmi/activation/Activatable/checkAnnotations/CheckAnnotations.java generic-all
ohair@1821 598 java/rmi/activation/Activatable/checkImplClassLoader/CheckImplClassLoader.java generic-all
ohair@1821 599 java/rmi/activation/Activatable/checkRegisterInLog/CheckRegisterInLog.java generic-all
ohair@1821 600 java/rmi/activation/Activatable/createPrivateActivable/CreatePrivateActivatable.java generic-all
ohair@1821 601 java/rmi/activation/Activatable/downloadParameterClass/DownloadParameterClass.java generic-all
ohair@1821 602 java/rmi/activation/Activatable/extLoadedImpl/ext.sh generic-all
ohair@1821 603 java/rmi/activation/Activatable/inactiveGroup/InactiveGroup.java generic-all
ohair@1821 604 java/rmi/activation/Activatable/lookupActivationSystem/LookupActivationSystem.java generic-all
ohair@1821 605 java/rmi/activation/Activatable/nestedActivate/NestedActivate.java generic-all
ohair@1821 606 java/rmi/activation/Activatable/restartCrashedService/RestartCrashedService.java generic-all
ohair@1821 607 java/rmi/activation/Activatable/restartLatecomer/RestartLatecomer.java generic-all
ohair@1821 608 java/rmi/activation/Activatable/shutdownGracefully/ShutdownGracefully.java generic-all
ohair@1821 609 java/rmi/activation/Activatable/unregisterInactive/UnregisterInactive.java generic-all
ohair@1821 610 java/rmi/activation/ActivateFailedException/activateFails/ActivateFails.java generic-all
ohair@1821 611 java/rmi/activation/ActivationGroup/downloadActivationGroup/DownloadActivationGroup.java generic-all
ohair@1821 612 java/rmi/activation/ActivationSystem/activeGroup/IdempotentActiveGroup.java generic-all
ohair@1821 613 java/rmi/reliability/juicer/AppleUserImpl.java generic-all
ohair@1821 614 java/rmi/server/RMISocketFactory/useSocketFactory/unicast/UseCustomSocketFactory.java generic-all
ohair@1821 615 java/rmi/server/UnicastRemoteObject/keepAliveDuringCall/KeepAliveDuringCall.java generic-all
ohair@1821 616 java/rmi/transport/handshakeTimeout/HandshakeTimeout.java generic-all
ohair@1821 617 java/rmi/activation/Activatable/restartService/RestartService.java generic-all
ohair@1821 618 java/rmi/activation/ActivationSystem/modifyDescriptor/ModifyDescriptor.java generic-all
ohair@1821 619 java/rmi/activation/ActivationSystem/stubClassesPermitted/StubClassesPermitted.java generic-all
ohair@1821 620 java/rmi/activation/ActivationSystem/unregisterGroup/UnregisterGroup.java generic-all
ohair@1821 621 java/rmi/activation/CommandEnvironment/SetChildEnv.java generic-all
ohair@1821 622 java/rmi/registry/classPathCodebase/ClassPathCodebase.java generic-all
ohair@1821 623 java/rmi/registry/reexport/Reexport.java generic-all
ohair@1821 624 java/rmi/server/Unreferenced/finiteGCLatency/FiniteGCLatency.java generic-all
ohair@1821 625 java/rmi/server/Unreferenced/leaseCheckInterval/LeaseCheckInterval.java generic-all
ohair@1821 626 java/rmi/server/Unreferenced/unreferencedContext/UnreferencedContext.java generic-all
ohair@1821 627 java/rmi/server/useCustomRef/UseCustomRef.java generic-all
ohair@1821 628 java/rmi/transport/checkFQDN/CheckFQDN.java generic-all
ohair@1821 629 java/rmi/transport/checkLeaseInfoLeak/CheckLeaseLeak.java generic-all
ohair@1821 630 java/rmi/server/RMISocketFactory/useSocketFactory/activatable/UseCustomSocketFactory.java generic-all
ohair@1821 631 java/rmi/server/RMISocketFactory/useSocketFactory/registry/UseCustomSocketFactory.java generic-all
ohair@1821 632 java/rmi/server/UnicastRemoteObject/unexportObject/UnexportLeak.java generic-all
ohair@1821 633
ohair@1821 634 ############################################################################
ohair@1821 635
ohair@1821 636 # jdk_security
ohair@1821 637
ohair@2391 638 # Filed 6951285, not sure how often this fails, last was Linux 64bit Fedora 9
ohair@2391 639 sun/security/krb5/auto/MaxRetries.java generic-all
ohair@2391 640
ohair@2391 641 # Filed 6950930, fails on windows 32bit c1 and windows 64bit
ohair@2391 642 sun/security/krb5/auto/IgnoreChannelBinding.java windows-all
ohair@2391 643
ohair@2391 644 # Filed 6950931, failing on all windows systems
ohair@2391 645 sun/security/tools/jarsigner/crl.sh windows-all
ohair@2391 646
ohair@2391 647 # Filed 6950929, only seemed to fail on solaris sparcv9 (-d64)
ohair@2391 648 # Failed on Linux -server 32bit too, making generic
ohair@2391 649 sun/security/krb5/auto/BadKdc4.java generic-all
ohair@2391 650
ohair@2228 651 # Failing on Solaris i586, 3/9/2010, not a -samevm issue (jdk_security3)
ohair@2228 652 sun/security/pkcs11/Secmod/AddPrivateKey.java solaris-i586
ohair@2228 653 sun/security/pkcs11/ec/ReadCertificates.java solaris-i586
ohair@2228 654 sun/security/pkcs11/ec/ReadPKCS12.java solaris-i586
ohair@2228 655 sun/security/pkcs11/ec/TestCurves.java solaris-i586
ohair@2228 656 sun/security/pkcs11/ec/TestECDSA.java solaris-i586
ohair@2228 657 sun/security/pkcs11/ec/TestECGenSpec.java solaris-i586
ohair@2228 658 sun/security/pkcs11/ec/TestKeyFactory.java solaris-i586
ohair@2228 659
ohair@2203 660 # Unknown problem, could be a jtreg -samevm issue?
ohair@2203 661 # Error while cleaning up threads after test
ohair@2203 662 java/security/Security/SynchronizedAccess.java generic-all
ohair@2203 663
ohair@2203 664 # Failing on Solaris X64 (-d64 -server) with:
ohair@2203 665 # GSSException: Failure unspecified at GSS-API level
ohair@2203 666 # (Mechanism level: Specified version of key is not available (44))
ohair@2203 667 sun/security/krb5/auto/BasicKrb5Test.java generic-all
ohair@2203 668
ohair@2203 669 # Solaris X86 failures, readjar.jks: No such file or directory
ohair@2203 670 sun/security/tools/keytool/readjar.sh generic-all
ohair@2203 671
ohair@2020 672 # Fails with -ea -esa, but only on Solaris sparc? Suspect it is timing out
ohair@2020 673 sun/security/tools/keytool/standard.sh generic-all
ohair@2020 674
ohair@2017 675 # Fails on Solaris 10 X64, address already in use
ohair@2017 676 sun/security/krb5/auto/HttpNegotiateServer.java generic-all
ohair@2017 677
ohair@2017 678 # Fails on almost all platforms
ohair@2017 679 # java.lang.UnsupportedClassVersionError: SerialTest :
ohair@2017 680 # Unsupported major.minor version 51.0
ohair@2017 681 # at java.lang.ClassLoader.defineClass1(Native Method)
ohair@2017 682 sun/security/util/Oid/S11N.sh generic-all
ohair@2017 683
ohair@2017 684 # Fails on Fedora 9 32bit
ohair@2017 685 # GSSException: Failure unspecified at GSS-API level (Mechanism level:
ohair@2017 686 # Invalid argument (400) - Cannot find key of appropriate type to decrypt
ohair@2017 687 # AP REP - DES CBC mode with MD5)
ohair@2017 688 # at sun.security.jgss.krb5.Krb5Context.acceptSecContext(Krb5Context.java:778)
ohair@2017 689 sun/security/krb5/auto/NonMutualSpnego.java generic-all
ohair@2017 690
ohair@2017 691 # Fails on Solaris 10 sparc, GSSException: Failure unspecified at GSS-API level
ohair@2017 692 # Also fails on Windows 2000 similar way
ohair@2017 693 sun/security/krb5/auto/ok-as-delegate.sh generic-all
ohair@2017 694
ohair@2017 695 # Fails on Windows 2000, GSSException: Failure unspecified at GSS-API level
ohair@2017 696 # (Mechanism level: Request is a replay (34))
ohair@2017 697 sun/security/krb5/auto/ok-as-delegate-xrealm.sh generic-all
ohair@2017 698
ohair@2017 699 # Fails on Windows 2000, ExceptionInInitializerError
ohair@2017 700 sun/security/mscapi/AccessKeyStore.sh generic-all
ohair@2017 701
ohair@2017 702 # Fails on Solaris 10, KrbException: Additional pre-authentication required (25)
ohair@2017 703 sun/security/krb5/auto/basic.sh generic-all
ohair@2017 704
ohair@2017 705 # Fails on Fedora 9 64bit, PKCS11Exception: CKR_DEVICE_ERROR
ohair@2017 706 sun/security/pkcs11/KeyAgreement/TestDH.java generic-all
ohair@2017 707
ohair@1821 708 # Run too slow on Solaris 10 sparc
ohair@1821 709 sun/security/ssl/com/sun/net/ssl/internal/ssl/InputRecord/SSLSocketTimeoutNulls.java solaris-sparc
ohair@1821 710 sun/security/ssl/com/sun/net/ssl/internal/ssl/SSLSocketImpl/ClientTimeout.java solaris-sparc
ohair@1821 711 sun/security/ssl/com/sun/net/ssl/internal/ssl/SSLSocketImpl/ServerTimeout.java solaris-sparc
ohair@1821 712 sun/security/ssl/sun/net/www/protocol/https/HttpsURLConnection/ReadTimeout.java solaris-sparc
ohair@1821 713 sun/security/ssl/com/sun/net/ssl/internal/ssl/SSLSocketImpl/NotifyHandshakeTest.sh solaris-sparc
ohair@1821 714 sun/security/tools/keytool/AltProviderPath.sh solaris-sparc
ohair@1821 715
ohair@1821 716 # Solaris 10 sparc, passed/failed confusion? java.security.ProviderException: update() failed
ohair@1821 717 sun/security/ssl/com/sun/net/ssl/internal/ssl/SSLSocketImpl/AsyncSSLSocketClose.java generic-all
ohair@1821 718
ohair@1821 719 # Seem really slow on Solaris sparc, being excluded just for timing reasons
ohair@1821 720 sun/security/tools/jarsigner/AlgOptions.sh solaris-sparc
ohair@1821 721 sun/security/tools/jarsigner/nameclash.sh solaris-sparc
ohair@1821 722 sun/security/krb5/auto/basic.sh solaris-sparc
ohair@1821 723 sun/security/provider/PolicyFile/getinstance/getinstance.sh solaris-sparc
ohair@1821 724 sun/security/tools/jarsigner/samename.sh solaris-sparc
ohair@1821 725
ohair@1821 726 # Timed out, Solaris 10 64bit sparcv9
ohair@1821 727 com/sun/crypto/provider/Cipher/DES/PaddingTest.java generic-all
ohair@1821 728
ohair@1821 729 # Othervm, sparc, NoRouteToHostException: Cannot assign requested address
ohair@1821 730 sun/security/ssl/javax/net/ssl/NewAPIs/SessionCacheSizeTests.java generic-all
ohair@1821 731
ohair@1821 732 # Times out on windows X64, othervm mode
ohair@1821 733 # Solaris sparc and sparcv9 -server, timeout
ohair@1821 734 sun/security/ssl/javax/net/ssl/NewAPIs/SessionTimeOutTests.java generic-all
ohair@1821 735
ohair@1821 736 # Failed on solaris 10 sparc, othervm mode, "js.jks: No such file or directory"
ohair@1821 737 # Also, cannot verify signature on solaris i586 -server
ohair@1821 738 sun/security/tools/jarsigner/concise_jarsigner.sh generic-all
ohair@1821 739
ohair@1821 740 # Various failures on Linux Fedora 9 X64, othervm mode
ohair@1821 741 lib/security/cacerts/VerifyCACerts.java generic-all
ohair@1821 742 sun/security/ssl/javax/net/ssl/NewAPIs/SSLEngine/TestAllSuites.java generic-all
ohair@1821 743 sun/security/ssl/sanity/ciphersuites/CheckCipherSuites.java generic-all
ohair@1821 744 sun/security/tools/jarsigner/oldsig.sh generic-all
ohair@1821 745
ohair@1821 746 # Various failures on Linux Fedora 9 X64, othervm mode
ohair@1821 747 sun/security/ssl/sanity/interop/ClientJSSEServerJSSE.java generic-all
ohair@1821 748
ohair@1821 749 # Linux i586 -server, buffer too short to hold shared secret?
ohair@1821 750 com/sun/crypto/provider/KeyAgreement/DHKeyAgreement2.java generic-all
ohair@1821 751
ohair@1821 752 # Solaris sparcv9: Failed to parse input emptysubject.jks: No such file or directory
ohair@1821 753 sun/security/tools/keytool/emptysubject.sh generic-all
ohair@1821 754
ohair@1821 755 # Timeout on solaris-sparcv9 or exception thrown
ohair@1821 756 com/sun/crypto/provider/Cipher/RSA/TestOAEP_KAT.java solaris-all
ohair@1821 757
ohair@1821 758 # File 6535697.test input stream left open? windows samevm
ohair@1821 759 java/security/cert/CertificateFactory/openssl/OpenSSLCert.java generic-all
ohair@1821 760
ohair@1821 761 # Leaving file open: SerialVersion.current, windows samevm
ohair@1821 762 java/security/BasicPermission/SerialVersion.java generic-all
ohair@1821 763
ohair@1821 764 # Solaris 11 i586, these all fail with samevm, need to be othervm???
ohair@1821 765 java/security/BasicPermission/NullOrEmptyName.java generic-all
ohair@1821 766
ohair@1821 767 # Suspect missing close() on file PermClass.current, windows samevm cascade
ohair@1821 768 java/security/BasicPermission/PermClass.java generic-all
ohair@1821 769
ohair@1821 770 # Solaris 11 i586, these all fail with samevm, need to be othervm???
ohair@1821 771 java/security/KeyPairGenerator/Failover.java generic-all
ohair@1821 772 java/security/Provider/DefaultPKCS11.java generic-all
ohair@1821 773 java/security/SecureClassLoader/DefineClassByteBuffer.java generic-all
ohair@1821 774 java/security/SecureRandom/GetAlgorithm.java generic-all
ohair@1821 775 java/security/Security/removing/RemoveProviders.java generic-all
ohair@1821 776 java/security/Signature/ByteBuffers.java generic-all
ohair@1821 777 java/security/Signature/NONEwithRSA.java generic-all
ohair@1821 778 java/security/Signature/SignWithOutputBuffer.java generic-all
ohair@1821 779 java/security/Signature/TestInitSignWithMyOwnRandom.java generic-all
ohair@1821 780 java/security/UnresolvedPermission/AccessorMethods.java generic-all
ohair@1821 781 java/security/UnresolvedPermission/Equals.java generic-all
ohair@1821 782
ohair@1821 783 # Fails on OpenSolaris, missing classes, slow on Solaris sparc
ohair@1821 784 sun/security/ec/TestEC.java generic-all
ohair@1821 785
ohair@1821 786 # Problems with windows x64
ohair@1821 787 sun/security/mscapi/IsSunMSCAPIAvailable.sh windows-x64
ohair@1821 788 sun/security/mscapi/RSAEncryptDecrypt.sh windows-x64
ohair@1821 789
ohair@1821 790 # Exception in test solaris-sparc -client -server, no windows
ohair@2391 791 sun/security/pkcs11/KeyGenerator/TestKeyGenerator.java solaris-all
ohair@1821 792
ohair@1821 793 # Solaris sparc client, fails to compile?
ohair@1821 794 sun/security/pkcs11/KeyStore/SecretKeysBasic.sh solaris-all
ohair@1821 795
ohair@1821 796 # Fails on OpenSolaris java.net.BindException: Address already in use
ohair@1821 797 sun/security/pkcs11/sslecc/ClientJSSEServerJSSE.java generic-all
ohair@1821 798
ohair@1821 799 # Timeout on solaris-sparcv9 or ArrayIndexOutOfBoundsException?
ohair@1821 800 sun/security/rsa/TestKeyPairGeneratorLength.java solaris-all
ohair@1821 801 sun/security/rsa/TestSignatures.java solaris-all
ohair@1821 802
ohair@1821 803 # Timeout on solaris-sparc and i586 and x64, -client and -server
ohair@1821 804 sun/security/ssl/com/sun/net/ssl/internal/ssl/InputRecord/InterruptedIO.java solaris-all
ohair@1821 805
ohair@1821 806 # Do not seem to run on windows machines? dll missing?
ohair@1821 807 sun/security/tools/jarsigner/emptymanifest.sh windows-all
ohair@1821 808
ohair@1821 809 # Files does not exist or no encoding? solaris-sparcv9
ohair@1821 810 sun/security/tools/keytool/importreadall.sh solaris-all
ohair@1821 811 sun/security/tools/keytool/selfissued.sh solaris-all
ohair@1821 812
ohair@1821 813 ############################################################################
ohair@1821 814
ohair@1821 815 # jdk_swing (not using samevm)
ohair@1821 816
ohair@1821 817 # Fails on solaris 10 sparc, throws RuntimeException that just says "failed"
ohair@1821 818 javax/swing/JLabel/6501991/bug6501991.java generic-all
ohair@1821 819
ohair@1821 820 # Fails on solaris 11 i586, with othervm
ohair@1821 821 javax/swing/JFileChooser/6570445/bug6570445.java generic-all
ohair@1821 822 javax/swing/JFileChooser/6738668/bug6738668.java generic-all
ohair@1821 823 javax/swing/JPopupMenu/6675802/bug6675802.java generic-all
ohair@1821 824 javax/swing/system/6799345/TestShutdown.java generic-all
ohair@1821 825
ohair@1821 826 ############################################################################
ohair@1821 827
ohair@1821 828 # jdk_text
ohair@1821 829
ohair@1821 830 # Linux x64 occasional errors, no details
ohair@1821 831 java/text/Bidi/Bug6665028.java linux-x64
ohair@1821 832
ohair@1821 833 ############################################################################
ohair@1821 834
ohair@1821 835 # jdk_tools
ohair@1821 836
ohair@1821 837 ############################################################################
ohair@1821 838
ohair@1821 839 # jdk_util
ohair@1821 840
ohair@2203 841 # Fails with assertion error on windows
ohair@2203 842 # 11 separate stacktraces created... file reuse problem?
ohair@2203 843 java/util/zip/ZipFile/ReadLongZipFileName.java generic-all
ohair@2203 844
ohair@2020 845 # Failing on all -client 32bit platforms starting with b77? See 6908348.
ohair@2020 846 java/util/concurrent/BlockingQueue/CancelledProducerConsumerLoops.java generic-all
ohair@2020 847
ohair@1821 848 # Assert error, failures, on Linux Fedora 9 -server
ohair@1821 849 # Windows samevm failure, assert error "Passed = 134, failed = 2"
ohair@1821 850 java/util/Arrays/ArrayObjectMethods.java generic-all
ohair@1821 851
ohair@1821 852 # Windows 2000, -client, samevm, java.lang.Error: Completed != 2
ohair@1821 853 java/util/concurrent/locks/ReentrantLock/CancelledLockLoops.java generic-all
ohair@1821 854
ohair@1821 855 # Windows X64, Executor Stuck samevm mode:
ohair@1821 856 java/util/concurrent/FutureTask/BlockingTaskExecutor.java generic-all
ohair@1821 857
ohair@1821 858 # Problems on windows, jmap.exe hangs? (these run jmap), fails on Solaris 10 x86
ohair@1821 859 java/util/concurrent/locks/Lock/TimedAcquireLeak.java generic-all
ohair@1821 860
ohair@1821 861 # Solaris sparc client, some failures, "1 not equal to 3"?
ohair@1821 862 # also Linux problems with samevm mode, -server linux i586? 1 not equal to 3?
ohair@1821 863 java/util/concurrent/Executors/AutoShutdown.java generic-all
ohair@1821 864
ohair@1821 865 # Fails on solaris-sparc -server (Set not equal to copy. 1)
ohair@1821 866 java/util/EnumSet/EnumSetBash.java solaris-sparc
ohair@1821 867
ohair@1821 868 # Failing to close an input stream? "foo", triggers samevm windows failures
ohair@1821 869 java/util/Formatter/Constructors.java generic-all
ohair@1821 870
ohair@1821 871 # Need to be marked othervm, or changed to be samevm safe
ohair@1821 872 java/util/WeakHashMap/GCDuringIteration.java generic-all
ohair@1821 873
ohair@1821 874 ############################################################################
ohair@1821 875