log

age author description
Tue, 27 May 2014 13:58:00 -0700 prr Merge
Tue, 27 May 2014 12:50:51 -0700 prr 8035301: Eliminate dependency on sun.text from font code
Mon, 26 May 2014 18:01:59 +0400 malenkov 8019180: Use JComboBox as it's own ActionListener leads to unexpected behaviour
Mon, 26 May 2014 16:37:25 +0400 serb 8009883: REGRESSION: test/closed/javax/swing/AbstractButton/4246045/bug4246045.java fails
Mon, 26 May 2014 15:50:10 +0400 yan 8041915: Move 8 awt tests to OpenJDK regression tests tree
Mon, 26 May 2014 14:33:49 +0400 alexsch 8040291: [macosx] Http-Images are not fully loaded when using ImageIcon
Fri, 23 May 2014 11:13:54 -0700 prr Merge
Fri, 23 May 2014 19:48:25 +0400 pchelko 8031485: [macosx] Combo box consuming escape key events
Fri, 23 May 2014 19:43:14 +0400 pchelko 8043610: Sorting columns in JFileChooser fails with AppContext NPE
Fri, 23 May 2014 11:04:37 -0400 omajid 8043805: Allow using a system-installed libjpeg
Thu, 22 May 2014 13:54:52 -0700 prr 8042850: [parfait]: Extra unused entries in ICU ScriptCodes enum
Thu, 22 May 2014 13:54:08 -0700 prr 8042855: [parfait] Potential null pointer dereference in IndicLayoutEngine.cpp
Thu, 22 May 2014 21:05:30 +0400 malenkov 8043627: NPE in SynthContext in plugin mode
Thu, 22 May 2014 15:46:50 +0400 pchelko 8043646: libosxapp.dylib fails to build on Mac OS 10.9 with clang
Wed, 21 May 2014 11:12:18 -0700 prr 8039394: Compiler warnings about C++ exceptions in windows printing code
Wed, 21 May 2014 10:50:14 -0700 prr 8016451: Scary messages emitted by build.tools.generatenimbus.PainterGenerator during build
Wed, 21 May 2014 16:48:04 +0400 malenkov 8043456: KSS: javax.swing.plaf.basic.BasicInternalFrameTitlePane#postClosingEvent
Wed, 21 May 2014 14:13:17 +0400 alexsch 8041561: Inconsistent opacity behaviour between JCheckBox and JRadioButton
Wed, 21 May 2014 14:07:06 +0400 alexsch 8036110: In TextField can only select text visible or to the left of the cursor
Tue, 20 May 2014 09:36:22 -0700 darcy 8042864: Fix raw and unchecked warnings in javax.print
Mon, 19 May 2014 23:21:39 +0400 ddehaven 8026385: [macosx] (awt) setjmp/longjmp changes the process signal mask on OS X
Mon, 19 May 2014 10:03:58 -0700 darcy 8042871: Fix raw and unchecked warnings in sun.audio
Mon, 19 May 2014 16:48:41 +0400 anashaty 8038000: java.awt.image.RasterFormatException: Incorrect scanline stride
Fri, 16 May 2014 15:57:06 +0400 malenkov 8043153: KSS: javax.swing.plaf.synth.SynthParser#startColor
Fri, 16 May 2014 15:51:57 +0400 malenkov 8043152: KSS: javax.swing.plaf.synth.SynthContext
Fri, 16 May 2014 15:46:24 +0400 malenkov 8043151: KSS: javax.swing.plaf.nimbus.AbstractRegionPainter#getComponentColor
Wed, 18 Jun 2014 12:52:14 -0700 ddehaven 8043340: [macosx] Fix hard-wired paths to JavaVM.framework
Thu, 03 Jul 2014 11:37:18 -0700 katleman Added tag jdk9-b21 for changeset 843911d61b95
Wed, 05 Jul 2017 19:47:36 +0200 duke Merge
Wed, 09 Jul 2014 10:42:04 -0700 lana Merge
Tue, 01 Jul 2014 14:26:52 -0700 lana Merge
Fri, 20 Jun 2014 11:10:18 -0700 amurillo Merge
Thu, 19 Jun 2014 12:50:52 -0700 twisti Merge
Mon, 16 Jun 2014 16:27:41 -0700 mikael 8046769: Set T family feature bit on Niagara systems
Mon, 16 Jun 2014 15:12:24 +0400 iignatyev 8044742: testlibrary_tests/whitebox/vm_flags/BooleanTest.java NoClassDefFoundError: com/oracle/java/testlibrary/JDKToolFinder
Thu, 19 Jun 2014 09:44:12 -0700 jmasa Merge
Wed, 18 Jun 2014 12:39:57 -0700 jmasa Merge
Wed, 18 Jun 2014 13:02:33 +0000 jwilhelm Merge
Thu, 12 Jun 2014 20:15:51 +0200 jwilhelm 8046715: Add a way to verify an extended set of command line options
Wed, 18 Jun 2014 13:25:40 +0200 tschatzl 8043722: Swapped usage of idx_t and bm_word_t types in parMarkBitMap.cpp
Fri, 13 Jun 2014 17:07:39 -0400 jwilhelm 8046408: Build failure from multiple ptrace.h
Fri, 13 Jun 2014 19:05:56 -0700 amurillo Merge
Fri, 13 Jun 2014 13:46:06 +0200 pliden 8044796: G1: Enable G1CollectedHeap::stop()
Wed, 18 Jun 2014 14:21:28 -0700 dcubed 8047156: cleanup more non-indent white space issues prior to Contended Locking cleanup bucket
Wed, 18 Jun 2014 12:21:39 -0700 iveresov Merge
Wed, 18 Jun 2014 10:54:32 -0700 iveresov 8046684: sharedRuntime.cpp...assert(((nmethod*)cb)->is_at_poll_or_poll_return(pc)) failed: safepoint polling: type must be poll
Wed, 18 Jun 2014 13:58:13 -0400 coleenp 8039150: host_klass invariant fails when verifying newly loaded JSR-292 anonymous classes
Tue, 17 Jun 2014 11:18:10 -0700 ddehaven 8043340: [macosx] Fix hard-wired paths to JavaVM.framework
Tue, 17 Jun 2014 12:54:01 -0700 dcubed 8046758: cleanup non-indent white space issues prior to Contended Locking cleanup bucket
Fri, 13 Jun 2014 19:07:11 -0700 dcubed Merge
Fri, 13 Jun 2014 05:10:44 -0700 dsamersoff 8038392: Generating prelink cache breaks JAVA 'jinfo' utility normal behaviour
Thu, 12 Jun 2014 15:57:16 -0700 dcubed 8046287: [TESTBUG] runtime/Thread/TestThreadDumpMonitorContention.java failed error_cnt=12
Thu, 12 Jun 2014 13:37:53 -0400 lfoltan 6961433: Revisit need to disable Windows C++ compiler optimisation of sharedRuntimeTrig.cpp.
Thu, 12 Jun 2014 11:34:35 +0200 dsimms 8046662: Check JNI ReleaseStringChars / ReleaseStringUTFChars verify_guards test inverted
Wed, 11 Jun 2014 18:34:09 +0200 dsimms 8043224: -Xcheck:jni improvements to exception checking and excessive local refs
Wed, 11 Jun 2014 09:58:23 -0400 hseigel 8031819: Remove legacy jdk checks and code
Wed, 11 Jun 2014 12:09:12 +0200 dsimms 6311046: -Xcheck:jni should support checking of GetPrimitiveArrayCritical.
Tue, 10 Jun 2014 20:24:48 -0700 dcubed Merge
Tue, 10 Jun 2014 14:04:37 -0400 hseigel 8044738: Check attribute_length of EnclosingMethod attribute
Mon, 09 Jun 2014 11:03:09 +0200 sla 8044797: Building with clang gives: fatal error: file '...' has been modified since the precompiled header was built
Fri, 06 Jun 2014 14:46:42 +0200 ctornqvi 8043492: ad_x86_64_misc.obj : error LNK2011: precompiled object not linked in; image may not run
Wed, 04 Jun 2014 11:05:30 +0200 sla 8044107: Add Diagnostic Command to list all ClassLoaders
Mon, 02 Jun 2014 17:21:15 +0200 miauno 8044540: serviceability/sa/jmap-hashcode/Test8028623.java should be quarantined
Thu, 03 Jul 2014 11:36:49 -0700 katleman Added tag jdk9-b21 for changeset 783e13910e74
Wed, 09 Jul 2014 10:41:00 -0700 lana Merge
Tue, 01 Jul 2014 14:26:31 -0700 lana Merge
Tue, 01 Jul 2014 10:20:34 -0700 prr Merge
Fri, 20 Jun 2014 13:35:56 -0700 mchung 8044063: Remove com.sun.java.browser.* from jdk repo
Mon, 30 Jun 2014 18:04:13 -0700 joehw 8023276: Java SE should include the full DOM API from JAXP
Mon, 30 Jun 2014 14:27:37 -0700 darcy 8048302: Update bug reporting URL in make/Javadoc.gmk
Tue, 24 Jun 2014 20:29:52 -0700 mikael 8047740: Add hotspot testset to jprt.properties
Tue, 24 Jun 2014 15:21:47 -0700 mduigou 8047925: Add mercurial version checks to get_source.sh
Mon, 23 Jun 2014 14:08:45 -0700 mikael 8047763: Recognize sparc64 as a sparc platform
Wed, 18 Jun 2014 13:12:58 -0700 prr Merge
Mon, 09 Jun 2014 11:58:07 -0700 prr Merge
Tue, 27 May 2014 13:57:42 -0700 prr Merge
Fri, 23 May 2014 11:16:31 -0700 prr Merge
Fri, 23 May 2014 11:04:32 -0400 omajid 8043805: Allow using a system-installed libjpeg
Wed, 18 Jun 2014 12:52:13 -0700 ddehaven 8043340: [macosx] Fix hard-wired paths to JavaVM.framework
Thu, 03 Jul 2014 11:36:33 -0700 katleman Added tag jdk9-b21 for changeset 4b8db1aec2a3
Wed, 05 Jul 2017 19:47:11 +0200 duke Added tag jdk9-b21 for changeset 28dd0c7beb3c
Wed, 05 Jul 2017 19:47:10 +0200 duke Mergejdk9-b21
Wed, 05 Jul 2017 19:47:07 +0200 duke Merge
Thu, 26 Jun 2014 12:51:49 -0700 katleman Added tag jdk9-b20 for changeset d77065991eb8
Wed, 05 Jul 2017 19:47:04 +0200 duke Merge
Thu, 26 Jun 2014 12:51:36 -0700 katleman Added tag jdk9-b20 for changeset 02490297734b
Wed, 05 Jul 2017 19:47:01 +0200 duke Merge
Thu, 26 Jun 2014 12:51:35 -0700 katleman Added tag jdk9-b20 for changeset 6dbc3c71c0e2
Wed, 05 Jul 2017 19:46:58 +0200 duke Merge
Thu, 26 Jun 2014 12:51:50 -0700 katleman Added tag jdk9-b20 for changeset 7fb8003ec760
Wed, 05 Jul 2017 19:46:55 +0200 duke Merge
Thu, 26 Jun 2014 12:51:17 -0700 katleman Added tag jdk9-b20 for changeset c9ca62c6a329
Wed, 05 Jul 2017 19:46:52 +0200 duke Merge
Thu, 26 Jun 2014 12:51:38 -0700 katleman Added tag jdk9-b20 for changeset 8c82c02495e7
Wed, 05 Jul 2017 19:46:49 +0200 duke Merge
Thu, 26 Jun 2014 12:51:26 -0700 katleman Added tag jdk9-b20 for changeset e9f01656f118
Thu, 26 Jun 2014 12:51:14 -0700 katleman Added tag jdk9-b20 for changeset 3abb2de3cdb3
Wed, 05 Jul 2017 19:46:41 +0200 duke Added tag jdk9-b20 for changeset 89731ae72a76
Wed, 05 Jul 2017 19:46:40 +0200 duke Mergejdk9-b20
Wed, 05 Jul 2017 19:46:37 +0200 duke Merge
Fri, 20 Jun 2014 10:15:13 -0700 lana Merge
Wed, 18 Jun 2014 10:54:24 -0700 lana Merge
Wed, 18 Jun 2014 13:51:50 +0100 mcimadamore 8043253: Slow javac compile times in JDK 8
Wed, 18 Jun 2014 10:44:16 +0200 jlahoda 8046916: Type parameter annotations don't work with multiple type parameters
Tue, 17 Jun 2014 17:33:01 +0100 vromero 8036953: Fix timing of varargs access check, per JDK-8016205
Tue, 17 Jun 2014 11:11:59 -0400 pgovereau 8038975: Access control in enhanced for
Mon, 16 Jun 2014 11:30:31 -0700 jjg 8046369: sjavac should not use javac internal API for starting javac
Thu, 12 Jun 2014 14:29:09 +0200 alundblad 8042830: A recently added Xprefer test fails on Windows
Thu, 22 May 2014 12:16:53 -0700 ksrini 8042829: [javadoc] index-file output is not sorted correctly
Thu, 19 Jun 2014 11:22:49 -0700 katleman Added tag jdk9-b19 for changeset 26e23230009a
Wed, 05 Jul 2017 19:46:31 +0200 duke Merge
Thu, 19 Jun 2014 11:22:36 -0700 katleman Added tag jdk9-b19 for changeset 9ed534348756
Wed, 05 Jul 2017 19:46:27 +0200 duke Merge
Thu, 19 Jun 2014 11:22:33 -0700 katleman Added tag jdk9-b19 for changeset 12e7286572ef
Wed, 05 Jul 2017 19:46:23 +0200 duke Merge
Fri, 20 Jun 2014 10:14:50 -0700 lana Merge
Wed, 18 Jun 2014 10:54:57 -0700 lana Merge
Tue, 17 Jun 2014 18:23:35 +0530 sundar 8047057: Add a regression test for the passing test cases from JDK-8042304
Tue, 17 Jun 2014 15:55:39 +0530 sundar 8047035: (function() "hello")() crashes in Lexer with jdk9
Tue, 17 Jun 2014 11:37:03 +0200 lagergren 8046898: Make sure that lazy compilation is the default, remove redundant "enable lazy compilation" flags, added warning message if compile logging is enabled and lazy is switched off. Verified existing test suite code coverage equivalence between lazy and eager.