log

age author description
Wed, 08 May 2019 11:59:18 +0530 jdv Merge
Tue, 07 May 2019 18:18:54 -0700 serb 8223237: Replace use of string.equals("") with isEmpty() in java.desktop
Tue, 07 May 2019 11:52:28 -0700 prr Merge
Fri, 03 May 2019 17:06:42 -0700 prr 8222819: Remove setting of headless property on MacOS from launcher code.
Thu, 02 May 2019 10:48:56 -0700 prr Merge
Tue, 30 Apr 2019 14:30:17 -0700 itakiguchi 8213232: Unix/X11 setCompositionEnableNative issue
Tue, 30 Apr 2019 04:15:31 -0700 vagarwal 8222519: ButtonDemoScreenshotTest fails randomly with "still state to be reached"
Mon, 29 Apr 2019 10:16:58 -0700 prr 8130266: Change the mechanism by which JDK loads the platform-specific GraphicsEnvironment class
Sun, 28 Apr 2019 12:34:49 +0530 psadhukhan 8222830: PIT: java/awt/Window/AlwaysOnTop/AutoTestOnTop.java listed twice in ProblemList
Fri, 26 Apr 2019 12:31:37 -0700 prr 8208179: Devanagari not shown with logical fonts on Windows after removal of Lucida Sans from JDK
Thu, 25 Apr 2019 15:18:59 -0700 serb 8222799: java.beans.Introspector uses an obsolete methods cache
Thu, 25 Apr 2019 15:15:53 -0700 serb 8214046: [macosx] Undecorated Frame does not Iconify when set to
Thu, 25 Apr 2019 15:13:36 -0700 serb 8222438: Drop of outdated logging in the com.sun.media.sound package
Thu, 25 Apr 2019 15:19:09 +0530 kaddepalli 8219914: Change the environment variable for Java Access Bridge logging to have a directory.
Wed, 24 Apr 2019 09:21:02 -0700 prr 8212701: remove sun.desktop property from launcher code
Tue, 23 Apr 2019 14:22:34 +0530 psadhukhan Merge
Mon, 22 Apr 2019 12:40:55 -0700 serb 8222789: Replace the usage of "Sun's Xinerama API" by the "XFree86's Xinerama API" on Solaris
Mon, 22 Apr 2019 12:35:30 -0700 serb 8216008: -Djavax.accessibility.assistive_technologies empty list leads to exception
Mon, 22 Apr 2019 18:54:19 -0700 itakiguchi 8212676: AWT SystemColor setting on CDE
Mon, 22 Apr 2019 17:02:51 +0530 kaddepalli 8218917: KeyEvent.getModifiers() returns inconsistent values for ALT keys
Fri, 10 May 2019 10:18:16 +0200 mbaesken 8222720: Provide extended VMWare/vSphere virtualization related info in the hs_error file on linux/windows x86_64
Tue, 14 May 2019 20:29:40 -0400 dholmes 8223810: HotSpot compile warnings from VS2017
Tue, 14 May 2019 15:09:31 -0700 skuksenko 8223921: Update SocketReadWrite benchmark
Tue, 14 May 2019 22:31:52 +0200 jwilhelm 8223917: Problemlist compiler/ciReplay/TestServerVM.java
Tue, 14 May 2019 21:36:09 +0300 dsamersoff 8223767: Shenandoah fails to build on Solaris x86_64
Tue, 14 May 2019 11:29:18 -0400 coleenp 8223657: Remove unused THREAD argument from SymbolTable functions
Tue, 14 May 2019 11:28:44 -0400 vromero 8215470: Bad EnclosingMethod attribute on classes declared in lambdas
Sun, 07 Apr 2019 09:13:17 +0200 stuefe 8221738: ErrorFile option does not handle pre-existing error files of the same name
Tue, 14 May 2019 15:36:26 +0200 tschatzl 8223018: Rename G1RemSet::*oops_into_collection_set_do methods
Tue, 14 May 2019 15:36:26 +0200 tschatzl 8200545: Improve filter for enqueued deferred cards
Tue, 14 May 2019 08:52:51 -0400 coleenp 8219459: oopDesc::is_valid() is broken
Tue, 14 May 2019 13:34:49 +0100 aefimov 8223638: Replace wildcard address with loopback or local host in tests - part 6
Tue, 14 May 2019 10:54:23 +0200 stefank 8223822: Add gc IDs in the log of gc verification
Tue, 14 May 2019 12:07:24 +0200 eosterlund 8222841: Incorrect static call stub interactions with class unloading
Tue, 14 May 2019 12:00:49 +0200 redestad 8221478: Disable VerifySharedSpaces by default
Tue, 14 May 2019 11:06:23 +0800 yzhou 8222969: Migrate RuleBasedCollatorTest to JDK Repo
Tue, 14 May 2019 02:07:13 -0700 sspitsyn 8219023: Investigate syncing JVMTI spec version with JDK version
Tue, 14 May 2019 09:25:58 +0100 clanger 8223597: jdk/nio/zipfs/ZipFSTester.java RuntimeException: CHECK_FAILED! (getAttribute.crc <entries20> failed 6af4413c vs 0 ...)
Tue, 14 May 2019 09:55:02 +0200 pliden 8222480: Implementation: JEP 351: ZGC: Uncommit Unused Memory
Tue, 14 May 2019 09:12:06 +0200 shade 8223762: Shenandoah: overflows in calculations involving heap capacity
Tue, 14 May 2019 09:12:00 +0200 shade 8223759: Shenandoah should allow arbitrarily low initial heap size
Tue, 14 May 2019 09:14:36 +0200 mbaesken 8223685: used bundled zlib on AIX by default
Fri, 10 May 2019 09:58:01 +0200 mbaesken 8223574: add more thread-related system settings info to hs_error file on AIX
Mon, 13 May 2019 20:45:03 -0700 jcbeyler 8223779: Build failure after 8223040 (Add a AsyncGetCallTrace test)
Mon, 13 May 2019 18:18:42 -0700 igerasim 8223730: URLClassLoader.findClass() can throw IndexOutOfBoundsException
Tue, 14 May 2019 08:47:13 +0800 weijun 8223063: Support CNG RSA keys
Mon, 13 May 2019 13:32:38 -0700 epavlova 8223235: [Graal] compiler/jsr292/NonInlinedCall/InvokeTest.java failed time out
Sat, 11 May 2019 13:10:24 +0200 stefank 8223637: Fix build breakage after 8223136
Thu, 14 Mar 2019 14:04:39 +0100 sgehwolf 8214796: Create a jlink plugin for stripping debug info symbols from native libraries
Thu, 25 Apr 2019 17:27:37 +0100 adinn 8221696: MappedByteBuffer.force method to specify range
Mon, 13 May 2019 17:31:23 +0100 dfuchs 8223632: Replace wildcard address with loopback or local host in tests - part 5
Mon, 13 May 2019 16:43:47 +0200 hannesw 8219060: -linksource broken with modules
Fri, 05 Apr 2019 11:52:32 +0200 stuefe 8222015: Small VM.metaspace improvements
Fri, 10 May 2019 17:47:42 -0700 aeubanks 8223667: ASAN build broken
Wed, 08 May 2019 15:36:10 -0700 jcbeyler 8223040: Add a AsyncGetCallTrace test
Fri, 10 May 2019 13:37:00 -0700 jjg 8223654: Clean up @jls references in com.sun.source
Fri, 10 May 2019 12:33:40 -0700 xuelei 8221253: TLSv1.3 may generate TLSInnerPlainText longer than 2^14+1 bytes
Fri, 10 May 2019 20:56:37 +0200 cito 8221569: JFR tool produces incorrect output when both --categories and --events are specified
Fri, 10 May 2019 11:18:45 -0400 bobv 8222533: jtreg test jdk/internal/platform/cgroup/TestCgroupMetrics.java fails on SLES12.3 linux ppc64le machine
Fri, 10 May 2019 11:15:34 -0400 bobv 8221340: [TESTBUG] TestCgroupMetrics.java fails after fix for JDK-8219562
Fri, 10 May 2019 10:30:06 -0700 dnsimon 8223531: [Graal] assert(type() == T_INT) failed: type check
Thu, 09 May 2019 10:28:29 -0700 aeubanks 8223652: Rename IPSupport.skipIfCurrentConfigurationIsInvalid() to IPSupport.throwSkippedExceptionIfNonOperational()
Sat, 11 May 2019 01:17:18 +0900 ysuenaga 8223186: HotSpot compile warnings from GCC 9
Fri, 10 May 2019 15:34:17 +0100 aefimov 8223465: Replace wildcard address with loopback or local host in tests - part 3
Fri, 10 May 2019 09:07:53 -0400 coleenp Merge
Fri, 10 May 2019 09:05:29 -0400 coleenp 8223626: move print() functions to cpp files
Fri, 10 May 2019 09:56:20 +0200 shade 8223675: arm32 build failure after 8223136 (Move compressed oops functions to CompressedOops class)
Fri, 10 May 2019 09:55:42 +0200 shade 8223676: Minimal VM build failure after 8223136 (Move compressed oops functions to CompressedOops class)
Thu, 09 May 2019 05:04:42 -0700 rschmelter 8223617: code_size2 needs adjustments
Fri, 10 May 2019 06:31:09 +0100 clanger 8223555: Cleanups in cacerts tests
Fri, 10 May 2019 09:39:49 +0800 weijun 8200400: Restrict Sasl mechanisms
Thu, 09 May 2019 18:38:42 -0700 xliu 8223537: testlibrary_tests/ctw/ClassesListTest.java fails with Agent timeout frequently
Thu, 09 May 2019 18:42:07 -0400 dholmes 8222292: runtime/exceptionMsgs/ArrayIndexOutOfBoundsException/ArrayIndexOutOfBoundsExceptionTest.java timeout but test passed
Thu, 09 May 2019 16:34:20 -0500 gziemski 8223639: [JVMCI] jvmciCompiler.cpp needs to include "oops/objArrayOop.inline.hpp""
Fri, 10 May 2019 01:41:45 +0800 aoqi 8223651: Build fails with --with-jvm-features=-jfr and --disable-precompiled-headers
Fri, 10 May 2019 01:37:09 +0800 aoqi 8223599: minimal build fails after JDK-8185525
Thu, 09 May 2019 13:49:08 -0400 mullan 8191808: Configurable read timeout for CRLs
Thu, 09 May 2019 12:04:20 -0500 gziemski 8189208: Cleanup ancient argument processing code
Thu, 09 May 2019 12:56:15 -0400 aph Merge
Thu, 09 May 2019 12:52:05 -0400 aph 8223645: AArch64 build broken by fix for 8223136
Thu, 09 May 2019 09:23:31 -0700 joehw 8222991: Xerces 2.12.0: Validation
Thu, 09 May 2019 17:28:27 +0200 redestad 8223454: Reduce String concatenation shapes by folding initialLengthCoder into last mixer
Fri, 03 May 2019 14:38:58 +0200 mbaesken 8223307: enable the Stack Execution Disable flag for JDK binaries on AIX
Thu, 09 May 2019 07:33:28 -0700 erikj 8223627: jdk-13+20 bundle name contains null instead of ea
Thu, 09 May 2019 10:04:33 -0400 vromero 8222251: preflow visitor is not visiting lambda expressions
Thu, 09 May 2019 14:23:52 +0100 dfuchs 8223573: Replace wildcard address with loopback or local host in tests - part 4
Thu, 09 May 2019 14:28:30 +0200 stefank 8223624: Cleanup includes of universe.hpp
Thu, 09 May 2019 14:26:52 +0200 stefank 8223623: Move oopFactory function definitions out of oopFactory.hpp
Thu, 09 May 2019 14:26:03 +0200 stefank 8223622: Move Universe usage out of memAllocator.hpp
Thu, 09 May 2019 14:26:03 +0200 stefank 8223621: Move Universe usage out of oopRecorder.hpp
Thu, 09 May 2019 14:26:03 +0200 stefank 8223620: Move IsGCActiveMark implementation out of header
Thu, 09 May 2019 14:26:03 +0200 stefank 8223619: Move VerifyOption out of Universe
Thu, 09 May 2019 14:26:03 +0200 stefank 8223136: Move compressed oops functions to CompressedOops class
Thu, 09 May 2019 07:21:32 -0400 gadams 8042215: javax/management/remote/mandatory/connection/ReconnectTest.java NoSuchObjectException no such object in table
Thu, 09 May 2019 11:58:26 +0200 jlahoda 8221759: Crash when completing \"java.io.File.path\"
Wed, 08 May 2019 09:50:23 +0000 pli 8223427: [TESTBUG] Disable JTReg Shenandoah tests when Graal is enabled
Wed, 08 May 2019 20:28:56 -0700 jcbeyler 8223441: HeapMonitorStatArrayCorrectnessTest fails due to sampling determinism
Thu, 09 May 2019 03:11:56 +0200 jwilhelm Added tag jdk-13+20 for changeset 6ccc7cd7931e
Thu, 09 May 2019 08:49:31 +0800 weijun 8222987: sun/security/tools/keytool/PSS.java times out on Solaris-SPARC
Wed, 08 May 2019 16:47:53 -0700 kvn 8223380: [Graal] compiler/c2/Test8062950.java failed with time out.
Wed, 08 May 2019 16:42:52 -0700 kvn 8223539: compiler/graalunit/HotspotTest.java hotspot.test.CheckGraalIntrinsics AssertionError: found plugins for intrinsics
Wed, 08 May 2019 23:53:24 +0200 shade 8223589: Build failures after JDK-8223534 (add back fixed test_markOop.cpp)
Tue, 16 Apr 2019 13:06:23 -0700 aeubanks 8220673: Add test library support for determining platform IP support
Wed, 08 May 2019 12:45:02 -0700 naoto 8221432: Upgrade CLDR to Version 35.1
Wed, 08 May 2019 21:32:38 +0200 shade 8223583: Build failure after JDK-8223567 (Rename ShenandoahBrooksPointer to ShenandoahForwarding)
Wed, 08 May 2019 11:56:19 -0700 epavlova 8223414: ProblemList java/lang/ref/ReachabilityFenceTest.java when running in Graal as JIT modejdk-13+20
Wed, 08 May 2019 20:45:30 +0200 rkennke 8223567: Rename ShenandoahBrooksPointer to ShenandoahForwarding
Wed, 08 May 2019 13:22:27 -0400 coleenp 8223534: add back fixed test_markOop.cpp
Wed, 08 May 2019 11:11:50 -0500 gziemski 8185525: Add JFR event for DictionarySizes
Wed, 08 May 2019 20:57:12 +0800 aoqi 8222926: Shenandoah build fails with --with-jvm-features=-compiler1
Wed, 08 May 2019 10:10:54 -0400 vromero 8222949: add condy support to javac's pool API
Wed, 08 May 2019 10:08:11 -0400 hseigel 8217846: [Graal] vmTestbase/nsk/jdi/VirtualMachine/instanceCounts/instancecounts003/instancecounts003.java crash
Wed, 08 May 2019 09:38:58 -0400 tonyp 8223397: gc+promotion log lines are missing the GC id
Wed, 08 May 2019 18:05:28 +0530 rraghavan 8223445: compiler/intrinsics/mathexact/LongMulOverflowTest.java java timeout
Wed, 08 May 2019 14:27:14 +0200 shade 8223570: Shenandoah needs to acquire lock before CLDG::clear_claimed_marks
Wed, 08 May 2019 07:56:49 -0400 gadams 8223416: Exclude javax/management/monitor/DerivedGaugeMonitorTest.java until JDK-8042211 is fixed.
Wed, 08 May 2019 06:40:45 -0400 coleenp 8223391: Unsynchronized iteration of ClassLoaderDataGraph
Wed, 08 May 2019 11:59:14 +0200 rkennke 8223244: Fix usage of ARRAYCOPY_DISJOINT decorator
Wed, 08 May 2019 08:15:04 +0100 alanb 8223353: (ch) Change channel close implementation to not wait for I/O threads
Tue, 07 May 2019 18:24:36 -0400 coleenp 8223481: gtest/GTestWrapper.java failed due to "assert(ret == 0) failed: sem_post failed; error='Invalid argument' (errno=EINVAL)"