annotate test/ProblemList.txt @ 4575:40037f37550d

7109063: JSR 292: fix for 7085860 is incomplete Reviewed-by: iveresov, alanb, jrose
author twisti
date Mon, 16 Jan 2012 01:48:07 -0800
parents ee50c18ede0d
children 5470f5450566 ffe93c01d5be
rev   line source
ohair@1821 1 ###########################################################################
ohair@1821 2 #
ohair@3909 3 # Copyright (c) 2009, 2011, Oracle and/or its affiliates. All rights reserved.
ohair@1821 4 # DO NOT ALTER OR REMOVE COPYRIGHT NOTICES OR THIS FILE HEADER.
ohair@1821 5 #
ohair@1821 6 # This code is free software; you can redistribute it and/or modify it
ohair@1821 7 # under the terms of the GNU General Public License version 2 only, as
ohair@2362 8 # published by the Free Software Foundation. Oracle designates this
ohair@1821 9 # particular file as subject to the "Classpath" exception as provided
ohair@2362 10 # by Oracle in the LICENSE file that accompanied this code.
ohair@1821 11 #
ohair@1821 12 # This code is distributed in the hope that it will be useful, but WITHOUT
ohair@1821 13 # ANY WARRANTY; without even the implied warranty of MERCHANTABILITY or
ohair@1821 14 # FITNESS FOR A PARTICULAR PURPOSE. See the GNU General Public License
ohair@1821 15 # version 2 for more details (a copy is included in the LICENSE file that
ohair@1821 16 # accompanied this code).
ohair@1821 17 #
ohair@1821 18 # You should have received a copy of the GNU General Public License version
ohair@1821 19 # 2 along with this work; if not, write to the Free Software Foundation,
ohair@1821 20 # Inc., 51 Franklin St, Fifth Floor, Boston, MA 02110-1301 USA.
ohair@1821 21 #
ohair@2362 22 # Please contact Oracle, 500 Oracle Parkway, Redwood Shores, CA 94065 USA
ohair@2362 23 # or visit www.oracle.com if you need additional information or have any
ohair@2362 24 # questions.
ohair@1821 25 #
ohair@1821 26 ###########################################################################
ohair@1821 27 #
ohair@1821 28 # List of tests that should not be run by test/Makefile, for various reasons:
ohair@1821 29 # 1. Does not run with jtreg -samevm mode
ohair@1821 30 # 2. Causes problems in jtreg -samevm mode for jtreg or tests that follow it
ohair@1821 31 # 3. The test is too slow or consumes too many system resources
ohair@1821 32 # 4. The test fails when run on any official build systems
ohair@1821 33 #
ohair@1821 34 # It is possible that a test being on this list is a mistake, and that some
ohair@1821 35 # other test in samevm mode caused tests to fail, mistakes happen.
ohair@1821 36 #
ohair@1821 37 # Tests marked @ignore are not run by test/Makefile, but harmless to be listed.
ohair@1821 38 #
ohair@1821 39 # Tests that explicitly state "@run main/othervm ...", and are not listed here,
ohair@1821 40 # will be run in the same batch as the samevm tests.
ohair@1821 41 #
ohair@1821 42 # Shell tests are othervm by default.
ohair@1821 43 #
mduigou@3589 44 # List items are testnames followed by labels, all MUST BE commented
ohair@1821 45 # as to why they are here and use a label:
ohair@1821 46 # generic-all Problems on all platforms
ohair@1821 47 # generic-ARCH Where ARCH is one of: sparc, sparcv9, x64, i586, etc.
ohair@1821 48 # OSNAME-all Where OSNAME is one of: solaris, linux, windows
ohair@1821 49 # OSNAME-ARCH Specific on to one OSNAME and ARCH, e.g. solaris-x64
ohair@1821 50 # OSNAME-REV Specific on to one OSNAME and REV, e.g. solaris-5.8
mduigou@3589 51 #
ohair@1821 52 # More than one label is allowed but must be on the same line.
ohair@1821 53 #
ohair@1821 54 #############################################################################
ohair@1821 55 #
ohair@1821 56 # Running the tests:
ohair@1821 57 # cd test && make JT_HOME=jtreg_home PRODUCT_HOME=jdk_home jdk_all
ohair@1821 58 # Or instead of jdk_all, use any of the jdk_* targets.
ohair@1821 59 #
ohair@1821 60 # Samevm Notes:
ohair@1821 61 # * Although some tests may have only been seen to fail on some platforms,
ohair@1821 62 # they might be flagged as 'generic-all' because the problem they have
ohair@1821 63 # could cause hidden slowdowns on other platforms.
ohair@1821 64 # Most samevm problems will be generic-all, but windows usually dislikes
ohair@1821 65 # them the most.
ohair@1821 66 # Address already in use or connection errors indicate a generic port issue.
ohair@1821 67 # (this is not necessarily a samevm issue, but an issue for running the tests
ohair@1821 68 # on shared machines, two people or two test runs will collide).
ohair@1821 69 # * Samevm problem (windows in particular) is not closing all input/output
ohair@1821 70 # * Samevm problem when a test calls setSecurityManager()
ohair@1821 71 # * Samevm problem with setHttps*() is used? (not exactly sure here)
ohair@1821 72 # * Samevm problem when stuffing system properties with non Strings or anything
ohair@1821 73 # * Samevm problem when changing vm settings, or registering any vm actions
ohair@1821 74 # * Samevm problems with deleteOnExit(), if it must happen at end of test
ohair@1821 75 # * Samevm problems with URLClassLoader? (no details here)
ohair@1821 76 # * Samevm problems with dependence on predictable GC or finalizations
ohair@1821 77 #
ohair@1821 78 # Any of the above problems may mean the test needs to be flagged as "othervm".
ohair@1821 79 #
ohair@1821 80 #############################################################################
ohair@1821 81 #
ohair@1821 82 # Fixing the tests:
ohair@1821 83 #
ohair@1821 84 # Some tests just may need to be run with "othervm", and that can easily be
ohair@1821 85 # done my adding a @run line (or modifying any existing @run):
ohair@1821 86 # @run main/othervm NameOfMainClass
ohair@1821 87 # Make sure this @run follows any use of @library.
ohair@1821 88 # Otherwise, if the test is a samevm possibility, make sure the test is
ohair@1821 89 # cleaning up after itself, closing all streams, deleting temp files, etc.
ohair@1821 90 #
ohair@1821 91 # Keep in mind that the bug could be in many places, and even different per
ohair@1821 92 # platform, it could be a bug in any one of:
ohair@1821 93 # - the testcase
ohair@1821 94 # - the jdk (jdk classes, native code, or hotspot)
ohair@1821 95 # - the native compiler
ohair@1821 96 # - the javac compiler
ohair@1821 97 # - the OS (depends on what the testcase does)
ohair@1821 98 #
ohair@1821 99 # If you managed to really fix one of these tests, here is how you can
ohair@1821 100 # remove tests from this list:
ohair@1821 101 # 1. Make sure test passes on all platforms with samevm, or mark it othervm
ohair@1821 102 # 2. Make sure test passes on all platforms when run with it's entire group
ohair@1821 103 # 3. Make sure both VMs are tested, -server and -client, if possible
ohair@1821 104 # 4. Make sure you try the -d64 option on Solaris
ohair@1821 105 # 5. Use a tool like JPRT or something to verify these results
ohair@1821 106 # 6. Delete lines in this file, include the changes with your test changes
ohair@1821 107 #
ohair@1821 108 # You may need to repeat your testing 2 or even 3 times to verify good
ohair@1821 109 # results, some of these samevm failures are not very predictable.
ohair@1821 110 #
ohair@1821 111 #############################################################################
ohair@1821 112
ohair@1821 113 ############################################################################
ohair@1821 114
ohair@1821 115 # jdk_awt
ohair@1821 116
ohair@1821 117 # None of the awt tests are using samevm, might not be worth the effort due
ohair@1821 118 # to the vm overhead not being enough to make a difference.
ohair@1821 119 # In general, the awt tests are problematic with or without samevm, and there
ohair@1821 120 # are issues with using a Xvfb display.
ohair@1821 121
ohair@1821 122 # Fails on solaris sparc, timedout? in othervm mode
ohair@1821 123 java/awt/event/MouseEvent/AcceptExtraButton/AcceptExtraButton.java generic-all
ohair@1821 124
ohair@1821 125 # Causes hang in samevm mode??? Solaris 11 i586
ohair@1821 126 java/awt/FullScreen/SetFSWindow/FSFrame.java generic-all
ohair@1821 127
ohair@1821 128 # Fails on solaris 11 i586, -client, in othervm mode not sure why
ohair@1821 129 java/awt/Component/PrintAllXcheckJNI/PrintAllXcheckJNI.java generic-all
ohair@1821 130 java/awt/Focus/CloseDialogActivateOwnerTest/CloseDialogActivateOwnerTest.java generic-all
ohair@1821 131 java/awt/FontClass/FontAccess.java generic-all
ohair@1821 132 java/awt/Mixing/HWDisappear.java generic-all
ohair@1821 133 java/awt/Mixing/MixingInHwPanel.java generic-all
ohair@1821 134 java/awt/Mouse/MaximizedFrameTest/MaximizedFrameTest.html generic-all
ohair@1821 135 java/awt/Robot/AcceptExtraMouseButtons/AcceptExtraMouseButtons.java generic-all
ohair@1821 136 java/awt/Toolkit/SecurityTest/SecurityTest2.java generic-all
ohair@1821 137 java/awt/image/mlib/MlibOpsTest.java generic-all
ohair@1821 138
ohair@1821 139 # Fails on windows, othervm mode, various errors
ohair@1821 140 java/awt/Focus/NonFocusableWindowTest/NonfocusableOwnerTest.java generic-all
ohair@1821 141 java/awt/Focus/OwnedWindowFocusIMECrashTest/OwnedWindowFocusIMECrashTest.java generic-all
ohair@1821 142 java/awt/FullScreen/NoResizeEventOnDMChangeTest/NoResizeEventOnDMChangeTest.java generic-all
ohair@1821 143 java/awt/Mouse/MouseModifiersUnitTest/MouseModifiersUnitTest_Standard.java generic-all
ohair@1821 144 java/awt/event/KeyEvent/KeyTyped/CtrlASCII.html generic-all
ohair@1821 145 java/awt/font/Threads/FontThread.java generic-all
ohair@1821 146 java/awt/print/PrinterJob/PrtException.java generic-all
ohair@1821 147
ohair@1821 148 # Fails with windows X64, othervm, -server
ohair@1821 149 com/sun/awt/Translucency/WindowOpacity.java generic-all
ohair@1821 150 java/awt/EventDispatchThread/HandleExceptionOnEDT/HandleExceptionOnEDT.java generic-all
ohair@1821 151 java/awt/EventDispatchThread/LoopRobustness/LoopRobustness.html generic-all
ohair@1821 152 java/awt/Focus/AppletInitialFocusTest/AppletInitialFocusTest1.html generic-all
ohair@1821 153 java/awt/Focus/FocusEmbeddedFrameTest/FocusEmbeddedFrameTest.java generic-all
ohair@1821 154 java/awt/Frame/LayoutOnMaximizeTest/LayoutOnMaximizeTest.java generic-all
ohair@1821 155 java/awt/FullScreen/TranslucentWindow/TranslucentWindow.java generic-all
ohair@1821 156 java/awt/Mixing/MixingOnShrinkingHWButton.java generic-all
ohair@1821 157 java/awt/Mouse/MouseModifiersUnitTest/ExtraButtonDrag.java generic-all
ohair@1821 158
ohair@1821 159 ############################################################################
ohair@1821 160
ohair@1821 161 # jdk_beans
ohair@1821 162
ohair@1821 163 # A large set of the beans tests set the security manager, which would seem
ohair@1821 164 # to indicate that a large number of them should be "othervm", yet are all
ohair@1821 165 # very small tests and could greatly benefit from a samevm test run.
ohair@1821 166 # So a large batch of beans tests are currently run with othervm mode.
ohair@1821 167
ohair@2812 168 # Filed 6986807
ohair@2812 169 java/beans/Introspector/TestTypeResolver.java generic-all
ohair@2812 170
ohair@2812 171 # Filed 6986813
ohair@2812 172 java/beans/Introspector/memory/Test4508780.java generic-all
ohair@2812 173
ohair@1821 174 # Linux, some kind of problems with X11 display
ohair@1821 175 java/beans/PropertyChangeSupport/Test4682386.java generic-all
ohair@1821 176 java/beans/PropertyChangeSupport/TestSynchronization.java generic-all
ohair@1821 177 java/beans/Statement/Test4653179.java generic-all
ohair@1821 178
ohair@1821 179 # Runs REALLY slow on Solaris sparc for some reason, both -client and -server
ohair@1821 180 java/beans/XMLEncoder/Test4625418.java solaris-sparc
ohair@1821 181
ohair@1821 182 # Problems with samevm and setting security manager (speculation partially)
ohair@1821 183 java/beans/Introspector/4168475/Test4168475.java generic-all
ohair@1821 184 java/beans/Introspector/4520754/Test4520754.java generic-all
ohair@1821 185 java/beans/Introspector/6380849/TestBeanInfo.java generic-all
ohair@1821 186 java/beans/Introspector/Test4144543.java generic-all
ohair@1821 187
ohair@1821 188 # Failed to call method solaris-sparc???
ohair@1821 189 java/beans/EventHandler/Test6788531.java generic-all
ohair@1821 190
ohair@1821 191 # Jar or class not found???
ohair@1821 192 java/beans/XMLEncoder/6329581/Test6329581.java generic-all
ohair@1821 193
ohair@1821 194 ############################################################################
ohair@1821 195
ohair@1821 196 # jdk_lang
ohair@1821 197
ohair@1821 198 # Times out on solaris 10 sparc
ohair@1821 199 java/lang/ClassLoader/Assert.java generic-all
ohair@1821 200
ohair@1821 201 # Solaris sparc, samevm, java.lang.Exception: Read from closed pipe hangs
ohair@1821 202 java/lang/Runtime/exec/SleepyCat.java generic-all
ohair@1821 203
ohair@1821 204 # Times out on solaris sparc -server
ohair@1821 205 java/lang/ThreadLocal/MemoryLeak.java solaris-all
ohair@1821 206
ohair@1821 207 # Windows X64, RuntimeException: MyThread expected to have RUNNABLE but got WAITING
ohair@1821 208 java/lang/Thread/ThreadStateTest.java generic-all
ohair@1821 209
ohair@1821 210 ############################################################################
ohair@1821 211
ohair@1821 212 # jdk_management
ohair@1821 213
ohair@2500 214 # Failing, bug was filed: 6959636
ohair@2500 215 javax/management/loading/LibraryLoader/LibraryLoaderTest.java generic-all
ohair@2500 216
ohair@2402 217 # Access denied messages on windows/mks, filed 6954450
ohair@2402 218 sun/management/jmxremote/bootstrap/RmiSslNoKeyStoreTest.sh windows-all
ohair@2402 219
ohair@2203 220 # Fails on linux: KO: StringMonitor notification missed or not emitted
ohair@2203 221 javax/management/monitor/NonComparableAttributeValueTest.java generic-all
ohair@2203 222
ohair@2203 223 # Port conflict? Fails with communication error
ohair@2203 224 sun/management/jmxremote/bootstrap/PasswordFilePermissionTest.sh generic-all
ohair@2203 225
ohair@2017 226 # Fails on Windows 2000, Test failed for iiop java.lang.NullPointerException
ohair@2017 227 # at org.omg.stub.javax.management.remote.rmi._RMIConnectionImpl_Tie._invoke(Unknown Source)
ohair@2017 228 # at com.sun.corba.se.impl.protocol.CorbaServerRequestDispatcherImpl.dispatchToServant(CorbaServerRequestDispatcherImpl.java:653)
ohair@2017 229 javax/management/remote/mandatory/connection/ReconnectTest.java generic-all
ohair@2017 230
ohair@1821 231 # Solaris 10 sparc, NPE from org.omg.stub.javax.management.remote.rmi._RMIConnectionImpl_Tie._invoke
ohair@1821 232 javax/management/remote/mandatory/threads/ExecutorTest.java generic-all
ohair@1821 233
ohair@1821 234 # Linux 32bit Fedora 9, IllegalStateException
ohair@1821 235 javax/management/monitor/RuntimeExceptionTest.java generic-all
ohair@1821 236
mduigou@3589 237 # Problems with rmi connection, othervm
ohair@1821 238 javax/management/remote/mandatory/subjectDelegation/SubjectDelegation2Test.java generic-all
ohair@1821 239
ohair@1821 240 # Fails with port already in use
ohair@1821 241 sun/management/jmxremote/bootstrap/SSLConfigFilePermissionTest.sh generic-all
ohair@1821 242
ohair@1821 243 # Fails with port already in use
ohair@1821 244 sun/management/jmxremote/bootstrap/RmiRegistrySslTest.sh generic-all
ohair@1821 245
ohair@1821 246 # Windows, connection can't last that long
ohair@1821 247 javax/management/eventService/LeaseTest.java generic-all
ohair@1821 248
ohair@1821 249 # Linux othervm, X64, java.lang.Exception: Failed: ratio=102.4027795593753
ohair@1821 250 javax/management/remote/mandatory/notif/ListenerScaleTest.java generic-all
ohair@1821 251
ohair@1821 252 # Windows run seems to have triggered a hotspot gc error (see 6801625)
ohair@1821 253 com/sun/management/HotSpotDiagnosticMXBean/DumpHeap.sh generic-all
ohair@1821 254
ohair@1821 255 # rmi problem? othervm, java.lang.reflect.UndeclaredThrowableException
ohair@1821 256 javax/management/remote/mandatory/subjectDelegation/SubjectDelegation3Test.java generic-all
ohair@1821 257
ohair@1821 258 # Linux Fedora 9 32bit NPE in rmi server somehere??? othervm
ohair@1821 259 javax/management/remote/mandatory/notif/NotificationBufferDeadlockTest.java generic-all
ohair@1821 260
ohair@1821 261 # Times out on solaris sparc, with othervm
ohair@1821 262 javax/management/eventService/AddRemoveListenerTest.java generic-all
ohair@1821 263
ohair@1821 264 # Linux i586 and x64 -server, timed out waiting for threads to expire? othervm
ohair@1821 265 javax/management/eventService/EventClientThreadTest.java generic-all
ohair@1821 266
ohair@1821 267 # Linux i586 -server, Expected to receive 20, but got 21, othervm
ohair@1821 268 # Fails on Linux X64 -server 20!=21
ohair@1821 269 javax/management/eventService/FetchingTest.java generic-all
ohair@1821 270
ohair@1821 271 # NPE on windows 2000 i586 -client and -server
ohair@1821 272 javax/management/eventService/CustomForwarderTest.java windows-all
ohair@1821 273
ohair@1821 274 # Windows i586 failure, callback did not complete
ohair@1821 275 javax/management/eventService/LeaseManagerDeadlockTest.java windows-all
ohair@1821 276
ohair@1821 277 # Port already in use
ohair@1821 278 sun/management/jmxremote/bootstrap/LocalManagementTest.sh generic-all
ohair@1821 279
ohair@1821 280 # Failed to initialize connector (also overflowing jtreg io buffers)
ohair@1821 281 sun/management/jmxremote/bootstrap/RmiBootstrapTest.sh generic-all
ohair@1821 282 sun/management/jmxremote/bootstrap/RmiSslBootstrapTest.sh generic-all
ohair@1821 283
ohair@1821 284 # Windows X64, java.lang.IllegalStateException
ohair@1821 285 javax/management/monitor/AttributeArbitraryDataTypeTest.java generic-all
ohair@1821 286
ohair@1821 287 ############################################################################
ohair@1821 288
ohair@1821 289 # jdk_math
ohair@1821 290
ohair@1821 291 ############################################################################
ohair@1821 292
ohair@1821 293 # jdk_misc
ohair@1821 294
ohair@1821 295 # Need to be marked othervm, or changed to be samevm safe
ohair@1821 296 com/sun/jndi/ldap/ReadTimeoutTest.java generic-all
ohair@1821 297 com/sun/jndi/rmi/registry/RegistryContext/UnbindIdempotent.java generic-all
ohair@1821 298
ohair@1821 299 # Need to be marked othervm, or changed to be samevm safe
ohair@1821 300 com/sun/org/apache/xml/internal/security/transforms/ClassLoaderTest.java generic-all
ohair@1821 301
ohair@1821 302 # Solaris sparc and others, exception in initializer
ohair@1821 303 javax/imageio/CachePremissionsTest/CachePermissionsTest.java generic-all
ohair@1821 304
ohair@1821 305 # Leaves file rgba_* open, fails with windows samevm
ohair@1821 306 javax/imageio/plugins/png/PngOutputTypeTest.java generic-all
ohair@1821 307
ohair@1821 308 # Suspect test.png file is left open, windows samevm problems
ohair@1821 309 javax/imageio/plugins/png/ITXtTest.java generic-all
ohair@1821 310
ohair@1821 311 # Solaris sparc and others, failed to compile testcase
ohair@1821 312 javax/imageio/metadata/DOML3Node.java generic-all
ohair@1821 313
ohair@1821 314 # One of these tests is leaving file IMGP1001.JPG open, windows samevm
ohair@1821 315 javax/imageio/plugins/jpeg/ConcurrentReadingTest.java generic-all
ohair@1821 316 javax/imageio/plugins/jpeg/ReadingInterruptionTest.java generic-all
ohair@1821 317
ohair@1821 318 # One of these files is missing a close on writer_* files, windows samevm
ohair@1821 319 javax/imageio/plugins/jpeg/ConcurrentWritingTest.java generic-all
ohair@1821 320 javax/imageio/plugins/jpeg/WritingInterruptionTest.java generic-all
ohair@1821 321
ohair@1821 322 # Leaving file test.jpg open, windows samevm
ohair@1821 323 javax/imageio/plugins/jpeg/ReadAsGrayTest.java generic-all
ohair@1821 324
ohair@1821 325 # Missing close on file wbmp*, windows samevm
ohair@1821 326 javax/imageio/plugins/wbmp/CanDecodeTest.java generic-all
ohair@1821 327
ohair@1934 328 # Failures on OpenSolaris, cannot read input files? samevm issues?
ohair@1934 329 javax/imageio/metadata/BooleanAttributes.java generic-all
ohair@1934 330 javax/imageio/plugins/bmp/BMPSubsamplingTest.java generic-all
ohair@1934 331 javax/imageio/plugins/bmp/TopDownTest.java generic-all
ohair@1934 332 javax/imageio/plugins/gif/EncodeSubImageTest.java generic-all
ohair@1934 333 javax/imageio/plugins/gif/GifTransparencyTest.java generic-all
ohair@1934 334 javax/imageio/plugins/png/GrayPngTest.java generic-all
ohair@1934 335 javax/imageio/plugins/png/ItxtUtf8Test.java generic-all
ohair@1934 336 javax/imageio/plugins/png/MergeStdCommentTest.java generic-all
ohair@1934 337 javax/imageio/plugins/png/ShortHistogramTest.java generic-all
ohair@1934 338 javax/imageio/plugins/shared/BitDepth.java generic-all
ohair@1934 339
ohair@1821 340 # Exclude all javax/print tests, even if they passed, they may need samevm work
ohair@1821 341
ohair@1821 342 # Times out on solaris-sparc, sparcv9, x64 -server, some on i586 -client
ohair@1821 343 javax/print/attribute/autosense/PrintAutoSenseData.java generic-all
ohair@1821 344 javax/print/attribute/Chroma.java generic-all
ohair@1821 345 javax/print/attribute/CollateAttr.java generic-all
ohair@1821 346 javax/print/attribute/PSCopiesFlavorTest.java generic-all
ohair@1821 347 javax/print/LookupServices.java generic-all
ohair@1821 348 javax/print/TestRaceCond.java generic-all
ohair@1821 349
ohair@1821 350 # These tests really require a printer (might all be windows only tests?)
ohair@1821 351 javax/print/CheckDupFlavor.java generic-all
ohair@1821 352 javax/print/PrintSE/PrintSE.sh generic-all
ohair@1821 353 javax/print/attribute/ChromaticityValues.java generic-all
ohair@1821 354 javax/print/attribute/GetCopiesSupported.java generic-all
ohair@1821 355 javax/print/attribute/SidesPageRangesTest.java generic-all
ohair@1821 356 javax/print/attribute/SupportedPrintableAreas.java generic-all
jgodinez@2043 357 javax/print/attribute/AttributeTest.java generic-all
ohair@1821 358
ohair@1821 359 # Only print test left, excluding just because all print tests have been
ohair@1821 360 javax/print/attribute/MediaMappingsTest.java generic-all
ohair@1821 361
ohair@1821 362 ############################################################################
ohair@1821 363
ohair@1821 364 # jdk_net
ohair@1821 365
ohair@1821 366 ############################################################################
ohair@1821 367
alanb@2546 368 # jdk_io
alanb@2546 369
alanb@2546 370 # 6962637
alanb@2546 371 java/io/File/MaxPathLength.java windows-all
alanb@2546 372
alanb@2546 373 ############################################################################
alanb@2546 374
ohair@1821 375 # jdk_nio
ohair@1821 376
alanb@2546 377 # 6963118
alanb@2546 378 java/nio/channels/Selector/Wakeup.java windows-all
ohair@2203 379
ohair@1821 380 ############################################################################
ohair@1821 381
ohair@1821 382 # jdk_rmi
ohair@1821 383
ohair@1821 384 # Port already in use, fails on sparc, othervm
ohair@1821 385 java/rmi/reliability/benchmark/runRmiBench.sh generic-all
ohair@1821 386
ohair@1821 387 # Already in use port issues? othervm solaris
ohair@1821 388 java/rmi/activation/rmidViaInheritedChannel/InheritedChannelNotServerSocket.java generic-all
ohair@1821 389 java/rmi/activation/rmidViaInheritedChannel/RmidViaInheritedChannel.java generic-all
ohair@1821 390
mchung@3405 391 java/rmi/transport/rapidExportUnexport/RapidExportUnexport.java generic-all
mchung@3405 392 java/rmi/transport/dgcDeadLock/TestImpl_Stub.java generic-all
mchung@3405 393
ohair@1821 394 # Address already in use, othervm mode, solaris
ohair@1821 395 java/rmi/activation/Activatable/elucidateNoSuchMethod/ElucidateNoSuchMethod.java generic-all
ohair@1821 396 java/rmi/activation/Activatable/forceLogSnapshot/ForceLogSnapshot.java generic-all
ohair@1821 397
ohair@1821 398 # Registry already running on port, solaris
ohair@1821 399 java/rmi/Naming/legalRegistryNames/LegalRegistryNames.java generic-all
ohair@1821 400
ohair@1821 401 # Fails on Linux 32 and 64bit -server?, impl not garbage collected???
ohair@1821 402 java/rmi/transport/pinLastArguments/PinLastArguments.java generic-all
ohair@1821 403
ohair@1821 404 # Times out on solaris sparc
ohair@1821 405 java/rmi/server/RemoteServer/AddrInUse.java generic-all
ohair@1821 406
ohair@1821 407 # Connection error on Windows i586 -server
mduigou@3589 408 # Also connection errors in othervm on Solaris 10 sparc, same port???
ohair@1821 409 sun/rmi/transport/tcp/DeadCachedConnection.java generic-all
ohair@1821 410
mduigou@3589 411 # Connection errors in othervm on Solaris 10 sparc, same port???
ohair@1821 412 java/rmi/activation/Activatable/checkActivateRef/CheckActivateRef.java generic-all
ohair@1821 413 java/rmi/activation/Activatable/checkAnnotations/CheckAnnotations.java generic-all
ohair@1821 414 java/rmi/activation/Activatable/checkImplClassLoader/CheckImplClassLoader.java generic-all
ohair@1821 415 java/rmi/activation/Activatable/checkRegisterInLog/CheckRegisterInLog.java generic-all
ohair@1821 416 java/rmi/activation/Activatable/createPrivateActivable/CreatePrivateActivatable.java generic-all
ohair@1821 417 java/rmi/activation/Activatable/downloadParameterClass/DownloadParameterClass.java generic-all
ohair@1821 418 java/rmi/activation/Activatable/extLoadedImpl/ext.sh generic-all
ohair@1821 419 java/rmi/activation/Activatable/inactiveGroup/InactiveGroup.java generic-all
ohair@1821 420 java/rmi/activation/Activatable/lookupActivationSystem/LookupActivationSystem.java generic-all
ohair@1821 421 java/rmi/activation/Activatable/nestedActivate/NestedActivate.java generic-all
ohair@1821 422 java/rmi/activation/Activatable/restartCrashedService/RestartCrashedService.java generic-all
ohair@1821 423 java/rmi/activation/Activatable/restartLatecomer/RestartLatecomer.java generic-all
ohair@1821 424 java/rmi/activation/Activatable/shutdownGracefully/ShutdownGracefully.java generic-all
ohair@1821 425 java/rmi/activation/Activatable/unregisterInactive/UnregisterInactive.java generic-all
ohair@1821 426 java/rmi/activation/ActivateFailedException/activateFails/ActivateFails.java generic-all
ohair@1821 427 java/rmi/activation/ActivationGroup/downloadActivationGroup/DownloadActivationGroup.java generic-all
ohair@1821 428 java/rmi/activation/ActivationSystem/activeGroup/IdempotentActiveGroup.java generic-all
ohair@1821 429 java/rmi/reliability/juicer/AppleUserImpl.java generic-all
ohair@1821 430 java/rmi/server/RMISocketFactory/useSocketFactory/unicast/UseCustomSocketFactory.java generic-all
ohair@1821 431 java/rmi/server/UnicastRemoteObject/keepAliveDuringCall/KeepAliveDuringCall.java generic-all
ohair@1821 432 java/rmi/transport/handshakeTimeout/HandshakeTimeout.java generic-all
ohair@1821 433 java/rmi/activation/Activatable/restartService/RestartService.java generic-all
ohair@1821 434 java/rmi/activation/ActivationSystem/modifyDescriptor/ModifyDescriptor.java generic-all
ohair@1821 435 java/rmi/activation/ActivationSystem/stubClassesPermitted/StubClassesPermitted.java generic-all
ohair@1821 436 java/rmi/activation/ActivationSystem/unregisterGroup/UnregisterGroup.java generic-all
ohair@1821 437 java/rmi/activation/CommandEnvironment/SetChildEnv.java generic-all
ohair@1821 438 java/rmi/registry/classPathCodebase/ClassPathCodebase.java generic-all
ohair@1821 439 java/rmi/registry/reexport/Reexport.java generic-all
ohair@1821 440 java/rmi/server/Unreferenced/finiteGCLatency/FiniteGCLatency.java generic-all
ohair@1821 441 java/rmi/server/Unreferenced/leaseCheckInterval/LeaseCheckInterval.java generic-all
ohair@1821 442 java/rmi/server/Unreferenced/unreferencedContext/UnreferencedContext.java generic-all
ohair@1821 443 java/rmi/server/useCustomRef/UseCustomRef.java generic-all
ohair@1821 444 java/rmi/transport/checkFQDN/CheckFQDN.java generic-all
ohair@1821 445 java/rmi/transport/checkLeaseInfoLeak/CheckLeaseLeak.java generic-all
ohair@1821 446 java/rmi/server/RMISocketFactory/useSocketFactory/activatable/UseCustomSocketFactory.java generic-all
ohair@1821 447 java/rmi/server/RMISocketFactory/useSocketFactory/registry/UseCustomSocketFactory.java generic-all
ohair@1821 448 java/rmi/server/UnicastRemoteObject/unexportObject/UnexportLeak.java generic-all
ohair@1821 449
ohair@1821 450 ############################################################################
ohair@1821 451
ohair@1821 452 # jdk_security
ohair@1821 453
ohair@2812 454 # Filed 6986868
ohair@2812 455 sun/security/tools/jarsigner/crl.sh generic-all
ohair@2812 456
ohair@2391 457 # Filed 6951285, not sure how often this fails, last was Linux 64bit Fedora 9
ohair@2391 458 sun/security/krb5/auto/MaxRetries.java generic-all
ohair@2391 459
ohair@2391 460 # Filed 6950930, fails on windows 32bit c1 and windows 64bit
ohair@2391 461 sun/security/krb5/auto/IgnoreChannelBinding.java windows-all
ohair@2391 462
ohair@2391 463 # Filed 6950931, failing on all windows systems
ohair@2391 464 sun/security/tools/jarsigner/crl.sh windows-all
ohair@2391 465
ohair@2391 466 # Filed 6950929, only seemed to fail on solaris sparcv9 (-d64)
ohair@2391 467 # Failed on Linux -server 32bit too, making generic
ohair@2391 468 sun/security/krb5/auto/BadKdc4.java generic-all
ohair@2391 469
ohair@2228 470 # Failing on Solaris i586, 3/9/2010, not a -samevm issue (jdk_security3)
ohair@2228 471 sun/security/pkcs11/Secmod/AddPrivateKey.java solaris-i586
ohair@2228 472 sun/security/pkcs11/ec/ReadCertificates.java solaris-i586
ohair@2228 473 sun/security/pkcs11/ec/ReadPKCS12.java solaris-i586
ohair@2228 474 sun/security/pkcs11/ec/TestCurves.java solaris-i586
ohair@2228 475 sun/security/pkcs11/ec/TestECDSA.java solaris-i586
ohair@2228 476 sun/security/pkcs11/ec/TestECGenSpec.java solaris-i586
ohair@2228 477 sun/security/pkcs11/ec/TestKeyFactory.java solaris-i586
ohair@2228 478
ohair@2203 479 # Unknown problem, could be a jtreg -samevm issue?
ohair@2203 480 # Error while cleaning up threads after test
ohair@2203 481 java/security/Security/SynchronizedAccess.java generic-all
ohair@2203 482
ohair@2203 483 # Failing on Solaris X64 (-d64 -server) with:
mduigou@3589 484 # GSSException: Failure unspecified at GSS-API level
ohair@2203 485 # (Mechanism level: Specified version of key is not available (44))
ohair@2203 486 sun/security/krb5/auto/BasicKrb5Test.java generic-all
ohair@2203 487
ohair@2203 488 # Solaris X86 failures, readjar.jks: No such file or directory
ohair@2203 489 sun/security/tools/keytool/readjar.sh generic-all
ohair@2203 490
ohair@2020 491 # Fails with -ea -esa, but only on Solaris sparc? Suspect it is timing out
ohair@2020 492 sun/security/tools/keytool/standard.sh generic-all
ohair@2020 493
ohair@2017 494 # Fails on Solaris 10 X64, address already in use
ohair@2017 495 sun/security/krb5/auto/HttpNegotiateServer.java generic-all
ohair@2017 496
ohair@2017 497 # Fails on almost all platforms
mduigou@3589 498 # java.lang.UnsupportedClassVersionError: SerialTest :
ohair@2017 499 # Unsupported major.minor version 51.0
ohair@2017 500 # at java.lang.ClassLoader.defineClass1(Native Method)
ohair@2017 501 sun/security/util/Oid/S11N.sh generic-all
ohair@2017 502
ohair@2017 503 # Fails on Fedora 9 32bit
mduigou@3589 504 # GSSException: Failure unspecified at GSS-API level (Mechanism level:
mduigou@3589 505 # Invalid argument (400) - Cannot find key of appropriate type to decrypt
ohair@2017 506 # AP REP - DES CBC mode with MD5)
ohair@2017 507 # at sun.security.jgss.krb5.Krb5Context.acceptSecContext(Krb5Context.java:778)
ohair@2017 508 sun/security/krb5/auto/NonMutualSpnego.java generic-all
ohair@2017 509
ohair@2017 510 # Fails on Solaris 10 sparc, GSSException: Failure unspecified at GSS-API level
ohair@2017 511 # Also fails on Windows 2000 similar way
ohair@2017 512 sun/security/krb5/auto/ok-as-delegate.sh generic-all
ohair@2017 513
ohair@2017 514 # Fails on Windows 2000, GSSException: Failure unspecified at GSS-API level
ohair@2017 515 # (Mechanism level: Request is a replay (34))
ohair@2017 516 sun/security/krb5/auto/ok-as-delegate-xrealm.sh generic-all
ohair@2017 517
ohair@2017 518 # Fails on Windows 2000, ExceptionInInitializerError
ohair@2017 519 sun/security/mscapi/AccessKeyStore.sh generic-all
ohair@2017 520
ohair@2017 521 # Fails on Solaris 10, KrbException: Additional pre-authentication required (25)
ohair@2017 522 sun/security/krb5/auto/basic.sh generic-all
ohair@2017 523
ohair@2017 524 # Fails on Fedora 9 64bit, PKCS11Exception: CKR_DEVICE_ERROR
ohair@2017 525 sun/security/pkcs11/KeyAgreement/TestDH.java generic-all
ohair@2017 526
ohair@1821 527 # Run too slow on Solaris 10 sparc
ohair@1821 528 sun/security/ssl/com/sun/net/ssl/internal/ssl/InputRecord/SSLSocketTimeoutNulls.java solaris-sparc
ohair@1821 529 sun/security/ssl/com/sun/net/ssl/internal/ssl/SSLSocketImpl/ClientTimeout.java solaris-sparc
ohair@1821 530 sun/security/ssl/com/sun/net/ssl/internal/ssl/SSLSocketImpl/ServerTimeout.java solaris-sparc
ohair@1821 531 sun/security/ssl/sun/net/www/protocol/https/HttpsURLConnection/ReadTimeout.java solaris-sparc
ohair@1821 532 sun/security/ssl/com/sun/net/ssl/internal/ssl/SSLSocketImpl/NotifyHandshakeTest.sh solaris-sparc
ohair@1821 533 sun/security/tools/keytool/AltProviderPath.sh solaris-sparc
ohair@1821 534
ohair@1821 535 # Solaris 10 sparc, passed/failed confusion? java.security.ProviderException: update() failed
ohair@1821 536 sun/security/ssl/com/sun/net/ssl/internal/ssl/SSLSocketImpl/AsyncSSLSocketClose.java generic-all
ohair@1821 537
ohair@1821 538 # Seem really slow on Solaris sparc, being excluded just for timing reasons
ohair@1821 539 sun/security/tools/jarsigner/AlgOptions.sh solaris-sparc
ohair@1821 540 sun/security/tools/jarsigner/nameclash.sh solaris-sparc
ohair@1821 541 sun/security/krb5/auto/basic.sh solaris-sparc
ohair@1821 542 sun/security/provider/PolicyFile/getinstance/getinstance.sh solaris-sparc
ohair@1821 543 sun/security/tools/jarsigner/samename.sh solaris-sparc
ohair@1821 544
ohair@1821 545 # Timed out, Solaris 10 64bit sparcv9
ohair@1821 546 com/sun/crypto/provider/Cipher/DES/PaddingTest.java generic-all
ohair@1821 547
ohair@1821 548 # Othervm, sparc, NoRouteToHostException: Cannot assign requested address
ohair@1821 549 sun/security/ssl/javax/net/ssl/NewAPIs/SessionCacheSizeTests.java generic-all
ohair@1821 550
ohair@1821 551 # Times out on windows X64, othervm mode
ohair@1821 552 # Solaris sparc and sparcv9 -server, timeout
ohair@1821 553 sun/security/ssl/javax/net/ssl/NewAPIs/SessionTimeOutTests.java generic-all
ohair@1821 554
ohair@1821 555 # Failed on solaris 10 sparc, othervm mode, "js.jks: No such file or directory"
ohair@1821 556 # Also, cannot verify signature on solaris i586 -server
ohair@1821 557 sun/security/tools/jarsigner/concise_jarsigner.sh generic-all
ohair@1821 558
ohair@1821 559 # Various failures on Linux Fedora 9 X64, othervm mode
ohair@1821 560 sun/security/ssl/javax/net/ssl/NewAPIs/SSLEngine/TestAllSuites.java generic-all
ohair@1821 561 sun/security/ssl/sanity/ciphersuites/CheckCipherSuites.java generic-all
ohair@1821 562 sun/security/tools/jarsigner/oldsig.sh generic-all
ohair@1821 563
ohair@1821 564 # Various failures on Linux Fedora 9 X64, othervm mode
ohair@1821 565 sun/security/ssl/sanity/interop/ClientJSSEServerJSSE.java generic-all
ohair@1821 566
ohair@1821 567 # Linux i586 -server, buffer too short to hold shared secret?
ohair@1821 568 com/sun/crypto/provider/KeyAgreement/DHKeyAgreement2.java generic-all
ohair@1821 569
ohair@1821 570 # Solaris sparcv9: Failed to parse input emptysubject.jks: No such file or directory
ohair@1821 571 sun/security/tools/keytool/emptysubject.sh generic-all
ohair@1821 572
ohair@1821 573 # Timeout on solaris-sparcv9 or exception thrown
ohair@1821 574 com/sun/crypto/provider/Cipher/RSA/TestOAEP_KAT.java solaris-all
ohair@1821 575
ohair@1821 576 # Leaving file open: SerialVersion.current, windows samevm
ohair@1821 577 java/security/BasicPermission/SerialVersion.java generic-all
ohair@1821 578
ohair@1821 579 # Solaris 11 i586, these all fail with samevm, need to be othervm???
ohair@1821 580 java/security/BasicPermission/NullOrEmptyName.java generic-all
ohair@1821 581
ohair@1821 582 # Suspect missing close() on file PermClass.current, windows samevm cascade
ohair@1821 583 java/security/BasicPermission/PermClass.java generic-all
ohair@1821 584
ohair@1821 585 # Solaris 11 i586, these all fail with samevm, need to be othervm???
ohair@1821 586 java/security/KeyPairGenerator/Failover.java generic-all
ohair@1821 587 java/security/Provider/DefaultPKCS11.java generic-all
ohair@1821 588 java/security/SecureClassLoader/DefineClassByteBuffer.java generic-all
ohair@1821 589 java/security/SecureRandom/GetAlgorithm.java generic-all
ohair@1821 590 java/security/Security/removing/RemoveProviders.java generic-all
ohair@1821 591 java/security/Signature/ByteBuffers.java generic-all
ohair@1821 592 java/security/Signature/NONEwithRSA.java generic-all
ohair@1821 593 java/security/Signature/SignWithOutputBuffer.java generic-all
ohair@1821 594 java/security/Signature/TestInitSignWithMyOwnRandom.java generic-all
ohair@1821 595 java/security/UnresolvedPermission/AccessorMethods.java generic-all
ohair@1821 596 java/security/UnresolvedPermission/Equals.java generic-all
ohair@1821 597
ohair@1821 598 # Fails on OpenSolaris, missing classes, slow on Solaris sparc
ohair@1821 599 sun/security/ec/TestEC.java generic-all
ohair@1821 600
ohair@1821 601 # Problems with windows x64
ohair@1821 602 sun/security/mscapi/IsSunMSCAPIAvailable.sh windows-x64
ohair@1821 603 sun/security/mscapi/RSAEncryptDecrypt.sh windows-x64
ohair@1821 604
ohair@1821 605 # Exception in test solaris-sparc -client -server, no windows
ohair@2391 606 sun/security/pkcs11/KeyGenerator/TestKeyGenerator.java solaris-all
ohair@1821 607
ohair@1821 608 # Solaris sparc client, fails to compile?
ohair@1821 609 sun/security/pkcs11/KeyStore/SecretKeysBasic.sh solaris-all
ohair@1821 610
ohair@1821 611 # Fails on OpenSolaris java.net.BindException: Address already in use
ohair@1821 612 sun/security/pkcs11/sslecc/ClientJSSEServerJSSE.java generic-all
ohair@1821 613
ohair@1821 614 # Timeout on solaris-sparcv9 or ArrayIndexOutOfBoundsException?
ohair@1821 615 sun/security/rsa/TestKeyPairGeneratorLength.java solaris-all
ohair@1821 616 sun/security/rsa/TestSignatures.java solaris-all
ohair@1821 617
ohair@1821 618 # Timeout on solaris-sparc and i586 and x64, -client and -server
ohair@1821 619 sun/security/ssl/com/sun/net/ssl/internal/ssl/InputRecord/InterruptedIO.java solaris-all
ohair@1821 620
mduigou@3589 621 # Do not seem to run on windows machines? dll missing?
ohair@1821 622 sun/security/tools/jarsigner/emptymanifest.sh windows-all
ohair@1821 623
ohair@1821 624 # Files does not exist or no encoding? solaris-sparcv9
ohair@1821 625 sun/security/tools/keytool/importreadall.sh solaris-all
ohair@1821 626 sun/security/tools/keytool/selfissued.sh solaris-all
ohair@1821 627
ohair@1821 628 ############################################################################
ohair@1821 629
ohair@1821 630 # jdk_swing (not using samevm)
ohair@1821 631
ohair@1821 632 # Fails on solaris 11 i586, with othervm
ohair@1821 633 javax/swing/JFileChooser/6570445/bug6570445.java generic-all
ohair@1821 634 javax/swing/JFileChooser/6738668/bug6738668.java generic-all
ohair@1821 635 javax/swing/JPopupMenu/6675802/bug6675802.java generic-all
ohair@1821 636 javax/swing/system/6799345/TestShutdown.java generic-all
ohair@1821 637
ohair@1821 638 ############################################################################
ohair@1821 639
ohair@1821 640 # jdk_text
ohair@1821 641
ohair@1821 642 # Linux x64 occasional errors, no details
ohair@1821 643 java/text/Bidi/Bug6665028.java linux-x64
ohair@1821 644
ohair@1821 645 ############################################################################
ohair@1821 646
ohair@1821 647 # jdk_tools
ohair@1821 648
ohair@2812 649 # Filed 6952105
ohair@2812 650 com/sun/jdi/SuspendThreadTest.java generic-all
ohair@2812 651
ohair@2812 652 # Filed 6986875
ohair@2812 653 sun/tools/jps/jps-Vvml.sh generic-all
ohair@2812 654
ohair@2812 655 # Filed 6979016
ohair@2812 656 sun/tools/jconsole/ResourceCheckTest.sh generic-all
ohair@2812 657
ohair@1821 658 ############################################################################
ohair@1821 659
ohair@1821 660 # jdk_util
ohair@1821 661
ohair@3866 662 # Filed 7027061
ohair@3866 663 java/util/Locale/Bug6989440.java windows-all
ohair@3866 664
ohair@2812 665 # Filed 6933803
ohair@2812 666 java/util/concurrent/ThreadPoolExecutor/CoreThreadTimeOut.java generic-all
ohair@2812 667
smarks@3653 668 # Filed 7022325
ohair@2203 669 # Fails with assertion error on windows
ohair@2203 670 # 11 separate stacktraces created... file reuse problem?
ohair@2203 671 java/util/zip/ZipFile/ReadLongZipFileName.java generic-all
ohair@2203 672
ohair@1821 673 # Assert error, failures, on Linux Fedora 9 -server
ohair@1821 674 # Windows samevm failure, assert error "Passed = 134, failed = 2"
ohair@1821 675 java/util/Arrays/ArrayObjectMethods.java generic-all
ohair@1821 676
ohair@1821 677 # Windows 2000, -client, samevm, java.lang.Error: Completed != 2
ohair@1821 678 java/util/concurrent/locks/ReentrantLock/CancelledLockLoops.java generic-all
ohair@1821 679
ohair@1821 680 # Windows X64, Executor Stuck samevm mode:
ohair@1821 681 java/util/concurrent/FutureTask/BlockingTaskExecutor.java generic-all
ohair@1821 682
ohair@1821 683 # Problems on windows, jmap.exe hangs? (these run jmap), fails on Solaris 10 x86
ohair@1821 684 java/util/concurrent/locks/Lock/TimedAcquireLeak.java generic-all
ohair@1821 685
ohair@1821 686 ############################################################################
ohair@1821 687