annotate test/ProblemList.txt @ 7756:9e6431b4536f

8035162: Service printing service Reviewed-by: bae, jgodinez, mschoene Contributed-by: artem.malinko@oracle.com
author mcherkas
date Mon, 14 Jul 2014 17:00:32 +0400
parents 3d28326a9e5d
children 7df5b8067d98 ec3e1e179298
rev   line source
robm@5927 1 ##########################################################################
ohair@1821 2 #
robm@5927 3 # Copyright (c) 2009, 2013, Oracle and/or its affiliates. All rights reserved.
ohair@1821 4 # DO NOT ALTER OR REMOVE COPYRIGHT NOTICES OR THIS FILE HEADER.
ohair@1821 5 #
ohair@1821 6 # This code is free software; you can redistribute it and/or modify it
ohair@1821 7 # under the terms of the GNU General Public License version 2 only, as
ohair@2362 8 # published by the Free Software Foundation. Oracle designates this
ohair@1821 9 # particular file as subject to the "Classpath" exception as provided
ohair@2362 10 # by Oracle in the LICENSE file that accompanied this code.
ohair@1821 11 #
ohair@1821 12 # This code is distributed in the hope that it will be useful, but WITHOUT
ohair@1821 13 # ANY WARRANTY; without even the implied warranty of MERCHANTABILITY or
ohair@1821 14 # FITNESS FOR A PARTICULAR PURPOSE. See the GNU General Public License
ohair@1821 15 # version 2 for more details (a copy is included in the LICENSE file that
ohair@1821 16 # accompanied this code).
ohair@1821 17 #
ohair@1821 18 # You should have received a copy of the GNU General Public License version
ohair@1821 19 # 2 along with this work; if not, write to the Free Software Foundation,
ohair@1821 20 # Inc., 51 Franklin St, Fifth Floor, Boston, MA 02110-1301 USA.
ohair@1821 21 #
ohair@2362 22 # Please contact Oracle, 500 Oracle Parkway, Redwood Shores, CA 94065 USA
ohair@2362 23 # or visit www.oracle.com if you need additional information or have any
ohair@2362 24 # questions.
ohair@1821 25 #
ohair@1821 26 ###########################################################################
ohair@1821 27 #
ohair@1821 28 # List of tests that should not be run by test/Makefile, for various reasons:
ohair@1821 29 # 1. Does not run with jtreg -samevm mode
ohair@1821 30 # 2. Causes problems in jtreg -samevm mode for jtreg or tests that follow it
ohair@1821 31 # 3. The test is too slow or consumes too many system resources
ohair@1821 32 # 4. The test fails when run on any official build systems
ohair@1821 33 #
ohair@1821 34 # It is possible that a test being on this list is a mistake, and that some
ohair@1821 35 # other test in samevm mode caused tests to fail, mistakes happen.
ohair@1821 36 #
ohair@1821 37 # Tests marked @ignore are not run by test/Makefile, but harmless to be listed.
ohair@1821 38 #
ohair@1821 39 # Tests that explicitly state "@run main/othervm ...", and are not listed here,
ohair@1821 40 # will be run in the same batch as the samevm tests.
ohair@1821 41 #
ohair@1821 42 # Shell tests are othervm by default.
ohair@1821 43 #
mduigou@3589 44 # List items are testnames followed by labels, all MUST BE commented
ohair@1821 45 # as to why they are here and use a label:
michaelm@4628 46 # generic-all Problems on all platforms
michaelm@4628 47 # generic-ARCH Where ARCH is one of: sparc, sparcv9, x64, i586, etc.
michaelm@4628 48 # OSNAME-all Where OSNAME is one of: solaris, linux, windows
michaelm@4628 49 # OSNAME-ARCH Specific on to one OSNAME and ARCH, e.g. solaris-x64
michaelm@4628 50 # OSNAME-REV Specific on to one OSNAME and REV, e.g. solaris-5.8
mduigou@3589 51 #
ohair@1821 52 # More than one label is allowed but must be on the same line.
ohair@1821 53 #
ohair@1821 54 #############################################################################
ohair@1821 55 #
ohair@1821 56 # Running the tests:
ohair@1821 57 # cd test && make JT_HOME=jtreg_home PRODUCT_HOME=jdk_home jdk_all
ohair@1821 58 # Or instead of jdk_all, use any of the jdk_* targets.
ohair@1821 59 #
ohair@1821 60 # Samevm Notes:
ohair@1821 61 # * Although some tests may have only been seen to fail on some platforms,
ohair@1821 62 # they might be flagged as 'generic-all' because the problem they have
ohair@1821 63 # could cause hidden slowdowns on other platforms.
ohair@1821 64 # Most samevm problems will be generic-all, but windows usually dislikes
ohair@1821 65 # them the most.
ohair@1821 66 # Address already in use or connection errors indicate a generic port issue.
ohair@1821 67 # (this is not necessarily a samevm issue, but an issue for running the tests
ohair@1821 68 # on shared machines, two people or two test runs will collide).
ohair@1821 69 # * Samevm problem (windows in particular) is not closing all input/output
ohair@1821 70 # * Samevm problem when a test calls setSecurityManager()
ohair@1821 71 # * Samevm problem with setHttps*() is used? (not exactly sure here)
ohair@1821 72 # * Samevm problem when stuffing system properties with non Strings or anything
ohair@1821 73 # * Samevm problem when changing vm settings, or registering any vm actions
ohair@1821 74 # * Samevm problems with deleteOnExit(), if it must happen at end of test
ohair@1821 75 # * Samevm problems with URLClassLoader? (no details here)
ohair@1821 76 # * Samevm problems with dependence on predictable GC or finalizations
ohair@1821 77 #
ohair@1821 78 # Any of the above problems may mean the test needs to be flagged as "othervm".
ohair@1821 79 #
ohair@1821 80 #############################################################################
ohair@1821 81 #
ohair@1821 82 # Fixing the tests:
ohair@1821 83 #
ohair@1821 84 # Some tests just may need to be run with "othervm", and that can easily be
ohair@1821 85 # done my adding a @run line (or modifying any existing @run):
ohair@1821 86 # @run main/othervm NameOfMainClass
ohair@1821 87 # Make sure this @run follows any use of @library.
ohair@1821 88 # Otherwise, if the test is a samevm possibility, make sure the test is
ohair@1821 89 # cleaning up after itself, closing all streams, deleting temp files, etc.
ohair@1821 90 #
ohair@1821 91 # Keep in mind that the bug could be in many places, and even different per
ohair@1821 92 # platform, it could be a bug in any one of:
ohair@1821 93 # - the testcase
ohair@1821 94 # - the jdk (jdk classes, native code, or hotspot)
ohair@1821 95 # - the native compiler
ohair@1821 96 # - the javac compiler
ohair@1821 97 # - the OS (depends on what the testcase does)
ohair@1821 98 #
ohair@1821 99 # If you managed to really fix one of these tests, here is how you can
ohair@1821 100 # remove tests from this list:
ohair@1821 101 # 1. Make sure test passes on all platforms with samevm, or mark it othervm
ohair@1821 102 # 2. Make sure test passes on all platforms when run with it's entire group
ohair@1821 103 # 3. Make sure both VMs are tested, -server and -client, if possible
ohair@1821 104 # 4. Make sure you try the -d64 option on Solaris
ohair@1821 105 # 5. Use a tool like JPRT or something to verify these results
ohair@1821 106 # 6. Delete lines in this file, include the changes with your test changes
ohair@1821 107 #
ohair@1821 108 # You may need to repeat your testing 2 or even 3 times to verify good
ohair@1821 109 # results, some of these samevm failures are not very predictable.
ohair@1821 110 #
ohair@1821 111 #############################################################################
ohair@1821 112
ohair@1821 113 ############################################################################
ohair@1821 114
ohair@1821 115 # jdk_awt
ohair@1821 116
ohair@1821 117 ############################################################################
ohair@1821 118
ohair@1821 119 # jdk_beans
ohair@1821 120
ohair@1821 121 ############################################################################
ohair@1821 122
ohair@1821 123 # jdk_lang
ohair@1821 124
alanb@4578 125 # 7123972
alanb@4578 126 java/lang/annotation/loaderLeak/Main.java generic-all
alanb@4578 127
ohair@1821 128 # Times out on solaris 10 sparc
michaelm@4628 129 java/lang/ClassLoader/Assert.java generic-all
ohair@1821 130
ohair@1821 131 # Solaris sparc, samevm, java.lang.Exception: Read from closed pipe hangs
michaelm@4628 132 java/lang/Runtime/exec/SleepyCat.java generic-all
ohair@1821 133
ohair@1821 134 # Times out on solaris sparc -server
michaelm@4628 135 java/lang/ThreadLocal/MemoryLeak.java solaris-all
ohair@1821 136
ewendeli@4824 137 # 7148492
ewendeli@4824 138 java/lang/management/MemoryMXBean/ResetPeakMemoryUsage.java generic-all
ewendeli@4824 139
ohair@1821 140 ############################################################################
ohair@1821 141
ohair@1821 142 # jdk_management
ohair@1821 143
alanb@5520 144 # Access denied messages on windows/mks, filed 6954450
alanb@5520 145 sun/management/jmxremote/bootstrap/RmiSslNoKeyStoreTest.sh windows-all
alanb@5520 146
alanb@5520 147 # Port conflict? Fails with communication error
alanb@5520 148 sun/management/jmxremote/bootstrap/PasswordFilePermissionTest.sh generic-all
alanb@5520 149
alanb@5520 150 # Fails with port already in use
alanb@5520 151 sun/management/jmxremote/bootstrap/SSLConfigFilePermissionTest.sh generic-all
alanb@5520 152
alanb@5520 153 # Fails with port already in use
alanb@5520 154 sun/management/jmxremote/bootstrap/RmiRegistrySslTest.sh generic-all
alanb@5520 155
alanb@5520 156 # Windows run seems to have triggered a hotspot gc error (see 6801625)
alanb@5520 157 com/sun/management/HotSpotDiagnosticMXBean/DumpHeap.sh generic-all
alanb@5520 158
alanb@5520 159 # Port already in use
alanb@5520 160 sun/management/jmxremote/bootstrap/LocalManagementTest.sh generic-all
alanb@5520 161
alanb@5520 162 # Failed to initialize connector (also overflowing jtreg io buffers)
alanb@5520 163 sun/management/jmxremote/bootstrap/RmiBootstrapTest.sh generic-all
alanb@5520 164 sun/management/jmxremote/bootstrap/RmiSslBootstrapTest.sh generic-all
alanb@5520 165
alanb@5520 166 # Windows X64, java.lang.IllegalStateException
alanb@5520 167 javax/management/monitor/AttributeArbitraryDataTypeTest.java generic-all
alanb@5520 168
alanb@5520 169 # 7149181
alanb@5520 170 sun/management/jmxremote/startstop/JMXStartStopTest.sh generic-all
alanb@5520 171
alanb@5520 172 ############################################################################
alanb@5520 173
alanb@5520 174 # jdk_jmx
alanb@5520 175
ohair@2500 176 # Failing, bug was filed: 6959636
michaelm@4628 177 javax/management/loading/LibraryLoader/LibraryLoaderTest.java generic-all
ohair@2500 178
ohair@2203 179 # Fails on linux: KO: StringMonitor notification missed or not emitted
michaelm@4628 180 javax/management/monitor/NonComparableAttributeValueTest.java generic-all
ohair@2203 181
ohair@2017 182 # Fails on Windows 2000, Test failed for iiop java.lang.NullPointerException
ohair@2017 183 # at org.omg.stub.javax.management.remote.rmi._RMIConnectionImpl_Tie._invoke(Unknown Source)
ohair@2017 184 # at com.sun.corba.se.impl.protocol.CorbaServerRequestDispatcherImpl.dispatchToServant(CorbaServerRequestDispatcherImpl.java:653)
ohair@2017 185 javax/management/remote/mandatory/connection/ReconnectTest.java generic-all
ohair@2017 186
ohair@1821 187 # Solaris 10 sparc, NPE from org.omg.stub.javax.management.remote.rmi._RMIConnectionImpl_Tie._invoke
michaelm@4628 188 javax/management/remote/mandatory/threads/ExecutorTest.java generic-all
ohair@1821 189
ohair@1821 190 # Linux 32bit Fedora 9, IllegalStateException
michaelm@4628 191 javax/management/monitor/RuntimeExceptionTest.java generic-all
ohair@1821 192
mduigou@3589 193 # Problems with rmi connection, othervm
ohair@1821 194 javax/management/remote/mandatory/subjectDelegation/SubjectDelegation2Test.java generic-all
ohair@1821 195
ohair@1821 196 # Windows, connection can't last that long
michaelm@4628 197 javax/management/eventService/LeaseTest.java generic-all
ohair@1821 198
ohair@1821 199 # Linux othervm, X64, java.lang.Exception: Failed: ratio=102.4027795593753
michaelm@4628 200 javax/management/remote/mandatory/notif/ListenerScaleTest.java generic-all
ohair@1821 201
ohair@1821 202 # rmi problem? othervm, java.lang.reflect.UndeclaredThrowableException
ohair@1821 203 javax/management/remote/mandatory/subjectDelegation/SubjectDelegation3Test.java generic-all
ohair@1821 204
ohair@1821 205 # Linux Fedora 9 32bit NPE in rmi server somehere??? othervm
ohair@1821 206 javax/management/remote/mandatory/notif/NotificationBufferDeadlockTest.java generic-all
ohair@1821 207
ohair@1821 208 # Times out on solaris sparc, with othervm
michaelm@4628 209 javax/management/eventService/AddRemoveListenerTest.java generic-all
ohair@1821 210
ohair@1821 211 # Linux i586 and x64 -server, timed out waiting for threads to expire? othervm
michaelm@4628 212 javax/management/eventService/EventClientThreadTest.java generic-all
ohair@1821 213
ohair@1821 214 # Linux i586 -server, Expected to receive 20, but got 21, othervm
ohair@1821 215 # Fails on Linux X64 -server 20!=21
michaelm@4628 216 javax/management/eventService/FetchingTest.java generic-all
ohair@1821 217
ohair@1821 218 # NPE on windows 2000 i586 -client and -server
michaelm@4628 219 javax/management/eventService/CustomForwarderTest.java windows-all
ohair@1821 220
ohair@1821 221 # Windows i586 failure, callback did not complete
michaelm@4628 222 javax/management/eventService/LeaseManagerDeadlockTest.java windows-all
ohair@1821 223
ohair@1821 224 ############################################################################
ohair@1821 225
ohair@1821 226 # jdk_math
ohair@1821 227
ohair@1821 228 ############################################################################
ohair@1821 229
alanb@5520 230 # jdk_other
ohair@1821 231
alanb@4578 232 # 6988950
alanb@4578 233 demo/jvmti/compiledMethodLoad/CompiledMethodLoadTest.java generic-all
alanb@4578 234
coffeys@5591 235 # 7056489
michaelm@4628 236 com/sun/jndi/ldap/ReadTimeoutTest.java generic-all
ohair@1821 237
ohair@1821 238 ############################################################################
ohair@1821 239
ohair@1821 240 # jdk_net
ohair@1821 241
khazra@4787 242 # 7122846
khazra@4787 243 java/net/MulticastSocket/NoLoopbackPackets.java macosx-all
khazra@4787 244 java/net/MulticastSocket/SetLoopbackMode.java macosx-all
khazra@4787 245
khazra@4787 246 # 7145658
khazra@4787 247 java/net/MulticastSocket/Test.java macosx-all
khazra@4787 248
khazra@4787 249 #7143960
khazra@4787 250 java/net/DatagramSocket/SendDatagramToBadAddress.java macosx-all
khazra@4787 251
ewendeli@4824 252 # 7148829
ewendeli@4824 253 sun/net/InetAddress/nameservice/simple/CacheTest.java generic-all
ewendeli@4824 254 sun/net/InetAddress/nameservice/simple/DefaultCaching.java generic-all
ewendeli@4824 255
michaelm@4971 256 # 7161936
michaelm@4971 257 sun/net/www/http/HttpClient/RetryPost.sh macosx-all
michaelm@4971 258 sun/net/www/protocol/http/B5017051.java macosx-all
michaelm@4971 259 sun/net/www/protocol/http/B6369510.java macosx-all
michaelm@4971 260 sun/net/www/protocol/http/StreamingOutputStream.java macosx-all
michaelm@4971 261 sun/net/www/protocol/http/UserAuth.java macosx-all
michaelm@4971 262 sun/net/www/protocol/http/UserCookie.java macosx-all
michaelm@4971 263
michaelm@4971 264 # 7162118
michaelm@4971 265 java/net/CookieHandler/CookieManagerTest.java macosx-all
michaelm@4971 266
michaelm@4971 267 # JPRT needs to set 127.0.0.1 in proxy bypass list
michaelm@4971 268 java/net/URLClassLoader/closetest/CloseTest.java macosx-all
michaelm@4971 269
ohair@1821 270 ############################################################################
ohair@1821 271
alanb@2546 272 # jdk_io
alanb@2546 273
alanb@2546 274 # 6962637
alanb@2546 275 java/io/File/MaxPathLength.java windows-all
alanb@2546 276
coffeys@5969 277 # 7162111 - these tests need to be updated to run headless
coffeys@5969 278 java/io/Serializable/resolveClass/deserializeButton/run.sh macosx-all
coffeys@5969 279 java/io/Serializable/serialver/classpath/run.sh macosx-all
coffeys@5969 280 java/io/Serializable/serialver/nested/run.sh macosx-all
coffeys@5969 281
alanb@2546 282 ############################################################################
alanb@2546 283
ohair@1821 284 # jdk_nio
ohair@1821 285
alanb@2546 286 # 6963118
alanb@2546 287 java/nio/channels/Selector/Wakeup.java windows-all
ohair@2203 288
alanb@4723 289 # 7133499, 7133497
alanb@4723 290 java/nio/channels/AsyncCloseAndInterrupt.java macosx-all
alanb@4723 291 java/nio/channels/AsynchronousFileChannel/Lock.java macosx-all
alanb@4723 292 java/nio/channels/FileChannel/Transfer.java macosx-all
alanb@4723 293
alanb@4734 294 # 7141822
alanb@4734 295 java/nio/channels/DatagramChannel/ChangingAddress.java macosx-all
alanb@4734 296
alanb@4734 297 # 7132677
alanb@4734 298 java/nio/channels/Selector/OutOfBand.java macosx-all
alanb@4734 299
ohair@1821 300 ############################################################################
ohair@1821 301
ohair@1821 302 # jdk_rmi
ohair@1821 303
ewendeli@4824 304 # 7146541
ewendeli@4824 305 java/rmi/transport/rapidExportUnexport/RapidExportUnexport.java linux-all
ewendeli@4824 306
smarks@5957 307 # 7190106
smarks@5957 308 java/rmi/reliability/benchmark/runRmiBench.sh generic-all
ohair@1821 309
smarks@5957 310 # 7191877
smarks@5957 311 java/rmi/transport/checkLeaseInfoLeak/CheckLeaseLeak.java generic-all
ohair@1821 312
smarks@5957 313 # 7195095
smarks@5957 314 sun/rmi/transport/proxy/EagerHttpFallback.java generic-all
michaelm@4971 315
ohair@1821 316 ############################################################################
ohair@1821 317
ohair@1821 318 # jdk_security
ohair@1821 319
ohair@2228 320 # Failing on Solaris i586, 3/9/2010, not a -samevm issue (jdk_security3)
michaelm@4628 321 sun/security/pkcs11/Secmod/AddPrivateKey.java solaris-i586
michaelm@4628 322 sun/security/pkcs11/ec/ReadCertificates.java solaris-i586
michaelm@4628 323 sun/security/pkcs11/ec/ReadPKCS12.java solaris-i586
michaelm@4628 324 sun/security/pkcs11/ec/TestCurves.java solaris-i586
michaelm@4628 325 sun/security/pkcs11/ec/TestECDSA.java solaris-i586
juh@5910 326 #sun/security/pkcs11/ec/TestECGenSpec.java solaris-i586
juh@5910 327 #sun/security/pkcs11/ec/TestKeyFactory.java solaris-i586
juh@5910 328 sun/security/pkcs11/sslecc/ClientJSSEServerJSSE.java generic-all
ohair@2228 329
juh@5910 330 # Directly references PKCS11 class
juh@5910 331 sun/security/pkcs11/Provider/Absolute.java windows-x64
ohair@2203 332
juh@5910 333 # Fails on Fedora 9/Ubuntu 10.04 64bit, PKCS11Exception: CKR_DEVICE_ERROR
michaelm@4628 334 sun/security/pkcs11/KeyAgreement/TestDH.java generic-all
ohair@2017 335
ohair@1821 336 # Run too slow on Solaris 10 sparc
ohair@1821 337 sun/security/ssl/com/sun/net/ssl/internal/ssl/InputRecord/SSLSocketTimeoutNulls.java solaris-sparc
ohair@1821 338 sun/security/ssl/com/sun/net/ssl/internal/ssl/SSLSocketImpl/ClientTimeout.java solaris-sparc
ohair@1821 339 sun/security/ssl/com/sun/net/ssl/internal/ssl/SSLSocketImpl/ServerTimeout.java solaris-sparc
ohair@1821 340 sun/security/ssl/sun/net/www/protocol/https/HttpsURLConnection/ReadTimeout.java solaris-sparc
ohair@1821 341 sun/security/ssl/com/sun/net/ssl/internal/ssl/SSLSocketImpl/NotifyHandshakeTest.sh solaris-sparc
ohair@1821 342
ohair@1821 343 # Solaris 10 sparc, passed/failed confusion? java.security.ProviderException: update() failed
ohair@1821 344 sun/security/ssl/com/sun/net/ssl/internal/ssl/SSLSocketImpl/AsyncSSLSocketClose.java generic-all
ohair@1821 345
ohair@1821 346 # Timed out, Solaris 10 64bit sparcv9
michaelm@4628 347 com/sun/crypto/provider/Cipher/DES/PaddingTest.java generic-all
ohair@1821 348
ohair@1821 349 # Othervm, sparc, NoRouteToHostException: Cannot assign requested address
ohair@1821 350 sun/security/ssl/javax/net/ssl/NewAPIs/SessionCacheSizeTests.java generic-all
ohair@1821 351
ohair@1821 352 # Times out on windows X64, othervm mode
ohair@1821 353 # Solaris sparc and sparcv9 -server, timeout
michaelm@4628 354 sun/security/ssl/javax/net/ssl/NewAPIs/SessionTimeOutTests.java generic-all
ohair@1821 355
ohair@1821 356 # Various failures on Linux Fedora 9 X64, othervm mode
ohair@1821 357 sun/security/ssl/javax/net/ssl/NewAPIs/SSLEngine/TestAllSuites.java generic-all
michaelm@4628 358 sun/security/ssl/sanity/ciphersuites/CheckCipherSuites.java generic-all
ohair@1821 359
ohair@1821 360 # Various failures on Linux Fedora 9 X64, othervm mode
michaelm@4628 361 sun/security/ssl/sanity/interop/ClientJSSEServerJSSE.java generic-all
ohair@1821 362
ohair@1821 363 # Solaris 11 i586, these all fail with samevm, need to be othervm???
michaelm@4628 364 java/security/SecureClassLoader/DefineClassByteBuffer.java generic-all
ohair@1821 365
ohair@1821 366 # Timeout on solaris-sparc and i586 and x64, -client and -server
ohair@1821 367 sun/security/ssl/com/sun/net/ssl/internal/ssl/InputRecord/InterruptedIO.java solaris-all
ohair@1821 368
coffeys@5591 369 # 7147060
coffeys@5591 370 com/sun/org/apache/xml/internal/security/transforms/ClassLoaderTest.java generic-all
coffeys@5591 371
ohair@1821 372 ############################################################################
ohair@1821 373
coffeys@5591 374 # jdk_swing
ohair@1821 375
ohair@1821 376 ############################################################################
ohair@1821 377
ohair@1821 378 # jdk_text
ohair@1821 379
ohair@1821 380 # Linux x64 occasional errors, no details
michaelm@4628 381 java/text/Bidi/Bug6665028.java linux-x64
ohair@1821 382
ohair@1821 383 ############################################################################
ohair@1821 384
ohair@1821 385 # jdk_tools
ohair@1821 386
coffeys@5591 387 # 6461635
coffeys@5591 388 com/sun/tools/attach/BasicTests.sh generic-all
coffeys@5591 389
ohair@2812 390 # Filed 6986875
michaelm@4628 391 sun/tools/jps/jps-Vvml.sh generic-all
ohair@2812 392
ohair@2812 393 # Filed 6979016
michaelm@4628 394 sun/tools/jconsole/ResourceCheckTest.sh generic-all
ohair@2812 395
alanb@4734 396 # 7132203
alanb@4734 397 sun/jvmstat/monitor/MonitoredVm/CR6672135.java generic-all
alanb@4734 398
coffeys@5591 399 # 8001118
coffeys@5591 400 sun/tools/jcmd/jcmd-f.sh generic-all
coffeys@5591 401 sun/tools/jcmd/jcmd-help-help.sh generic-all
coffeys@5591 402
coffeys@5591 403 # 7175775
coffeys@5591 404 sun/tools/jinfo/Basic.sh macosx-all
coffeys@5591 405
ohair@1821 406 ############################################################################
ohair@1821 407
alanb@5520 408 # jdk_jdi
alanb@5520 409
alanb@5520 410 # Filed 6952105
alanb@5520 411 com/sun/jdi/SuspendThreadTest.java generic-all
alanb@5520 412
alanb@5520 413 # Filed 6987312
alanb@5520 414 com/sun/jdi/DoubleAgentTest.java generic-all
alanb@5520 415
alanb@5520 416 ############################################################################
alanb@5520 417
ohair@1821 418 # jdk_util
ohair@1821 419
alanb@4723 420 # Need 7094995 back-ported from jdk8
alanb@4723 421 java/util/zip/ZipFile/ClearStaleZipFileInputStreams.java macosx-all
alanb@4723 422
ohair@3866 423 # Filed 7027061
michaelm@4628 424 java/util/Locale/Bug6989440.java windows-all
ohair@3866 425
ohair@2812 426 # Filed 6933803
michaelm@4628 427 java/util/concurrent/ThreadPoolExecutor/CoreThreadTimeOut.java generic-all
ohair@2812 428
smarks@3653 429 # Filed 7022325
ohair@2203 430 # Fails with assertion error on windows
ohair@2203 431 # 11 separate stacktraces created... file reuse problem?
michaelm@4628 432 java/util/zip/ZipFile/ReadLongZipFileName.java generic-all
ohair@2203 433
ohair@1821 434 # Assert error, failures, on Linux Fedora 9 -server
ohair@1821 435 # Windows samevm failure, assert error "Passed = 134, failed = 2"
michaelm@4628 436 java/util/Arrays/ArrayObjectMethods.java generic-all
ohair@1821 437
ohair@1821 438 # Windows 2000, -client, samevm, java.lang.Error: Completed != 2
ohair@1821 439 java/util/concurrent/locks/ReentrantLock/CancelledLockLoops.java generic-all
ohair@1821 440
ohair@1821 441 # Windows X64, Executor Stuck samevm mode:
michaelm@4628 442 java/util/concurrent/FutureTask/BlockingTaskExecutor.java generic-all
ohair@1821 443
ohair@1821 444 # Problems on windows, jmap.exe hangs? (these run jmap), fails on Solaris 10 x86
michaelm@4628 445 java/util/concurrent/locks/Lock/TimedAcquireLeak.java generic-all
ohair@1821 446
coffeys@5591 447 # 7041639, Solaris DSA keypair generation bug
coffeys@5591 448 java/util/TimeZone/TimeZoneDatePermissionCheck.sh solaris-all
michaelm@4971 449
aefimov@6788 450 # 8026772: test/sun/util/resources/TimeZone/Bug6317929.java failing
aefimov@6788 451 sun/util/resources/TimeZone/Bug6317929.java generic-all
aefimov@6788 452
ohair@1821 453 ############################################################################
ohair@1821 454
michaelm@4971 455