annotate test/ProblemList.txt @ 1821:af9346401220

6888927: Fix jdk jtreg tests to indicate which ones need othervm, allow for use of samevm option Reviewed-by: tbell, jjg, alanb
author ohair
date Sun, 08 Nov 2009 15:11:10 -0800
parents
children e28f5ce71d00
rev   line source
ohair@1821 1 ###########################################################################
ohair@1821 2 #
ohair@1821 3 # Copyright 2009 Sun Microsystems, Inc. All Rights Reserved.
ohair@1821 4 # DO NOT ALTER OR REMOVE COPYRIGHT NOTICES OR THIS FILE HEADER.
ohair@1821 5 #
ohair@1821 6 # This code is free software; you can redistribute it and/or modify it
ohair@1821 7 # under the terms of the GNU General Public License version 2 only, as
ohair@1821 8 # published by the Free Software Foundation. Sun designates this
ohair@1821 9 # particular file as subject to the "Classpath" exception as provided
ohair@1821 10 # by Sun in the LICENSE file that accompanied this code.
ohair@1821 11 #
ohair@1821 12 # This code is distributed in the hope that it will be useful, but WITHOUT
ohair@1821 13 # ANY WARRANTY; without even the implied warranty of MERCHANTABILITY or
ohair@1821 14 # FITNESS FOR A PARTICULAR PURPOSE. See the GNU General Public License
ohair@1821 15 # version 2 for more details (a copy is included in the LICENSE file that
ohair@1821 16 # accompanied this code).
ohair@1821 17 #
ohair@1821 18 # You should have received a copy of the GNU General Public License version
ohair@1821 19 # 2 along with this work; if not, write to the Free Software Foundation,
ohair@1821 20 # Inc., 51 Franklin St, Fifth Floor, Boston, MA 02110-1301 USA.
ohair@1821 21 #
ohair@1821 22 # Please contact Sun Microsystems, Inc., 4150 Network Circle, Santa Clara,
ohair@1821 23 # CA 95054 USA or visit www.sun.com if you need additional information or
ohair@1821 24 # have any questions.
ohair@1821 25 #
ohair@1821 26 ###########################################################################
ohair@1821 27 #
ohair@1821 28 # List of tests that should not be run by test/Makefile, for various reasons:
ohair@1821 29 # 1. Does not run with jtreg -samevm mode
ohair@1821 30 # 2. Causes problems in jtreg -samevm mode for jtreg or tests that follow it
ohair@1821 31 # 3. The test is too slow or consumes too many system resources
ohair@1821 32 # 4. The test fails when run on any official build systems
ohair@1821 33 #
ohair@1821 34 # It is possible that a test being on this list is a mistake, and that some
ohair@1821 35 # other test in samevm mode caused tests to fail, mistakes happen.
ohair@1821 36 #
ohair@1821 37 # Tests marked @ignore are not run by test/Makefile, but harmless to be listed.
ohair@1821 38 #
ohair@1821 39 # Tests that explicitly state "@run main/othervm ...", and are not listed here,
ohair@1821 40 # will be run in the same batch as the samevm tests.
ohair@1821 41 #
ohair@1821 42 # Shell tests are othervm by default.
ohair@1821 43 #
ohair@1821 44 # List items are testnames followed by labels, all MUST BE commented
ohair@1821 45 # as to why they are here and use a label:
ohair@1821 46 # generic-all Problems on all platforms
ohair@1821 47 # generic-ARCH Where ARCH is one of: sparc, sparcv9, x64, i586, etc.
ohair@1821 48 # OSNAME-all Where OSNAME is one of: solaris, linux, windows
ohair@1821 49 # OSNAME-ARCH Specific on to one OSNAME and ARCH, e.g. solaris-x64
ohair@1821 50 # OSNAME-REV Specific on to one OSNAME and REV, e.g. solaris-5.8
ohair@1821 51 #
ohair@1821 52 # More than one label is allowed but must be on the same line.
ohair@1821 53 #
ohair@1821 54 #############################################################################
ohair@1821 55 #
ohair@1821 56 # Running the tests:
ohair@1821 57 # cd test && make JT_HOME=jtreg_home PRODUCT_HOME=jdk_home jdk_all
ohair@1821 58 # Or instead of jdk_all, use any of the jdk_* targets.
ohair@1821 59 #
ohair@1821 60 # Samevm Notes:
ohair@1821 61 # * Although some tests may have only been seen to fail on some platforms,
ohair@1821 62 # they might be flagged as 'generic-all' because the problem they have
ohair@1821 63 # could cause hidden slowdowns on other platforms.
ohair@1821 64 # Most samevm problems will be generic-all, but windows usually dislikes
ohair@1821 65 # them the most.
ohair@1821 66 # Address already in use or connection errors indicate a generic port issue.
ohair@1821 67 # (this is not necessarily a samevm issue, but an issue for running the tests
ohair@1821 68 # on shared machines, two people or two test runs will collide).
ohair@1821 69 # * Samevm problem (windows in particular) is not closing all input/output
ohair@1821 70 # * Samevm problem when a test calls setSecurityManager()
ohair@1821 71 # * Samevm problem with setHttps*() is used? (not exactly sure here)
ohair@1821 72 # * Samevm problem when stuffing system properties with non Strings or anything
ohair@1821 73 # * Samevm problem when changing vm settings, or registering any vm actions
ohair@1821 74 # * Samevm problems with deleteOnExit(), if it must happen at end of test
ohair@1821 75 # * Samevm problems with URLClassLoader? (no details here)
ohair@1821 76 # * Samevm problems with dependence on predictable GC or finalizations
ohair@1821 77 #
ohair@1821 78 # Any of the above problems may mean the test needs to be flagged as "othervm".
ohair@1821 79 #
ohair@1821 80 #############################################################################
ohair@1821 81 #
ohair@1821 82 # Fixing the tests:
ohair@1821 83 #
ohair@1821 84 # Some tests just may need to be run with "othervm", and that can easily be
ohair@1821 85 # done my adding a @run line (or modifying any existing @run):
ohair@1821 86 # @run main/othervm NameOfMainClass
ohair@1821 87 # Make sure this @run follows any use of @library.
ohair@1821 88 # Otherwise, if the test is a samevm possibility, make sure the test is
ohair@1821 89 # cleaning up after itself, closing all streams, deleting temp files, etc.
ohair@1821 90 #
ohair@1821 91 # Keep in mind that the bug could be in many places, and even different per
ohair@1821 92 # platform, it could be a bug in any one of:
ohair@1821 93 # - the testcase
ohair@1821 94 # - the jdk (jdk classes, native code, or hotspot)
ohair@1821 95 # - the native compiler
ohair@1821 96 # - the javac compiler
ohair@1821 97 # - the OS (depends on what the testcase does)
ohair@1821 98 #
ohair@1821 99 # If you managed to really fix one of these tests, here is how you can
ohair@1821 100 # remove tests from this list:
ohair@1821 101 # 1. Make sure test passes on all platforms with samevm, or mark it othervm
ohair@1821 102 # 2. Make sure test passes on all platforms when run with it's entire group
ohair@1821 103 # 3. Make sure both VMs are tested, -server and -client, if possible
ohair@1821 104 # 4. Make sure you try the -d64 option on Solaris
ohair@1821 105 # 5. Use a tool like JPRT or something to verify these results
ohair@1821 106 # 6. Delete lines in this file, include the changes with your test changes
ohair@1821 107 #
ohair@1821 108 # You may need to repeat your testing 2 or even 3 times to verify good
ohair@1821 109 # results, some of these samevm failures are not very predictable.
ohair@1821 110 #
ohair@1821 111 #############################################################################
ohair@1821 112
ohair@1821 113 ############################################################################
ohair@1821 114
ohair@1821 115 # jdk_awt
ohair@1821 116
ohair@1821 117 # None of the awt tests are using samevm, might not be worth the effort due
ohair@1821 118 # to the vm overhead not being enough to make a difference.
ohair@1821 119 # In general, the awt tests are problematic with or without samevm, and there
ohair@1821 120 # are issues with using a Xvfb display.
ohair@1821 121
ohair@1821 122 # Fails on solaris sparc, timedout? in othervm mode
ohair@1821 123 java/awt/event/MouseEvent/AcceptExtraButton/AcceptExtraButton.java generic-all
ohair@1821 124
ohair@1821 125 # Causes hang in samevm mode??? Solaris 11 i586
ohair@1821 126 java/awt/FullScreen/SetFSWindow/FSFrame.java generic-all
ohair@1821 127
ohair@1821 128 # Fails on solaris 11 i586, -client, in othervm mode not sure why
ohair@1821 129 java/awt/Component/PrintAllXcheckJNI/PrintAllXcheckJNI.java generic-all
ohair@1821 130 java/awt/Focus/CloseDialogActivateOwnerTest/CloseDialogActivateOwnerTest.java generic-all
ohair@1821 131 java/awt/FontClass/FontAccess.java generic-all
ohair@1821 132 java/awt/Mixing/HWDisappear.java generic-all
ohair@1821 133 java/awt/Mixing/MixingInHwPanel.java generic-all
ohair@1821 134 java/awt/Mouse/MaximizedFrameTest/MaximizedFrameTest.html generic-all
ohair@1821 135 java/awt/Robot/AcceptExtraMouseButtons/AcceptExtraMouseButtons.java generic-all
ohair@1821 136 java/awt/Toolkit/SecurityTest/SecurityTest2.java generic-all
ohair@1821 137 java/awt/image/mlib/MlibOpsTest.java generic-all
ohair@1821 138
ohair@1821 139 # Fails on windows, othervm mode, various errors
ohair@1821 140 java/awt/Focus/NonFocusableWindowTest/NonfocusableOwnerTest.java generic-all
ohair@1821 141 java/awt/Focus/OwnedWindowFocusIMECrashTest/OwnedWindowFocusIMECrashTest.java generic-all
ohair@1821 142 java/awt/FullScreen/NoResizeEventOnDMChangeTest/NoResizeEventOnDMChangeTest.java generic-all
ohair@1821 143 java/awt/Mouse/MouseModifiersUnitTest/MouseModifiersUnitTest_Standard.java generic-all
ohair@1821 144 java/awt/event/KeyEvent/KeyTyped/CtrlASCII.html generic-all
ohair@1821 145 java/awt/font/Threads/FontThread.java generic-all
ohair@1821 146 java/awt/print/PrinterJob/PrtException.java generic-all
ohair@1821 147
ohair@1821 148 # Fails with windows X64, othervm, -server
ohair@1821 149 com/sun/awt/Translucency/WindowOpacity.java generic-all
ohair@1821 150 java/awt/EventDispatchThread/HandleExceptionOnEDT/HandleExceptionOnEDT.java generic-all
ohair@1821 151 java/awt/EventDispatchThread/LoopRobustness/LoopRobustness.html generic-all
ohair@1821 152 java/awt/Focus/AppletInitialFocusTest/AppletInitialFocusTest1.html generic-all
ohair@1821 153 java/awt/Focus/FocusEmbeddedFrameTest/FocusEmbeddedFrameTest.java generic-all
ohair@1821 154 java/awt/Frame/LayoutOnMaximizeTest/LayoutOnMaximizeTest.java generic-all
ohair@1821 155 java/awt/FullScreen/TranslucentWindow/TranslucentWindow.java generic-all
ohair@1821 156 java/awt/Mixing/MixingOnShrinkingHWButton.java generic-all
ohair@1821 157 java/awt/Mouse/MouseModifiersUnitTest/ExtraButtonDrag.java generic-all
ohair@1821 158
ohair@1821 159 ############################################################################
ohair@1821 160
ohair@1821 161 # jdk_beans
ohair@1821 162
ohair@1821 163 # A large set of the beans tests set the security manager, which would seem
ohair@1821 164 # to indicate that a large number of them should be "othervm", yet are all
ohair@1821 165 # very small tests and could greatly benefit from a samevm test run.
ohair@1821 166 # So a large batch of beans tests are currently run with othervm mode.
ohair@1821 167
ohair@1821 168 # Linux, some kind of problems with X11 display
ohair@1821 169 java/beans/PropertyChangeSupport/Test4682386.java generic-all
ohair@1821 170 java/beans/PropertyChangeSupport/TestSynchronization.java generic-all
ohair@1821 171 java/beans/Statement/Test4653179.java generic-all
ohair@1821 172
ohair@1821 173 # Runs REALLY slow on Solaris sparc for some reason, both -client and -server
ohair@1821 174 java/beans/XMLEncoder/Test4625418.java solaris-sparc
ohair@1821 175
ohair@1821 176 # Problems with samevm and setting security manager (speculation partially)
ohair@1821 177 java/beans/Beans/Test4080522.java generic-all
ohair@1821 178 java/beans/EventHandler/Test6277246.java generic-all
ohair@1821 179 java/beans/EventHandler/Test6277266.java generic-all
ohair@1821 180 java/beans/Introspector/Test6277246.java generic-all
ohair@1821 181 java/beans/Introspector/4168475/Test4168475.java generic-all
ohair@1821 182 java/beans/Introspector/4520754/Test4520754.java generic-all
ohair@1821 183 java/beans/Introspector/6380849/TestBeanInfo.java generic-all
ohair@1821 184 java/beans/Introspector/Test4144543.java generic-all
ohair@1821 185
ohair@1821 186 # Failed to call method solaris-sparc???
ohair@1821 187 java/beans/EventHandler/Test6788531.java generic-all
ohair@1821 188
ohair@1821 189 # Jar or class not found???
ohair@1821 190 java/beans/XMLEncoder/6329581/Test6329581.java generic-all
ohair@1821 191
ohair@1821 192 ############################################################################
ohair@1821 193
ohair@1821 194 # jdk_io
ohair@1821 195
ohair@1821 196 # Many of these tests have a tendency to leave input streams open, which
ohair@1821 197 # will cause following tests to be failures when used in samevm mode.
ohair@1821 198
ohair@1821 199 # Should be othervm, or corrected for samevm, fails with samevm:
ohair@1821 200 java/io/BufferedReader/BigMark.java generic-all
ohair@1821 201 java/io/BufferedReader/ReadLineSync.java generic-all
ohair@1821 202
ohair@1821 203 # One of these is leaving "a.ser" file open, windows samevm
ohair@1821 204 java/io/Serializable/duplicateSerialFields/Setup.java generic-all
ohair@1821 205 java/io/Serializable/duplicateSerialFields/Test.java generic-all
ohair@1821 206
ohair@1821 207 # One of these leaving foo.ser open, windows samevm problem
ohair@1821 208 java/io/Serializable/enum/constantSubclasses/Read.java generic-all
ohair@1821 209 java/io/Serializable/enum/constantSubclasses/Write.java generic-all
ohair@1821 210 java/io/Serializable/enum/missingConstant/Read.java generic-all
ohair@1821 211 java/io/Serializable/enum/missingConstant/Write.java generic-all
ohair@1821 212
ohair@1821 213 # This is leaving subtest1.tmp open, windows samevm problem
ohair@1821 214 java/io/Serializable/oldTests/AnnotateClass.java generic-all
ohair@1821 215
ohair@1821 216 # One or more of these leave a piotest* file open, windows samevm
ohair@1821 217 java/io/Serializable/oldTests/ArrayFields.java generic-all
ohair@1821 218 java/io/Serializable/oldTests/ArraysOfArrays.java generic-all
ohair@1821 219 java/io/Serializable/oldTests/BinaryTree.java generic-all
ohair@1821 220 java/io/Serializable/oldTests/CircularList.java generic-all
ohair@1821 221 java/io/Serializable/oldTests/SerializeWithException.java generic-all
ohair@1821 222 java/io/Serializable/oldTests/SimpleArrays.java generic-all
ohair@1821 223 java/io/Serializable/oldTests/WritePrimitive.java generic-all
ohair@1821 224
ohair@1821 225 # Missing close on file 0.ser, windows samevm
ohair@1821 226 java/io/Serializable/enum/badResolve/Read.java generic-all
ohair@1821 227 java/io/Serializable/enum/badResolve/Write.java generic-all
ohair@1821 228
ohair@1821 229 # One of these tests is leaving parents.ser open, windows samevm
ohair@1821 230 java/io/Serializable/parents/EvolvedClass.java generic-all
ohair@1821 231 java/io/Serializable/parents/OriginalClass.java generic-all
ohair@1821 232
ohair@1821 233 # One of these tests is leaving file foo.ser and/or bar.ser open, windows samevm
ohair@1821 234 java/io/Serializable/fieldTypeString/Read.java generic-all
ohair@1821 235 java/io/Serializable/fieldTypeString/Write.java generic-all
ohair@1821 236
ohair@1821 237 # One of these tests is leaving tmp.ser file open, windows samevm
ohair@1821 238 java/io/Serializable/ClassCastExceptionDetail/Read.java generic-all
ohair@1821 239 java/io/Serializable/ClassCastExceptionDetail/Write.java generic-all
ohair@1821 240 java/io/Serializable/GetField/Read.java generic-all
ohair@1821 241 java/io/Serializable/GetField/Read2.java generic-all
ohair@1821 242 java/io/Serializable/GetField/Write.java generic-all
ohair@1821 243 java/io/Serializable/PutField/Read.java generic-all
ohair@1821 244 java/io/Serializable/PutField/Read2.java generic-all
ohair@1821 245 java/io/Serializable/PutField/Write.java generic-all
ohair@1821 246 java/io/Serializable/PutField/Write2.java generic-all
ohair@1821 247 java/io/Serializable/arraySuidConflict/Read.java generic-all
ohair@1821 248 java/io/Serializable/arraySuidConflict/Write.java generic-all
ohair@1821 249 java/io/Serializable/backRefCNFException/Read.java generic-all
ohair@1821 250 java/io/Serializable/backRefCNFException/Write.java generic-all
ohair@1821 251 java/io/Serializable/class/Test.java generic-all
ohair@1821 252 java/io/Serializable/evolution/AddedExternField/ReadAddedField.java generic-all
ohair@1821 253 java/io/Serializable/evolution/AddedExternField/WriteAddedField.java generic-all
ohair@1821 254 java/io/Serializable/evolution/AddedExternField/run.sh generic-all
ohair@1821 255 java/io/Serializable/evolution/AddedField/ReadAddedField.java generic-all
ohair@1821 256 java/io/Serializable/evolution/AddedField/WriteAddedField.java generic-all
ohair@1821 257 java/io/Serializable/evolution/AddedSuperClass/ReadAddedSuperClass.java generic-all
ohair@1821 258 java/io/Serializable/evolution/AddedSuperClass/ReadAddedSuperClass2.java generic-all
ohair@1821 259 java/io/Serializable/evolution/AddedSuperClass/WriteAddedSuperClass.java generic-all
ohair@1821 260 java/io/Serializable/proxy/skipMissing/Read.java generic-all
ohair@1821 261 java/io/Serializable/proxy/skipMissing/Write.java generic-all
ohair@1821 262 java/io/Serializable/readObjectNoData/Read.java generic-all
ohair@1821 263 java/io/Serializable/readObjectNoData/Write.java generic-all
ohair@1821 264 java/io/Serializable/skipWriteObject/Read.java generic-all
ohair@1821 265 java/io/Serializable/skipWriteObject/Write.java generic-all
ohair@1821 266 java/io/Serializable/skippedObjCNFException/Read.java generic-all
ohair@1821 267 java/io/Serializable/skippedObjCNFException/Write.java generic-all
ohair@1821 268 java/io/Serializable/stopCustomDeserialization/Read.java generic-all
ohair@1821 269 java/io/Serializable/stopCustomDeserialization/Write.java generic-all
ohair@1821 270 java/io/Serializable/unresolvedClassDesc/Read.java generic-all
ohair@1821 271 java/io/Serializable/unresolvedClassDesc/Write.java generic-all
ohair@1821 272 java/io/Serializable/unshared/Read.java generic-all
ohair@1821 273 java/io/Serializable/unshared/Write.java generic-all
ohair@1821 274 java/io/Serializable/wrongReturnTypes/Read.java generic-all
ohair@1821 275 java/io/Serializable/wrongReturnTypes/Write.java generic-all
ohair@1821 276
ohair@1821 277 # Windows samevm issues? triggers other tests to fail, missing close() on f.txt?
ohair@1821 278 java/io/DataInputStream/OpsAfterClose.java generic-all
ohair@1821 279
ohair@1821 280 # Windows 32bit samevm failure: RuntimeException: File.getFreeSpace() failed
ohair@1821 281 java/io/File/MaxPathLength.java generic-all
ohair@1821 282
ohair@1821 283 # Should be othervm, or corrected for samevm, fails with samevm:
ohair@1821 284 java/io/File/DeleteOnExit.java generic-all
ohair@1821 285 java/io/File/DeleteOnExitLong.java generic-all
ohair@1821 286 java/io/File/DeleteOnExitNPE.java generic-all
ohair@1821 287 java/io/File/IsHidden.java generic-all
ohair@1821 288 java/io/FileDescriptor/FileChannelFDTest.java generic-all
ohair@1821 289 java/io/FileDescriptor/Finalize.java generic-all
ohair@1821 290 java/io/FileInputStream/FinalizeShdCallClose.java generic-all
ohair@1821 291
ohair@1821 292 # Known to cause samevm issues on windows, other tests fail, missing close()?
ohair@1821 293 java/io/FileInputStream/OpsAfterClose.java generic-all
ohair@1821 294
ohair@1821 295 # Should be othervm, or corrected for samevm, fails with samevm:
ohair@1821 296 java/io/FileOutputStream/FinalizeShdCallClose.java generic-all
ohair@1821 297
ohair@1821 298 # Known to cause samevm issues on windows, other tests fail, missing close()?
ohair@1821 299 java/io/FileOutputStream/OpsAfterClose.java generic-all
ohair@1821 300
ohair@1821 301 # Windows samevm issues? triggers other tests to fail, missing close() on f.txt?
ohair@1821 302 java/io/InputStream/OpsAfterClose.java generic-all
ohair@1821 303
ohair@1821 304 # Missing close() on x.ReadBounds file? Windows samevm issues
ohair@1821 305 java/io/InputStream/ReadParams.java generic-all
ohair@1821 306
ohair@1821 307 # Known to cause samevm issues on windows, other tests fail, missing close()?
ohair@1821 308 java/io/InputStreamReader/GrowAfterEOF.java generic-all
ohair@1821 309
ohair@1821 310 # Should be othervm, or corrected for samevm, fails with samevm:
ohair@1821 311 java/io/ObjectInputStream/ResolveProxyClass.java generic-all
ohair@1821 312
ohair@1821 313 # Not doing a close() on x.ParameterCheck file? windows samevm cascade error
ohair@1821 314 java/io/RandomAccessFile/ParameterCheck.java generic-all
ohair@1821 315
ohair@1821 316 # Not doing a close on x.ReadLine file? windows cascade samevm problems
ohair@1821 317 java/io/RandomAccessFile/ReadLine.java generic-all
ohair@1821 318
ohair@1821 319 # Not doing close on file input x.WriteByteChars, windows samevm problems
ohair@1821 320 java/io/RandomAccessFile/WriteBytesChars.java generic-all
ohair@1821 321
ohair@1821 322 # Not doing close on file input x.WriteUTF, windows samevm problems
ohair@1821 323 java/io/RandomAccessFile/WriteUTF.java generic-all
ohair@1821 324
ohair@1821 325 # Possibly, not doing a close() on input.txt, windows samevm issues.
ohair@1821 326 java/io/RandomAccessFile/skipBytes/SkipBytes.java generic-all
ohair@1821 327 java/io/readBytes/MemoryLeak.java generic-all
ohair@1821 328 java/io/readBytes/ReadBytesBounds.java generic-all
ohair@1821 329
ohair@1821 330 # Missing close on fields.ser, windows samevm
ohair@1821 331 java/io/Serializable/checkModifiers/CheckModifiers.java generic-all
ohair@1821 332
ohair@1821 333 # Should be othervm, or corrected for samevm, fails with samevm:
ohair@1821 334 java/io/Serializable/auditStreamSubclass/AuditStreamSubclass.java generic-all
ohair@1821 335 java/io/Serializable/proxy/Basic.java generic-all
ohair@1821 336
ohair@1821 337 # Possibly not doing a close() on input.txt, windows samevm issues.
ohair@1821 338 java/io/StreamTokenizer/Comment.java generic-all
ohair@1821 339
ohair@1821 340 ############################################################################
ohair@1821 341
ohair@1821 342 # jdk_lang
ohair@1821 343
ohair@1821 344 # Some of these tests (like java/lang/management) may just need to be marked
ohair@1821 345 # othervm, but that is partially speculation.
ohair@1821 346
ohair@1821 347 # Times out on solaris 10 sparc
ohair@1821 348 java/lang/ClassLoader/Assert.java generic-all
ohair@1821 349
ohair@1821 350 # Fedora 9 X64, RuntimeException: MyThread expected to be blocked on lock, but got null
ohair@1821 351 java/lang/management/ThreadMXBean/ThreadStateTest.java generic-all
ohair@1821 352
ohair@1821 353 # RuntimeException: Uptime of the JVM is more than 30 minutes (32 minutes).
ohair@1821 354 java/lang/management/RuntimeMXBean/UpTime.java generic-all
ohair@1821 355
ohair@1821 356 # Times out on solaris sparc occasionally, in samevm mode
ohair@1821 357 java/lang/Runtime/exec/ExecWithDir.java generic-all
ohair@1821 358 java/lang/ProcessBuilder/Basic.java generic-all
ohair@1821 359
ohair@1821 360 # Solaris sparc, samevm, java.lang.Exception: Read from closed pipe hangs
ohair@1821 361 java/lang/Runtime/exec/SleepyCat.java generic-all
ohair@1821 362
ohair@1821 363 # Need to be marked othervm, or changed to be samevm safe
ohair@1821 364 java/lang/annotation/ParameterAnnotations.java generic-all
ohair@1821 365
ohair@1821 366 # Need to be marked othervm, or changed to be samevm safe
ohair@1821 367 java/lang/ClassLoader/defineClass/DefineClassByteBuffer.java generic-all
ohair@1821 368 java/lang/ClassLoader/findSystemClass/Loader.java generic-all
ohair@1821 369
ohair@1821 370 # Fedora 9 32bit, -client, samevm, Error while cleaning up threads after test
ohair@1821 371 java/lang/management/ThreadMXBean/Locks.java generic-all
ohair@1821 372
ohair@1821 373 # Need to be marked othervm, or changed to be samevm safe
ohair@1821 374 java/lang/management/ClassLoadingMXBean/LoadCounts.java generic-all
ohair@1821 375 java/lang/management/ManagementFactory/MBeanServerMXBeanUnsupportedTest.java generic-all
ohair@1821 376 java/lang/management/ManagementFactory/MXBeanProxyTest.java generic-all
ohair@1821 377 java/lang/management/ManagementFactory/ThreadMXBeanProxy.java generic-all
ohair@1821 378 java/lang/management/MemoryMXBean/CollectionUsageThreshold.java generic-all
ohair@1821 379 java/lang/management/MemoryMXBean/GetMBeanInfo.java generic-all
ohair@1821 380 java/lang/management/MemoryMXBean/LowMemoryTest.java generic-all
ohair@1821 381 java/lang/management/MemoryMXBean/MemoryManagement.java generic-all
ohair@1821 382 java/lang/management/MemoryMXBean/MemoryTest.java generic-all
ohair@1821 383 java/lang/management/MemoryMXBean/Pending.java generic-all
ohair@1821 384
ohair@1821 385 # Problematic on all platforms (even as othervm)
ohair@1821 386 java/lang/management/MemoryMXBean/ResetPeakMemoryUsage.java generic-all
ohair@1821 387
ohair@1821 388 # Causes jtreg exit samevm issues due to non-String object in system properties
ohair@1821 389 java/lang/management/RuntimeMXBean/GetSystemProperties.java generic-all
ohair@1821 390
ohair@1821 391 # Need to be marked othervm, or changed to be samevm safe
ohair@1821 392 java/lang/management/RuntimeMXBean/PropertiesTest.java generic-all
ohair@1821 393 java/lang/management/ThreadMXBean/AllThreadIds.java generic-all
ohair@1821 394 java/lang/management/ThreadMXBean/EnableTest.java generic-all
ohair@1821 395 java/lang/management/ThreadMXBean/FindMonitorDeadlock.java generic-all
ohair@1821 396 java/lang/management/ThreadMXBean/LockingThread.java generic-all
ohair@1821 397 java/lang/management/ThreadMXBean/MonitorDeadlock.java generic-all
ohair@1821 398 java/lang/management/ThreadMXBean/MyOwnSynchronizer.java generic-all
ohair@1821 399 java/lang/management/ThreadMXBean/SharedSynchronizer.java generic-all
ohair@1821 400 java/lang/management/ThreadMXBean/SynchronizerLockingThread.java generic-all
ohair@1821 401 java/lang/management/ThreadMXBean/ThreadCounts.java generic-all
ohair@1821 402
ohair@1821 403 # Need to be marked othervm, or changed to be samevm safe
ohair@1821 404 java/lang/reflect/Proxy/Boxing.java generic-all
ohair@1821 405 java/lang/reflect/Proxy/ClassRestrictions.java generic-all
ohair@1821 406 java/lang/reflect/Proxy/returnTypes/Test.java generic-all
ohair@1821 407
ohair@1821 408 # Need to be marked othervm, or changed to be samevm safe
ohair@1821 409 java/lang/Runtime/exec/LotsOfOutput.java generic-all
ohair@1821 410 java/lang/System/ExitFinalizersAndJIT.java generic-all
ohair@1821 411 java/lang/System/finalization/FinThreads.java generic-all
ohair@1821 412 java/lang/System/IgnoreNullSecurityManager.java generic-all
ohair@1821 413 java/lang/Thread/GenerifyStackTraces.java generic-all
ohair@1821 414 java/lang/Thread/StackTraces.java generic-all
ohair@1821 415 java/lang/ThreadGroup/Daemon.java generic-all
ohair@1821 416 java/lang/ThreadGroup/NullThreadName.java generic-all
ohair@1821 417
ohair@1821 418 # Times out on solaris sparc -server
ohair@1821 419 java/lang/ThreadLocal/MemoryLeak.java solaris-all
ohair@1821 420
ohair@1821 421 # Windows X64, RuntimeException: MyThread expected to have RUNNABLE but got WAITING
ohair@1821 422 java/lang/Thread/ThreadStateTest.java generic-all
ohair@1821 423
ohair@1821 424 # Timeout on windows 64bit
ohair@1821 425 java/lang/ClassLoader/deadlock/TestCrossDelegate.sh generic-all
ohair@1821 426
ohair@1821 427 ############################################################################
ohair@1821 428
ohair@1821 429 # jdk_management
ohair@1821 430
ohair@1821 431 # Solaris 10 sparc, NPE from org.omg.stub.javax.management.remote.rmi._RMIConnectionImpl_Tie._invoke
ohair@1821 432 javax/management/remote/mandatory/threads/ExecutorTest.java generic-all
ohair@1821 433
ohair@1821 434 # Linux 32bit Fedora 9, IllegalStateException
ohair@1821 435 javax/management/monitor/RuntimeExceptionTest.java generic-all
ohair@1821 436
ohair@1821 437 # Problems with rmi connection, othervm
ohair@1821 438 javax/management/remote/mandatory/subjectDelegation/SubjectDelegation2Test.java generic-all
ohair@1821 439
ohair@1821 440 # Fails with port already in use
ohair@1821 441 sun/management/jmxremote/bootstrap/SSLConfigFilePermissionTest.sh generic-all
ohair@1821 442
ohair@1821 443 # Fails with port already in use
ohair@1821 444 sun/management/jmxremote/bootstrap/RmiRegistrySslTest.sh generic-all
ohair@1821 445
ohair@1821 446 # Windows, connection can't last that long
ohair@1821 447 javax/management/eventService/LeaseTest.java generic-all
ohair@1821 448
ohair@1821 449 # Linux othervm, X64, java.lang.Exception: Failed: ratio=102.4027795593753
ohair@1821 450 javax/management/remote/mandatory/notif/ListenerScaleTest.java generic-all
ohair@1821 451
ohair@1821 452 # Windows run seems to have triggered a hotspot gc error (see 6801625)
ohair@1821 453 com/sun/management/HotSpotDiagnosticMXBean/DumpHeap.sh generic-all
ohair@1821 454
ohair@1821 455 # rmi problem? othervm, java.lang.reflect.UndeclaredThrowableException
ohair@1821 456 javax/management/remote/mandatory/subjectDelegation/SubjectDelegation3Test.java generic-all
ohair@1821 457
ohair@1821 458 # Linux Fedora 9 32bit NPE in rmi server somehere??? othervm
ohair@1821 459 javax/management/remote/mandatory/notif/NotificationBufferDeadlockTest.java generic-all
ohair@1821 460
ohair@1821 461 # Times out on solaris sparc, with othervm
ohair@1821 462 javax/management/eventService/AddRemoveListenerTest.java generic-all
ohair@1821 463
ohair@1821 464 # Linux i586 and x64 -server, timed out waiting for threads to expire? othervm
ohair@1821 465 javax/management/eventService/EventClientThreadTest.java generic-all
ohair@1821 466
ohair@1821 467 # Linux i586 -server, Expected to receive 20, but got 21, othervm
ohair@1821 468 # Fails on Linux X64 -server 20!=21
ohair@1821 469 javax/management/eventService/FetchingTest.java generic-all
ohair@1821 470
ohair@1821 471 # NPE on windows 2000 i586 -client and -server
ohair@1821 472 javax/management/eventService/CustomForwarderTest.java windows-all
ohair@1821 473
ohair@1821 474 # Windows i586 failure, callback did not complete
ohair@1821 475 javax/management/eventService/LeaseManagerDeadlockTest.java windows-all
ohair@1821 476
ohair@1821 477 # Port already in use
ohair@1821 478 sun/management/jmxremote/bootstrap/LocalManagementTest.sh generic-all
ohair@1821 479
ohair@1821 480 # Failed to initialize connector (also overflowing jtreg io buffers)
ohair@1821 481 sun/management/jmxremote/bootstrap/RmiBootstrapTest.sh generic-all
ohair@1821 482 sun/management/jmxremote/bootstrap/RmiSslBootstrapTest.sh generic-all
ohair@1821 483
ohair@1821 484 # Windows X64, java.lang.IllegalStateException
ohair@1821 485 javax/management/monitor/AttributeArbitraryDataTypeTest.java generic-all
ohair@1821 486
ohair@1821 487 ############################################################################
ohair@1821 488
ohair@1821 489 # jdk_math
ohair@1821 490
ohair@1821 491 # Problems with rounding add failures on solaris-sparcv9 and -server
ohair@1821 492 java/math/BigDecimal/AddTests.java solaris-sparcv9
ohair@1821 493
ohair@1821 494 # Problems on windows with samevm, missing inputstream close()?
ohair@1821 495 # Also times out on solaris-sparcv9 -server
ohair@1821 496 java/math/BigInteger/BigIntegerTest.java generic-all
ohair@1821 497
ohair@1821 498 # Should be samevm? But seems problematic with samevm on windows
ohair@1821 499 java/math/BigInteger/ModPow65537.java generic-all
ohair@1821 500
ohair@1821 501 ############################################################################
ohair@1821 502
ohair@1821 503 # jdk_misc
ohair@1821 504
ohair@1821 505 # On Windows com.sun.java.swing.plaf.gtk does not exist, always fails there
ohair@1821 506 com/sun/java/swing/plaf/gtk/Test6635110.java windows-all
ohair@1821 507
ohair@1821 508 # Need to be marked othervm, or changed to be samevm safe
ohair@1821 509 com/sun/jndi/ldap/ReadTimeoutTest.java generic-all
ohair@1821 510 com/sun/jndi/rmi/registry/RegistryContext/UnbindIdempotent.java generic-all
ohair@1821 511
ohair@1821 512 # Need to be marked othervm, or changed to be samevm safe
ohair@1821 513 com/sun/org/apache/xml/internal/security/transforms/ClassLoaderTest.java generic-all
ohair@1821 514
ohair@1821 515 # Need to be marked othervm, or changed to be samevm safe
ohair@1821 516 demo/jvmti/gctest/Gctest.java generic-all
ohair@1821 517 demo/jvmti/heapTracker/HeapTrackerTest.java generic-all
ohair@1821 518 demo/jvmti/heapViewer/HeapViewerTest.java generic-all
ohair@1821 519 demo/jvmti/hprof/CpuOldTest.java generic-all
ohair@1821 520 demo/jvmti/hprof/CpuSamplesTest.java generic-all
ohair@1821 521 demo/jvmti/hprof/CpuTimesDefineClassTest.java generic-all
ohair@1821 522 demo/jvmti/hprof/CpuTimesTest.java generic-all
ohair@1821 523 demo/jvmti/hprof/HeapAllTest.java generic-all
ohair@1821 524 demo/jvmti/hprof/HeapBinaryFormatTest.java generic-all
ohair@1821 525 demo/jvmti/hprof/HeapDumpTest.java generic-all
ohair@1821 526 demo/jvmti/hprof/HeapSitesTest.java generic-all
ohair@1821 527 demo/jvmti/hprof/MonitorTest.java generic-all
ohair@1821 528 demo/jvmti/hprof/OptionsTest.java generic-all
ohair@1821 529 demo/jvmti/hprof/StackMapTableTest.java generic-all
ohair@1821 530 demo/jvmti/minst/MinstTest.java generic-all
ohair@1821 531 demo/jvmti/mtrace/TraceJFrame.java generic-all
ohair@1821 532 demo/jvmti/versionCheck/FailsWhenJvmtiVersionDiffers.java generic-all
ohair@1821 533 demo/jvmti/waiters/WaitersTest.java generic-all
ohair@1821 534
ohair@1821 535 # Solaris sparc and others, exception in initializer
ohair@1821 536 javax/imageio/CachePremissionsTest/CachePermissionsTest.java generic-all
ohair@1821 537
ohair@1821 538 # Leaves file rgba_* open, fails with windows samevm
ohair@1821 539 javax/imageio/plugins/png/PngOutputTypeTest.java generic-all
ohair@1821 540
ohair@1821 541 # Suspect test.png file is left open, windows samevm problems
ohair@1821 542 javax/imageio/plugins/png/ITXtTest.java generic-all
ohair@1821 543
ohair@1821 544 # Solaris sparc and others, failed to compile testcase
ohair@1821 545 javax/imageio/metadata/DOML3Node.java generic-all
ohair@1821 546
ohair@1821 547 # One of these tests is leaving file IMGP1001.JPG open, windows samevm
ohair@1821 548 javax/imageio/plugins/jpeg/ConcurrentReadingTest.java generic-all
ohair@1821 549 javax/imageio/plugins/jpeg/ReadingInterruptionTest.java generic-all
ohair@1821 550
ohair@1821 551 # One of these files is missing a close on writer_* files, windows samevm
ohair@1821 552 javax/imageio/plugins/jpeg/ConcurrentWritingTest.java generic-all
ohair@1821 553 javax/imageio/plugins/jpeg/WritingInterruptionTest.java generic-all
ohair@1821 554
ohair@1821 555 # Leaving file test.jpg open, windows samevm
ohair@1821 556 javax/imageio/plugins/jpeg/ReadAsGrayTest.java generic-all
ohair@1821 557
ohair@1821 558 # Missing close on file wbmp*, windows samevm
ohair@1821 559 javax/imageio/plugins/wbmp/CanDecodeTest.java generic-all
ohair@1821 560
ohair@1821 561 # Exclude all javax/print tests, even if they passed, they may need samevm work
ohair@1821 562
ohair@1821 563 # Times out on solaris-sparc, sparcv9, x64 -server, some on i586 -client
ohair@1821 564 javax/print/attribute/autosense/PrintAutoSenseData.java generic-all
ohair@1821 565 javax/print/attribute/Chroma.java generic-all
ohair@1821 566 javax/print/attribute/CollateAttr.java generic-all
ohair@1821 567 javax/print/attribute/PSCopiesFlavorTest.java generic-all
ohair@1821 568 javax/print/LookupServices.java generic-all
ohair@1821 569 javax/print/TestRaceCond.java generic-all
ohair@1821 570
ohair@1821 571 # These tests really require a printer (might all be windows only tests?)
ohair@1821 572 javax/print/CheckDupFlavor.java generic-all
ohair@1821 573 javax/print/PrintSE/PrintSE.sh generic-all
ohair@1821 574 javax/print/attribute/ChromaticityValues.java generic-all
ohair@1821 575 javax/print/attribute/GetCopiesSupported.java generic-all
ohair@1821 576 javax/print/attribute/SidesPageRangesTest.java generic-all
ohair@1821 577 javax/print/attribute/SupportedPrintableAreas.java generic-all
ohair@1821 578
ohair@1821 579 # Only print test left, excluding just because all print tests have been
ohair@1821 580 javax/print/attribute/MediaMappingsTest.java generic-all
ohair@1821 581
ohair@1821 582 ############################################################################
ohair@1821 583
ohair@1821 584 # jdk_net
ohair@1821 585
ohair@1821 586 # Suspect many of these tests auffer from using fixed ports, no concrete
ohair@1821 587 # evidence.
ohair@1821 588
ohair@1821 589 # Fails on OpenSolaris, BindException unexpected
ohair@1821 590 java/net/BindException/Test.java generic-all
ohair@1821 591
ohair@1821 592 # Fails on OpenSolaris, times out
ohair@1821 593 java/net/MulticastSocket/SetOutgoingIf.java generic-all
ohair@1821 594
ohair@1821 595 # Timed out on Solaris 10 X86.
ohair@1821 596 com/sun/net/httpserver/Test3.java generic-all
ohair@1821 597
ohair@1821 598 # Exception in test on windows
ohair@1821 599 com/sun/net/httpserver/bugs/B6373555.java windows-all
ohair@1821 600
ohair@1821 601 # One of these pollutes the samevm on Linux, too many open files, kills jtreg
ohair@1821 602 com/sun/net/httpserver/bugs/B6339483.java generic-all
ohair@1821 603 com/sun/net/httpserver/bugs/B6341616.java generic-all
ohair@1821 604
ohair@1821 605 # Suspects in cascading samevm problem, solaris 11 i586 (needs othervm?)
ohair@1821 606 # Suspect use of setHttps*()?
ohair@1821 607 com/sun/net/httpserver/SelCacheTest.java generic-all
ohair@1821 608 com/sun/net/httpserver/Test1.java generic-all
ohair@1821 609 com/sun/net/httpserver/Test12.java generic-all
ohair@1821 610 com/sun/net/httpserver/Test13.java generic-all
ohair@1821 611 com/sun/net/httpserver/Test6a.java generic-all
ohair@1821 612 com/sun/net/httpserver/Test7a.java generic-all
ohair@1821 613 com/sun/net/httpserver/Test8a.java generic-all
ohair@1821 614 com/sun/net/httpserver/Test9.java generic-all
ohair@1821 615 com/sun/net/httpserver/Test9a.java generic-all
ohair@1821 616
ohair@1821 617 # 10,000 connections, fails on Linux and makes tests&jtreg fail with samevm
ohair@1821 618 com/sun/net/httpserver/bugs/B6361557.java generic-all
ohair@1821 619
ohair@1821 620 # Address already in use with samevm? Always? Solaris sparc, probably ports
ohair@1821 621 java/net/Authenticator/B4933582.sh generic-all
ohair@1821 622 java/net/DatagramSocket/SendSize.java generic-all
ohair@1821 623
ohair@1821 624 # Solaris 11: exception wrong address???
ohair@1821 625 java/net/Inet6Address/B6558853.java generic-all
ohair@1821 626
ohair@1821 627 # Not closing stream on file i6a1, windows samevm problem
ohair@1821 628 java/net/Inet6Address/serialize/Serialize.java generic-all
ohair@1821 629
ohair@1821 630 # Linux x64 fails "network unreachable"?
ohair@1821 631 java/net/ipv6tests/TcpTest.java generic-all
ohair@1821 632
ohair@1821 633 # Linux i586, fails with unexpected output
ohair@1821 634 java/net/MulticastSocket/NoLoopbackPackets.java linux-i586
ohair@1821 635
ohair@1821 636 # Times out on windows x64, fails with samevm on solaris 11 i586
ohair@1821 637 java/net/ServerSocket/AcceptCauseFileDescriptorLeak.java generic-all
ohair@1821 638
ohair@1821 639 # Address already in use
ohair@1821 640 java/net/DatagramSocket/DatagramTimeout.java generic-all
ohair@1821 641
ohair@1821 642 # Fails on windows, takes too long and fails
ohair@1821 643 # Solaris 10 sparcv9, samevm, java.lang.Exception: Takes too long. Dead lock
ohair@1821 644 java/net/Socket/DeadlockTest.java generic-all
ohair@1821 645
ohair@1821 646 # Linux i586 address already in use or connection error, samevm issues
ohair@1821 647 java/net/Socket/AccurateTimeout.java generic-all
ohair@1821 648 java/net/Socket/asyncClose/BrokenPipe.java generic-all
ohair@1821 649 java/net/Socket/CloseAvailable.java generic-all
ohair@1821 650 java/net/Socket/FDClose.java generic-all
ohair@1821 651
ohair@1821 652 # Linux X64 address already in use, samevm issues
ohair@1821 653 java/net/Socket/LingerTest.java generic-all
ohair@1821 654 java/net/Socket/LinkLocal.java generic-all
ohair@1821 655 java/net/Socket/NullHost.java generic-all
ohair@1821 656 java/net/Socket/ProxyCons.java generic-all
ohair@1821 657 java/net/Socket/ReadTimeout.java generic-all
ohair@1821 658
ohair@1821 659 # Linux X64 address already in use, samevm issues
ohair@1821 660 java/net/Socket/SetReceiveBufferSize.java generic-all
ohair@1821 661
ohair@1821 662 # Linux i586 address already in use or connection error, samevm issues
ohair@1821 663 java/net/Socket/setReuseAddress/Basic.java generic-all
ohair@1821 664 java/net/Socket/setReuseAddress/Restart.java generic-all
ohair@1821 665
ohair@1821 666 # Linux X64 address already in use, samevm issues
ohair@1821 667 java/net/Socket/SetSoLinger.java generic-all
ohair@1821 668
ohair@1821 669 # Address already in use, windows samevm
ohair@1821 670 java/net/Socket/Timeout.java generic-all
ohair@1821 671
ohair@1821 672 # Linux X64 address already in use, samevm issues
ohair@1821 673 java/net/Socket/ShutdownBoth.java generic-all
ohair@1821 674 java/net/Socket/SoTimeout.java generic-all
ohair@1821 675 java/net/Socket/TestClose.java generic-all
ohair@1821 676 java/net/Socket/UrgentDataTest.java generic-all
ohair@1821 677 java/net/SocketInputStream/SocketClosedException.java generic-all
ohair@1821 678 java/net/SocketInputStream/SocketTimeout.java generic-all
ohair@1821 679
ohair@1821 680 # Linux i586, address already in use or timeout, samevm issues
ohair@1821 681 java/net/URLConnection/B5052093.java generic-all
ohair@1821 682 java/net/URLConnection/contentHandler/UserContentHandler.java generic-all
ohair@1821 683 java/net/URLConnection/DisconnectAfterEOF.java generic-all
ohair@1821 684 java/net/URLConnection/HandleContentTypeWithAttrs.java generic-all
ohair@1821 685 java/net/URLConnection/Responses.java generic-all
ohair@1821 686 java/net/URLConnection/TimeoutTest.java generic-all
ohair@1821 687 java/net/URLConnection/ZeroContentLength.java generic-all
ohair@1821 688
ohair@1821 689 # Solaris 11 i586 fails with samevm, not sure why
ohair@1821 690 java/net/Authenticator/B4769350.java generic-all
ohair@1821 691 java/net/HttpURLConnection/HttpResponseCode.java generic-all
ohair@1821 692 java/net/ResponseCache/B6181108.java generic-all
ohair@1821 693 java/net/ResponseCache/ResponseCacheTest.java generic-all
ohair@1821 694 java/net/URL/GetContent.java generic-all
ohair@1821 695 java/net/URL/TestIPv6Addresses.java generic-all
ohair@1821 696 java/net/URLClassLoader/HttpTest.java generic-all
ohair@1821 697 java/net/URLConnection/HttpContinueStackOverflow.java generic-all
ohair@1821 698 java/net/URLConnection/Redirect307Test.java generic-all
ohair@1821 699 java/net/URLConnection/RedirectLimit.java generic-all
ohair@1821 700 java/net/URLConnection/ResendPostBody.java generic-all
ohair@1821 701 java/net/URL/OpenStream.java generic-all
ohair@1821 702 java/net/URLClassLoader/ClassLoad.java generic-all
ohair@1821 703 java/net/URLConnection/SetIfModifiedSince.java generic-all
ohair@1821 704 java/net/URLConnection/URLConnectionHeaders.java generic-all
ohair@1821 705
ohair@1821 706 # Linux i586 Connection refused or address already in use, samevm issues
ohair@1821 707 sun/net/ftp/B6427768.java generic-all
ohair@1821 708 sun/net/ftp/FtpGetContent.java generic-all
ohair@1821 709 sun/net/ftp/FtpURL.java generic-all
ohair@1821 710
ohair@1821 711 # Failed on solaris 10 i586, Exception: should have gotten HttpRetryException?
ohair@1821 712 sun/net/www/http/ChunkedOutputStream/Test.java generic-all
ohair@1821 713
ohair@1821 714 # Trouble cleaning up threads in samevm mode on solaris 11 i586
ohair@1821 715 sun/net/www/http/HttpClient/ProxyTest.java generic-all
ohair@1821 716 sun/net/www/http/ChunkedInputStream/ChunkedEncodingTest.java generic-all
ohair@1821 717 sun/net/www/http/ChunkedInputStream/ChunkedEncodingWithProgressMonitorTest.java generic-all
ohair@1821 718 sun/net/www/http/HttpClient/B6726695.java generic-all
ohair@1821 719 sun/net/www/http/HttpClient/MultiThreadTest.java generic-all
ohair@1821 720 sun/net/www/http/KeepAliveCache/KeepAliveTimerThread.java generic-all
ohair@1821 721
ohair@1821 722 # Connection refused, windows samevm
ohair@1821 723 sun/net/www/protocol/http/DigestTest.java generic-all
ohair@1821 724
ohair@1821 725 ############################################################################
ohair@1821 726
ohair@1821 727 # jdk_nio
ohair@1821 728
ohair@1821 729 # Suspect many of these tests auffer from using fixed ports, no concrete
ohair@1821 730 # evidence.
ohair@1821 731
ohair@1821 732 # Fails on OpenSolaris, IllegalStateException: Cannot add or remove addresses
ohair@1821 733 # from a channel that is bound to the wildcard address
ohair@1821 734 com/sun/nio/sctp/SctpChannel/Bind.java generic-all
ohair@1821 735
ohair@1821 736 # Failed on OpenSolaris, java.lang.AssertionError: Unknown event type
ohair@1821 737 com/sun/nio/sctp/SctpChannel/Receive.java generic-all
ohair@1821 738
ohair@1821 739 # Triggers a hotspot crash on Fedora 9 32bit -server and Windows X64 samevm
ohair@1821 740 sun/nio/cs/TestUTF8.java generic-all
ohair@1821 741
ohair@1821 742 # Fails on OpenSolaris, IllegalArgumentException: Source address is a wildcard
ohair@1821 743 java/nio/channels/DatagramChannel/BasicMulticastTests.java generic-all
ohair@1821 744
ohair@1821 745 # Fails on OpenSolaris, RuntimeException: Expected message not recieved
ohair@1821 746 java/nio/channels/DatagramChannel/MulticastSendReceiveTests.java generic-all
ohair@1821 747
ohair@1821 748 # Solaris sparc, socket timeout
ohair@1821 749 java/nio/channels/spi/SelectorProvider/inheritedChannel/run_tests.sh generic-all
ohair@1821 750
ohair@1821 751 # Runtime exception on windows X64, samevm mode
ohair@1821 752 java/nio/channels/Selector/WakeupNow.java generic-all
ohair@1821 753
ohair@1821 754 # Occasional errors, solarix x86, address already in use, othervm mode
ohair@1821 755 java/nio/channels/Selector/SelectorTest.java generic-all
ohair@1821 756
ohair@1821 757 # Fails on Linux Fedora 9 X64
ohair@1821 758 sun/nio/cs/FindDecoderBugs.java generic-all
ohair@1821 759
ohair@1821 760 # Solaris 11 gave assert error and "connection refused", samevm issues?
ohair@1821 761 com/sun/nio/sctp/SctpServerChannel/NonBlockingAccept.java generic-all
ohair@1821 762
ohair@1821 763 # Fails with othervm on solaris 11 i586
ohair@1821 764 com/sun/nio/sctp/SctpChannel/CommUp.java generic-all
ohair@1821 765 com/sun/nio/sctp/SctpChannel/Connect.java generic-all
ohair@1821 766 com/sun/nio/sctp/SctpMultiChannel/Branch.java generic-all
ohair@1821 767 com/sun/nio/sctp/SctpMultiChannel/Send.java generic-all
ohair@1821 768 com/sun/nio/sctp/SctpMultiChannel/SocketOptionTests.java generic-all
ohair@1821 769
ohair@1821 770 # Linux 64bit failures. too many files open (not good for windows 2000 either)
ohair@1821 771 java/nio/channels/AsynchronousChannelGroup/Unbounded.java generic-all
ohair@1821 772
ohair@1821 773 # Linux 64bit failures. too many files open
ohair@1821 774 java/nio/channels/Selector/HelperSlowToDie.java generic-all
ohair@1821 775
ohair@1821 776 # Timeouts etc. on Window
ohair@1821 777 java/nio/channels/AsyncCloseAndInterrupt.java windows-all
ohair@1821 778
ohair@1821 779 # Gets java.lang.ExceptionInInitializerError on windows: (Windows 2000 only?)
ohair@1821 780 java/nio/channels/AsynchronousChannelGroup/Basic.java windows-5.0
ohair@1821 781 java/nio/channels/AsynchronousChannelGroup/GroupOfOne.java windows-5.0
ohair@1821 782 java/nio/channels/AsynchronousChannelGroup/Identity.java windows-5.0
ohair@1821 783 java/nio/channels/AsynchronousChannelGroup/Restart.java windows-5.0
ohair@1821 784 java/nio/channels/AsynchronousDatagramChannel/Basic.java windows-5.0
ohair@1821 785 java/nio/channels/AsynchronousFileChannel/Lock.java windows-5.0
ohair@1821 786 java/nio/channels/AsynchronousServerSocketChannel/Basic.java windows-5.0
ohair@1821 787 java/nio/channels/AsynchronousServerSocketChannel/WithSecurityManager.java windows-5.0
ohair@1821 788 java/nio/channels/AsynchronousSocketChannel/Basic.java windows-5.0
ohair@1821 789 java/nio/channels/AsynchronousSocketChannel/DieBeforeComplete.java windows-5.0
ohair@1821 790 java/nio/channels/AsynchronousSocketChannel/Leaky.java windows-5.0
ohair@1821 791 java/nio/channels/AsynchronousSocketChannel/StressLoopback.java windows-5.0
ohair@1821 792 java/nio/channels/Channels/Basic2.java windows-5.0
ohair@1821 793
ohair@1821 794 # Solaris sparc timeout
ohair@1821 795 java/nio/channels/DatagramChannel/Connect.java generic-all
ohair@1821 796
ohair@1821 797 # Solaris i586 timeouts
ohair@1821 798 java/nio/channels/DatagramChannel/EmptyBuffer.java solaris-all
ohair@1821 799
ohair@1821 800 # Gets java.lang.ExceptionInInitializerError on windows: (Windows 2000 only?)
ohair@1821 801 java/nio/channels/FileChannel/Transfer.java windows-5.0
ohair@1821 802
ohair@1821 803 # Failed loopback connection? On windows 32bit?
ohair@1821 804 # Considered a stress test, can consume all resources.
ohair@1821 805 java/nio/channels/Selector/LotsOfChannels.java generic-all
ohair@1821 806
ohair@1821 807 # Solaris sparcv9, just fails with exception
ohair@1821 808 java/nio/channels/Selector/OpRead.java solaris-sparc
ohair@1821 809
ohair@1821 810 # Windows i586 client, crashed hotspot? Unpredictable
ohair@1821 811 # Considered a stress test, can consume all resources.
ohair@1821 812 java/nio/channels/Selector/RegAfterPreClose.java generic-all
ohair@1821 813
ohair@1821 814 # Gets java.net.BindException alot (static port number?)
ohair@1821 815 java/nio/channels/Selector/SelectAfterRead.java generic-all
ohair@1821 816
ohair@1821 817 # Solaris i586, cannot assign address, samevm issues
ohair@1821 818 java/nio/channels/Selector/SelectorLimit.java generic-all
ohair@1821 819
ohair@1821 820 # Socket timeout windows X64
ohair@1821 821 java/nio/channels/ServerSocketChannel/AdaptServerSocket.java windows-all
ohair@1821 822
ohair@1821 823 # Solaris i586, cannot assign address, samevm issues
ohair@1821 824 java/nio/channels/SocketChannel/CloseAfterConnect.java generic-all
ohair@1821 825 java/nio/channels/SocketChannel/CloseRegisteredChannel.java generic-all
ohair@1821 826
ohair@1821 827 # Timeouts etc. on Window
ohair@1821 828 java/nio/channels/SocketChannel/ConnectState.java windows-all
ohair@1821 829 java/nio/channels/SocketChannel/FinishConnect.java windows-all
ohair@1821 830
ohair@1821 831 # Need to be marked othervm, or changed to be samevm safe
ohair@1821 832 java/nio/channels/SocketChannel/OpenLeak.java generic-all
ohair@1821 833
ohair@1821 834 # Solaris i586 java.net.BindExceptions
ohair@1821 835 java/nio/channels/SocketChannel/Shutdown.java solaris-all
ohair@1821 836 java/nio/channels/SocketChannel/SocketOptionTests.java solaris-all
ohair@1821 837 java/nio/channels/SocketChannel/Stream.java solaris-all
ohair@1821 838
ohair@1821 839 # Gets java.net.BindException alot (static port number?)
ohair@1821 840 java/nio/channels/SocketChannel/VectorIO.java generic-all
ohair@1821 841
ohair@1821 842 # Solaris i586 java.net.BindExceptions
ohair@1821 843 java/nio/channels/SocketChannel/VectorParams.java solaris-all
ohair@1821 844
ohair@1821 845 # Linux i586 address already in use, samevm issues
ohair@1821 846 java/nio/channels/SocketChannel/Write.java generic-all
ohair@1821 847
ohair@1821 848 # Fails in samevm, jtreg security manager does not grant FilePermission readlink action
ohair@1821 849 java/nio/file/Path/CopyAndMove.java generic-all
ohair@1821 850 java/nio/file/Path/Links.java generic-all
ohair@1821 851
ohair@1821 852 # Fails on all platforms due to overlap of JDK jar file contents:
ohair@1821 853 sun/nio/cs/Test4200310.sh generic-all
ohair@1821 854
ohair@1821 855 # Depends on motif packages that do not exist all the time:
ohair@1821 856 sun/nio/cs/TestX11CNS.java generic-all
ohair@1821 857
ohair@1821 858 ############################################################################
ohair@1821 859
ohair@1821 860 # jdk_rmi
ohair@1821 861
ohair@1821 862 # Port already in use, fails on sparc, othervm
ohair@1821 863 java/rmi/reliability/benchmark/runRmiBench.sh generic-all
ohair@1821 864
ohair@1821 865 # Already in use port issues? othervm solaris
ohair@1821 866 java/rmi/activation/rmidViaInheritedChannel/InheritedChannelNotServerSocket.java generic-all
ohair@1821 867 java/rmi/activation/rmidViaInheritedChannel/RmidViaInheritedChannel.java generic-all
ohair@1821 868
ohair@1821 869 # Address already in use, othervm mode, solaris
ohair@1821 870 java/rmi/activation/Activatable/elucidateNoSuchMethod/ElucidateNoSuchMethod.java generic-all
ohair@1821 871 java/rmi/activation/Activatable/forceLogSnapshot/ForceLogSnapshot.java generic-all
ohair@1821 872
ohair@1821 873 # Registry already running on port, solaris
ohair@1821 874 java/rmi/Naming/legalRegistryNames/LegalRegistryNames.java generic-all
ohair@1821 875
ohair@1821 876 # Fails on Linux 32 and 64bit -server?, impl not garbage collected???
ohair@1821 877 java/rmi/transport/pinLastArguments/PinLastArguments.java generic-all
ohair@1821 878
ohair@1821 879 # Times out on solaris sparc
ohair@1821 880 java/rmi/server/RemoteServer/AddrInUse.java generic-all
ohair@1821 881
ohair@1821 882 # Connection error on Windows i586 -server
ohair@1821 883 # Also connection errors in othervm on Solaris 10 sparc, same port???
ohair@1821 884 sun/rmi/transport/tcp/DeadCachedConnection.java generic-all
ohair@1821 885
ohair@1821 886 # Connection errors in othervm on Solaris 10 sparc, same port???
ohair@1821 887 java/rmi/activation/Activatable/checkActivateRef/CheckActivateRef.java generic-all
ohair@1821 888 java/rmi/activation/Activatable/checkAnnotations/CheckAnnotations.java generic-all
ohair@1821 889 java/rmi/activation/Activatable/checkImplClassLoader/CheckImplClassLoader.java generic-all
ohair@1821 890 java/rmi/activation/Activatable/checkRegisterInLog/CheckRegisterInLog.java generic-all
ohair@1821 891 java/rmi/activation/Activatable/createPrivateActivable/CreatePrivateActivatable.java generic-all
ohair@1821 892 java/rmi/activation/Activatable/downloadParameterClass/DownloadParameterClass.java generic-all
ohair@1821 893 java/rmi/activation/Activatable/extLoadedImpl/ext.sh generic-all
ohair@1821 894 java/rmi/activation/Activatable/inactiveGroup/InactiveGroup.java generic-all
ohair@1821 895 java/rmi/activation/Activatable/lookupActivationSystem/LookupActivationSystem.java generic-all
ohair@1821 896 java/rmi/activation/Activatable/nestedActivate/NestedActivate.java generic-all
ohair@1821 897 java/rmi/activation/Activatable/restartCrashedService/RestartCrashedService.java generic-all
ohair@1821 898 java/rmi/activation/Activatable/restartLatecomer/RestartLatecomer.java generic-all
ohair@1821 899 java/rmi/activation/Activatable/shutdownGracefully/ShutdownGracefully.java generic-all
ohair@1821 900 java/rmi/activation/Activatable/unregisterInactive/UnregisterInactive.java generic-all
ohair@1821 901 java/rmi/activation/ActivateFailedException/activateFails/ActivateFails.java generic-all
ohair@1821 902 java/rmi/activation/ActivationGroup/downloadActivationGroup/DownloadActivationGroup.java generic-all
ohair@1821 903 java/rmi/activation/ActivationSystem/activeGroup/IdempotentActiveGroup.java generic-all
ohair@1821 904 java/rmi/reliability/juicer/AppleUserImpl.java generic-all
ohair@1821 905 java/rmi/server/RMISocketFactory/useSocketFactory/unicast/UseCustomSocketFactory.java generic-all
ohair@1821 906 java/rmi/server/UnicastRemoteObject/keepAliveDuringCall/KeepAliveDuringCall.java generic-all
ohair@1821 907 java/rmi/transport/handshakeTimeout/HandshakeTimeout.java generic-all
ohair@1821 908 java/rmi/activation/Activatable/restartService/RestartService.java generic-all
ohair@1821 909 java/rmi/activation/ActivationSystem/modifyDescriptor/ModifyDescriptor.java generic-all
ohair@1821 910 java/rmi/activation/ActivationSystem/stubClassesPermitted/StubClassesPermitted.java generic-all
ohair@1821 911 java/rmi/activation/ActivationSystem/unregisterGroup/UnregisterGroup.java generic-all
ohair@1821 912 java/rmi/activation/CommandEnvironment/SetChildEnv.java generic-all
ohair@1821 913 java/rmi/registry/classPathCodebase/ClassPathCodebase.java generic-all
ohair@1821 914 java/rmi/registry/reexport/Reexport.java generic-all
ohair@1821 915 java/rmi/server/Unreferenced/finiteGCLatency/FiniteGCLatency.java generic-all
ohair@1821 916 java/rmi/server/Unreferenced/leaseCheckInterval/LeaseCheckInterval.java generic-all
ohair@1821 917 java/rmi/server/Unreferenced/unreferencedContext/UnreferencedContext.java generic-all
ohair@1821 918 java/rmi/server/useCustomRef/UseCustomRef.java generic-all
ohair@1821 919 java/rmi/transport/checkFQDN/CheckFQDN.java generic-all
ohair@1821 920 java/rmi/transport/checkLeaseInfoLeak/CheckLeaseLeak.java generic-all
ohair@1821 921 java/rmi/server/RMISocketFactory/useSocketFactory/activatable/UseCustomSocketFactory.java generic-all
ohair@1821 922 java/rmi/server/RMISocketFactory/useSocketFactory/registry/UseCustomSocketFactory.java generic-all
ohair@1821 923 java/rmi/server/UnicastRemoteObject/unexportObject/UnexportLeak.java generic-all
ohair@1821 924
ohair@1821 925 ############################################################################
ohair@1821 926
ohair@1821 927 # jdk_security
ohair@1821 928
ohair@1821 929 # Run too slow on Solaris 10 sparc
ohair@1821 930 sun/security/ssl/com/sun/net/ssl/internal/ssl/InputRecord/SSLSocketTimeoutNulls.java solaris-sparc
ohair@1821 931 sun/security/ssl/com/sun/net/ssl/internal/ssl/SSLSocketImpl/ClientTimeout.java solaris-sparc
ohair@1821 932 sun/security/ssl/com/sun/net/ssl/internal/ssl/SSLSocketImpl/ServerTimeout.java solaris-sparc
ohair@1821 933 sun/security/ssl/sun/net/www/protocol/https/HttpsURLConnection/ReadTimeout.java solaris-sparc
ohair@1821 934 sun/security/ssl/com/sun/net/ssl/internal/ssl/SSLSocketImpl/NotifyHandshakeTest.sh solaris-sparc
ohair@1821 935 sun/security/tools/keytool/AltProviderPath.sh solaris-sparc
ohair@1821 936
ohair@1821 937 # Solaris 10 sparc, passed/failed confusion? java.security.ProviderException: update() failed
ohair@1821 938 sun/security/ssl/com/sun/net/ssl/internal/ssl/SSLSocketImpl/AsyncSSLSocketClose.java generic-all
ohair@1821 939
ohair@1821 940 # Seem really slow on Solaris sparc, being excluded just for timing reasons
ohair@1821 941 sun/security/tools/jarsigner/AlgOptions.sh solaris-sparc
ohair@1821 942 sun/security/tools/jarsigner/nameclash.sh solaris-sparc
ohair@1821 943 sun/security/krb5/auto/basic.sh solaris-sparc
ohair@1821 944 sun/security/provider/PolicyFile/getinstance/getinstance.sh solaris-sparc
ohair@1821 945 sun/security/tools/jarsigner/samename.sh solaris-sparc
ohair@1821 946
ohair@1821 947 # Timed out, Solaris 10 64bit sparcv9
ohair@1821 948 com/sun/crypto/provider/Cipher/DES/PaddingTest.java generic-all
ohair@1821 949
ohair@1821 950 # Othervm, sparc, NoRouteToHostException: Cannot assign requested address
ohair@1821 951 sun/security/ssl/javax/net/ssl/NewAPIs/SessionCacheSizeTests.java generic-all
ohair@1821 952
ohair@1821 953 # ProviderException: sun.security.pkcs11.wrapper.PKCS11Exception: CKR_DEVICE_ERROR
ohair@1821 954 # Does not seem to run on windows machines? dll missing?
ohair@1821 955 sun/security/pkcs11/rsa/TestKeyPairGenerator.java generic-all
ohair@1821 956
ohair@1821 957 # Times out on windows X64, othervm mode
ohair@1821 958 # Solaris sparc and sparcv9 -server, timeout
ohair@1821 959 sun/security/ssl/javax/net/ssl/NewAPIs/SessionTimeOutTests.java generic-all
ohair@1821 960
ohair@1821 961 # Failed on solaris 10 sparc, othervm mode, "js.jks: No such file or directory"
ohair@1821 962 # Also, cannot verify signature on solaris i586 -server
ohair@1821 963 sun/security/tools/jarsigner/concise_jarsigner.sh generic-all
ohair@1821 964
ohair@1821 965 # Various failures on Linux Fedora 9 X64, othervm mode
ohair@1821 966 lib/security/cacerts/VerifyCACerts.java generic-all
ohair@1821 967 sun/security/ssl/javax/net/ssl/NewAPIs/SSLEngine/TestAllSuites.java generic-all
ohair@1821 968 sun/security/ssl/sanity/ciphersuites/CheckCipherSuites.java generic-all
ohair@1821 969 sun/security/tools/jarsigner/oldsig.sh generic-all
ohair@1821 970
ohair@1821 971 # Various failures on Linux Fedora 9 X64, othervm mode
ohair@1821 972 # Does not seem to run on windows machines? dll missing?
ohair@1821 973 sun/security/ssl/sanity/interop/ClientJSSEServerJSSE.java generic-all
ohair@1821 974
ohair@1821 975 # Linux i586 -server, buffer too short to hold shared secret?
ohair@1821 976 com/sun/crypto/provider/KeyAgreement/DHKeyAgreement2.java generic-all
ohair@1821 977
ohair@1821 978 # Solaris sparcv9: Failed to parse input emptysubject.jks: No such file or directory
ohair@1821 979 sun/security/tools/keytool/emptysubject.sh generic-all
ohair@1821 980
ohair@1821 981 # Timeout on solaris-sparcv9 or exception thrown
ohair@1821 982 com/sun/crypto/provider/Cipher/RSA/TestOAEP_KAT.java solaris-all
ohair@1821 983
ohair@1821 984 # File 6535697.test input stream left open? windows samevm
ohair@1821 985 java/security/cert/CertificateFactory/openssl/OpenSSLCert.java generic-all
ohair@1821 986
ohair@1821 987 # Leaving file open: SerialVersion.current, windows samevm
ohair@1821 988 java/security/BasicPermission/SerialVersion.java generic-all
ohair@1821 989
ohair@1821 990 # Solaris 11 i586, these all fail with samevm, need to be othervm???
ohair@1821 991 java/security/BasicPermission/NullOrEmptyName.java generic-all
ohair@1821 992
ohair@1821 993 # Suspect missing close() on file PermClass.current, windows samevm cascade
ohair@1821 994 java/security/BasicPermission/PermClass.java generic-all
ohair@1821 995
ohair@1821 996 # Solaris 11 i586, these all fail with samevm, need to be othervm???
ohair@1821 997 java/security/KeyPairGenerator/Failover.java generic-all
ohair@1821 998 java/security/Provider/DefaultPKCS11.java generic-all
ohair@1821 999 java/security/SecureClassLoader/DefineClassByteBuffer.java generic-all
ohair@1821 1000 java/security/SecureRandom/GetAlgorithm.java generic-all
ohair@1821 1001 java/security/Security/removing/RemoveProviders.java generic-all
ohair@1821 1002 java/security/Signature/ByteBuffers.java generic-all
ohair@1821 1003 java/security/Signature/NONEwithRSA.java generic-all
ohair@1821 1004 java/security/Signature/SignWithOutputBuffer.java generic-all
ohair@1821 1005 java/security/Signature/TestInitSignWithMyOwnRandom.java generic-all
ohair@1821 1006 java/security/UnresolvedPermission/AccessorMethods.java generic-all
ohair@1821 1007 java/security/UnresolvedPermission/Equals.java generic-all
ohair@1821 1008
ohair@1821 1009 # Do not seem to run on windows machines? dll missing?
ohair@1821 1010 sun/security/krb5/auto/IgnoreChannelBinding.java windows-all
ohair@1821 1011
ohair@1821 1012 # Fails on OpenSolaris, missing classes, slow on Solaris sparc
ohair@1821 1013 sun/security/ec/TestEC.java generic-all
ohair@1821 1014
ohair@1821 1015 # Problems with windows x64
ohair@1821 1016 sun/security/mscapi/IsSunMSCAPIAvailable.sh windows-x64
ohair@1821 1017 sun/security/mscapi/RSAEncryptDecrypt.sh windows-x64
ohair@1821 1018
ohair@1821 1019 # Do not seem to run on windows machines? dll missing?
ohair@1821 1020 sun/security/pkcs11/Cipher/ReinitCipher.java windows-all
ohair@1821 1021 sun/security/pkcs11/Cipher/TestRSACipher.java windows-all
ohair@1821 1022 sun/security/pkcs11/Cipher/TestRSACipherWrap.java windows-all
ohair@1821 1023 sun/security/pkcs11/Cipher/TestSymmCiphers.java windows-all
ohair@1821 1024 sun/security/pkcs11/Cipher/TestSymmCiphersNoPad.java windows-all
ohair@1821 1025
ohair@1821 1026 # Do not seem to run on windows machines? dll missing?
ohair@1821 1027 sun/security/pkcs11/ec/ReadCertificates.java windows-all
ohair@1821 1028 sun/security/pkcs11/ec/ReadPKCS12.java windows-all
ohair@1821 1029 sun/security/pkcs11/ec/TestCurves.java windows-all
ohair@1821 1030 sun/security/pkcs11/ec/TestECDH.java windows-all
ohair@1821 1031 sun/security/pkcs11/ec/TestECDSA.java windows-all
ohair@1821 1032 sun/security/pkcs11/ec/TestECGenSpec.java windows-all
ohair@1821 1033 sun/security/pkcs11/ec/TestKeyFactory.java windows-all
ohair@1821 1034 sun/security/pkcs11/fips/TrustManagerTest.java windows-all
ohair@1821 1035
ohair@1821 1036 # Do not seem to run on windows machines? dll missing?
ohair@1821 1037 sun/security/pkcs11/KeyAgreement/TestShort.java windows-all
ohair@1821 1038 sun/security/pkcs11/KeyGenerator/DESParity.java windows-all
ohair@1821 1039
ohair@1821 1040 # Exception in test solaris-sparc -client -server, no windows
ohair@1821 1041 sun/security/pkcs11/KeyGenerator/TestKeyGenerator.java windows-all solaris-all
ohair@1821 1042
ohair@1821 1043 # Do not seem to run on windows machines? dll missing?
ohair@1821 1044 sun/security/pkcs11/KeyStore/Basic.sh windows-all
ohair@1821 1045 sun/security/pkcs11/KeyStore/ClientAuth.sh windows-all
ohair@1821 1046
ohair@1821 1047 # Solaris sparc client, fails to compile?
ohair@1821 1048 sun/security/pkcs11/KeyStore/SecretKeysBasic.sh solaris-all
ohair@1821 1049
ohair@1821 1050 # Do not seem to run on windows machines? dll missing?
ohair@1821 1051 sun/security/pkcs11/Mac/ReinitMac.java windows-all
ohair@1821 1052 sun/security/pkcs11/MessageDigest/ByteBuffers.java windows-all
ohair@1821 1053 sun/security/pkcs11/MessageDigest/DigestKAT.java windows-all
ohair@1821 1054 sun/security/pkcs11/MessageDigest/ReinitDigest.java windows-all
ohair@1821 1055 sun/security/pkcs11/Provider/ConfigQuotedString.sh windows-all
ohair@1821 1056 sun/security/pkcs11/Provider/Login.sh windows-all
ohair@1821 1057 sun/security/pkcs11/rsa/KeyWrap.java windows-all
ohair@1821 1058 sun/security/pkcs11/rsa/TestCACerts.java windows-all
ohair@1821 1059 sun/security/pkcs11/rsa/TestKeyFactory.java windows-all
ohair@1821 1060 sun/security/pkcs11/rsa/TestSignatures.java windows-all
ohair@1821 1061 sun/security/pkcs11/SampleTest.java windows-all
ohair@1821 1062 sun/security/pkcs11/Secmod/AddPrivateKey.java windows-all
ohair@1821 1063 sun/security/pkcs11/Secmod/AddTrustedCert.java windows-all
ohair@1821 1064 sun/security/pkcs11/Secmod/Crypto.java windows-all
ohair@1821 1065 sun/security/pkcs11/Secmod/GetPrivateKey.java windows-all
ohair@1821 1066 sun/security/pkcs11/Secmod/JksSetPrivateKey.java windows-all
ohair@1821 1067 sun/security/pkcs11/Secmod/TrustAnchors.java windows-all
ohair@1821 1068 sun/security/pkcs11/SecureRandom/Basic.java windows-all
ohair@1821 1069 sun/security/pkcs11/Serialize/SerializeProvider.java windows-all
ohair@1821 1070 sun/security/pkcs11/Signature/ByteBuffers.java windows-all
ohair@1821 1071 sun/security/pkcs11/Signature/ReinitSignature.java windows-all
ohair@1821 1072 sun/security/pkcs11/Signature/TestDSA.java windows-all
ohair@1821 1073 sun/security/pkcs11/tls/TestKeyMaterial.java windows-all
ohair@1821 1074 sun/security/pkcs11/tls/TestMasterSecret.java windows-all
ohair@1821 1075 sun/security/pkcs11/tls/TestPremaster.java windows-all
ohair@1821 1076 sun/security/pkcs11/tls/TestPRF.java windows-all
ohair@1821 1077
ohair@1821 1078 # Fails on OpenSolaris java.net.BindException: Address already in use
ohair@1821 1079 sun/security/pkcs11/sslecc/ClientJSSEServerJSSE.java generic-all
ohair@1821 1080
ohair@1821 1081 # Timeout on solaris-sparcv9 or ArrayIndexOutOfBoundsException?
ohair@1821 1082 sun/security/rsa/TestKeyPairGeneratorLength.java solaris-all
ohair@1821 1083 sun/security/rsa/TestSignatures.java solaris-all
ohair@1821 1084
ohair@1821 1085 # Timeout on solaris-sparc and i586 and x64, -client and -server
ohair@1821 1086 sun/security/ssl/com/sun/net/ssl/internal/ssl/InputRecord/InterruptedIO.java solaris-all
ohair@1821 1087
ohair@1821 1088 # Do not seem to run on windows machines? dll missing?
ohair@1821 1089 sun/security/tools/jarsigner/emptymanifest.sh windows-all
ohair@1821 1090
ohair@1821 1091 # Files does not exist or no encoding? solaris-sparcv9
ohair@1821 1092 sun/security/tools/keytool/importreadall.sh solaris-all
ohair@1821 1093 sun/security/tools/keytool/selfissued.sh solaris-all
ohair@1821 1094
ohair@1821 1095 ############################################################################
ohair@1821 1096
ohair@1821 1097 # jdk_swing (not using samevm)
ohair@1821 1098
ohair@1821 1099 # Fails on solaris 10 sparc, throws RuntimeException that just says "failed"
ohair@1821 1100 javax/swing/JLabel/6501991/bug6501991.java generic-all
ohair@1821 1101
ohair@1821 1102 # Fails on solaris 11 i586, with othervm
ohair@1821 1103 javax/swing/JFileChooser/6570445/bug6570445.java generic-all
ohair@1821 1104 javax/swing/JFileChooser/6738668/bug6738668.java generic-all
ohair@1821 1105 javax/swing/JPopupMenu/6675802/bug6675802.java generic-all
ohair@1821 1106 javax/swing/system/6799345/TestShutdown.java generic-all
ohair@1821 1107
ohair@1821 1108 ############################################################################
ohair@1821 1109
ohair@1821 1110 # jdk_text
ohair@1821 1111
ohair@1821 1112 # Linux x64 occasional errors, no details
ohair@1821 1113 java/text/Bidi/Bug6665028.java linux-x64
ohair@1821 1114
ohair@1821 1115 ############################################################################
ohair@1821 1116
ohair@1821 1117 # jdk_tools
ohair@1821 1118
ohair@1821 1119 # Some of the tools tests kind of require "othervm" or if they don't will
ohair@1821 1120 # always be firing up another VM anyway due to the nature of tools testing.
ohair@1821 1121 # So most if not all tools tests are now being run with "othervm" mode.
ohair@1821 1122 # Some of these tools tests have a tendency to use fixed ports, bad idea.
ohair@1821 1123
ohair@1821 1124 # Solaris 10 client x86, java.lang.IndexOutOfBoundsException resumer Interrupted
ohair@1821 1125 com/sun/jdi/SimulResumerTest.java generic-all
ohair@1821 1126
ohair@1821 1127 # OpenSolaris failures, Missing /usr/ucb/ps
ohair@1821 1128 com/sun/jdi/ArrayLengthDumpTest.sh generic-all
ohair@1821 1129 com/sun/jdi/CatchCaughtTest.sh generic-all
ohair@1821 1130 com/sun/jdi/CatchPatternTest.sh generic-all
ohair@1821 1131 com/sun/jdi/GetLocalVariables3Test.sh generic-all
ohair@1821 1132 com/sun/jdi/GetLocalVariables4Test.sh generic-all
ohair@1821 1133 com/sun/jdi/JdbMethodExitTest.sh generic-all
ohair@1821 1134 com/sun/jdi/JdbMissStep.sh generic-all
ohair@1821 1135 com/sun/jdi/JdbVarargsTest.sh generic-all
ohair@1821 1136 com/sun/jdi/NotAField.sh generic-all
ohair@1821 1137 com/sun/jdi/Redefine-g.sh generic-all
ohair@1821 1138 com/sun/jdi/RedefineImplementor.sh generic-all
ohair@1821 1139 com/sun/jdi/RedefineMulti.sh generic-all
ohair@1821 1140
ohair@1821 1141 # Output of jps differs from expected output.
ohair@1821 1142 # Invalid argument count on solaris-sparc and x64
ohair@1821 1143 sun/tools/jstatd/jstatdPort.sh generic-all
ohair@1821 1144
ohair@1821 1145 # othervm mode, Could not synchronize with target
ohair@1821 1146 sun/tools/jps/jps-l_1.sh generic-all
ohair@1821 1147 sun/tools/jps/jps-l_2.sh generic-all
ohair@1821 1148 sun/tools/jps/jps-lm.sh generic-all
ohair@1821 1149 sun/tools/jps/jps-Vvml_2.sh generic-all
ohair@1821 1150 sun/tools/jps/jps-m_2.sh generic-all
ohair@1821 1151
ohair@1821 1152 # Server name error, port 2098 problem?
ohair@1821 1153 sun/tools/jstatd/jstatdServerName.sh generic-all
ohair@1821 1154
ohair@1821 1155 # Solaris, handshake failed, othervm mode
ohair@1821 1156 com/sun/jdi/RedefineException.sh generic-all
ohair@1821 1157
ohair@1821 1158 # These tests fail on solaris sparc, all the time
ohair@1821 1159 com/sun/servicetag/DeleteServiceTag.java generic-all
ohair@1821 1160 com/sun/servicetag/DuplicateNotFound.java generic-all
ohair@1821 1161 com/sun/servicetag/FindServiceTags.java generic-all
ohair@1821 1162 com/sun/servicetag/InstanceUrnCheck.java generic-all
ohair@1821 1163 com/sun/servicetag/InvalidRegistrationData.java generic-all
ohair@1821 1164 com/sun/servicetag/InvalidServiceTag.java generic-all
ohair@1821 1165 com/sun/servicetag/JavaServiceTagTest.java generic-all
ohair@1821 1166 com/sun/servicetag/JavaServiceTagTest1.java generic-all
ohair@1821 1167 com/sun/servicetag/NewRegistrationData.java generic-all
ohair@1821 1168 com/sun/servicetag/SystemRegistryTest.java generic-all
ohair@1821 1169 com/sun/servicetag/TestLoadFromXML.java generic-all
ohair@1821 1170 com/sun/servicetag/UpdateServiceTagTest.java generic-all
ohair@1821 1171 com/sun/servicetag/ValidRegistrationData.java generic-all
ohair@1821 1172
ohair@1821 1173 # Problems on windows, jmap.exe hangs?
ohair@1821 1174 com/sun/tools/attach/BasicTests.sh windows-all
ohair@1821 1175
ohair@1821 1176 # Fails on Solaris 10 sparc, in othervm mode, throws unexpected exception
ohair@1821 1177 sun/jvmstat/monitor/MonitoredVm/CR6672135.java generic-all
ohair@1821 1178
ohair@1821 1179 # Unexpected Monitor Exception, solaris sparc -client
ohair@1821 1180 sun/jvmstat/monitor/MonitoredVm/MonitorVmStartTerminate.sh generic-all
ohair@1821 1181
ohair@1821 1182 # Probably should be samevm, but seem to cause errors even in othervm at times
ohair@1821 1183 sun/tools/jhat/HatHeapDump1Test.java generic-all
ohair@1821 1184
ohair@1821 1185 # Problems on windows, jmap.exe hangs? (these run jmap)
ohair@1821 1186 sun/tools/jmap/Basic.sh windows-all
ohair@1821 1187
ohair@1821 1188 # Invalid argument count on solaris-sparc and x64
ohair@1821 1189 sun/tools/jstatd/jstatdDefaults.sh solaris-all
ohair@1821 1190
ohair@1821 1191 # Solaris sparcv9, jps output does not match, x64 different
ohair@1821 1192 sun/tools/jstatd/jstatdExternalRegistry.sh solaris-all
ohair@1821 1193
ohair@1821 1194 # Probably should be samevm, but seem to cause errors even in othervm at times
ohair@1821 1195 sun/tools/native2ascii/NativeErrors.java generic-all
ohair@1821 1196
ohair@1821 1197 # Solaris 10 sparc 32bit -client, java.lang.AssertionError: Some tests failed
ohair@1821 1198 tools/jar/JarEntryTime.java generic-all
ohair@1821 1199
ohair@1821 1200 # Times out on sparc?
ohair@1821 1201 tools/launcher/VersionCheck.java generic-all
ohair@1821 1202
ohair@1821 1203 # These tests fail on solaris sparc, all the time
ohair@1821 1204 tools/jar/ChangeDir.java generic-all
ohair@1821 1205
ohair@1821 1206 # Cannot write jar
ohair@1821 1207 # Also, possible problems on windows, jmap.exe hangs?
ohair@1821 1208 tools/jar/index/MetaInf.java windows-all
ohair@1821 1209
ohair@1821 1210 ############################################################################
ohair@1821 1211
ohair@1821 1212 # jdk_util
ohair@1821 1213
ohair@1821 1214 # Assert error, failures, on Linux Fedora 9 -server
ohair@1821 1215 # Windows samevm failure, assert error "Passed = 134, failed = 2"
ohair@1821 1216 java/util/Arrays/ArrayObjectMethods.java generic-all
ohair@1821 1217
ohair@1821 1218 # Windows 2000, -client, samevm, java.lang.Error: Completed != 2
ohair@1821 1219 java/util/concurrent/locks/ReentrantLock/CancelledLockLoops.java generic-all
ohair@1821 1220
ohair@1821 1221 # Windows X64, Executor Stuck samevm mode:
ohair@1821 1222 java/util/concurrent/FutureTask/BlockingTaskExecutor.java generic-all
ohair@1821 1223
ohair@1821 1224 # Problems on windows, jmap.exe hangs? (these run jmap), fails on Solaris 10 x86
ohair@1821 1225 java/util/concurrent/locks/Lock/TimedAcquireLeak.java generic-all
ohair@1821 1226
ohair@1821 1227 # Solaris sparc client, some failures, "1 not equal to 3"?
ohair@1821 1228 # also Linux problems with samevm mode, -server linux i586? 1 not equal to 3?
ohair@1821 1229 java/util/concurrent/Executors/AutoShutdown.java generic-all
ohair@1821 1230
ohair@1821 1231 # Fails on solaris-sparc -server (Set not equal to copy. 1)
ohair@1821 1232 java/util/EnumSet/EnumSetBash.java solaris-sparc
ohair@1821 1233
ohair@1821 1234 # Failing to close an input stream? "foo", triggers samevm windows failures
ohair@1821 1235 java/util/Formatter/Constructors.java generic-all
ohair@1821 1236
ohair@1821 1237 # Need to be marked othervm, or changed to be samevm safe
ohair@1821 1238 java/util/Locale/Bug4175998Test.java generic-all
ohair@1821 1239 java/util/Locale/Bug4184873Test.java generic-all
ohair@1821 1240 java/util/Locale/LocaleTest.java generic-all
ohair@1821 1241
ohair@1821 1242 # Need to be marked othervm, or changed to be samevm safe
ohair@1821 1243 java/util/logging/GetGlobalTest.java generic-all
ohair@1821 1244 java/util/logging/LoggerSubclass.java generic-all
ohair@1821 1245 java/util/logging/LoggingDeadlock.java generic-all
ohair@1821 1246 java/util/logging/LoggingDeadlock2.java generic-all
ohair@1821 1247 java/util/logging/LoggingMXBeanTest.java generic-all
ohair@1821 1248 java/util/logging/LoggingMXBeanTest2.java generic-all
ohair@1821 1249 java/util/logging/LoggingNIOChange.java generic-all
ohair@1821 1250 java/util/logging/ParentLoggersTest.java generic-all
ohair@1821 1251
ohair@1821 1252 # Need to be marked othervm, or changed to be samevm safe
ohair@1821 1253 java/util/ResourceBundle/Bug4168625Test.java generic-all
ohair@1821 1254 java/util/ResourceBundle/Bug6359330.java generic-all
ohair@1821 1255 java/util/ResourceBundle/TestBug4179766.java generic-all
ohair@1821 1256
ohair@1821 1257 # Need to be marked othervm, or changed to be samevm safe
ohair@1821 1258 java/util/WeakHashMap/GCDuringIteration.java generic-all
ohair@1821 1259
ohair@1821 1260 # Possible missing input stream close()? Causes samevm issues on windows
ohair@1821 1261 java/util/zip/InfoZip.java generic-all
ohair@1821 1262
ohair@1821 1263 # Missing a close() on file Test0.zip? windows samevm cascade problem
ohair@1821 1264 java/util/zip/ZipFile/Comment.java generic-all
ohair@1821 1265
ohair@1821 1266 # Suspect missing close() on bad*.zip files, windows cascade errors with samevm
ohair@1821 1267 java/util/zip/ZipFile/CorruptedZipFiles.java generic-all
ohair@1821 1268
ohair@1821 1269 # Should be samevm but causes problems with samevm, no details:
ohair@1821 1270 java/util/zip/ZipFile/ManyEntries.java generic-all
ohair@1821 1271
ohair@1821 1272 ############################################################################
ohair@1821 1273