log

age author description
Fri, 13 Dec 2013 09:25:44 +0100 roland 8029383: assert(counter_changed) failed: failed dependencies, but counter didn't change
Thu, 12 Dec 2013 20:55:36 -0500 drchase Merge
Thu, 12 Dec 2013 18:00:27 -0500 drchase Merge
Thu, 12 Dec 2013 15:11:35 -0500 drchase 8029351: assert(bt != T_OBJECT) failed: Guard is incorrect in VM:defmeth
Thu, 12 Dec 2013 18:57:38 -0500 iignatyev Merge
Fri, 13 Dec 2013 00:34:09 +0400 iignatyev 8026941: [TESTBUG] java.lang.ClassNotFoundException: java.lang.invoke.InvokeGeneric
Thu, 12 Dec 2013 11:25:32 -0800 iveresov 8029668: Kithcensink crashed with guarantee(Assembler::is_simm13(disp)) failed: Do not match large constant offsets
Fri, 13 Dec 2013 09:48:29 -0800 amurillo 8030062: new hotspot build - hs25-b64
Thu, 19 Dec 2013 17:23:40 -0800 katleman Added tag jdk8-b121 for changeset 5f07ec8bb982
Fri, 13 Dec 2013 09:40:58 -0800 amurillo Added tag hs25-b63 for changeset 41f4cad94c58jdk8-b121
Fri, 13 Dec 2013 09:40:57 -0800 amurillo Mergehs25-b63
Thu, 12 Dec 2013 14:06:21 -0800 vladidan Merge
Thu, 12 Dec 2013 17:08:04 -0500 vladidan Merge
Wed, 11 Dec 2013 13:51:28 -0500 jprovino 8029566: PPC: OrderAccess::load_acquire(julong) is broken
Thu, 12 Dec 2013 11:22:26 -0800 anoll Merge
Wed, 11 Dec 2013 01:09:04 +0400 iignatyev 8029153: [TESTBUG] test/compiler/7141637/SpreadNullArg.java fails because it expects NullPointerException
Wed, 11 Dec 2013 01:04:34 +0400 iignatyev 8028122: [TESTBUG] compiler/regalloc/C1ObjectSpillInLogicOp.java
Fri, 06 Dec 2013 16:43:56 -0800 twisti 8029366: ShouldNotReachHere error when creating an array with component type of void
Fri, 06 Dec 2013 12:11:51 -0800 kvn 8028107: Kitchensink crashed with EAV
Thu, 12 Dec 2013 16:13:44 +0100 ehelin Merge
Mon, 09 Dec 2013 10:03:39 +0100 stefank 8029106: JVM crashes in Metachunk::Metachunk during parallel class redefinition (PrivateMLetController, anonymous-simple_copy_1)
Tue, 10 Dec 2013 10:31:00 +0100 sjohanss 8028993: Full collections with ParallelScavenge slower in JDK 8 compared to 7u40
Mon, 09 Dec 2013 08:20:45 +0100 ehelin 8029326: G1 does not check if threads gets created
Tue, 10 Dec 2013 16:18:26 -0500 hseigel 8028741: Interface Method Resolution should skip static and non-public methods in j.l.Object
Sun, 08 Dec 2013 18:00:58 +0100 mgronlun Merge
Fri, 06 Dec 2013 11:49:50 -0500 hseigel Merge
Fri, 06 Dec 2013 11:33:10 -0500 hseigel 8029415: java/lang/reflect/Method/invoke/TestPrivateInterfaceMethodReflect.java fails on all platforms with hs25-b61
Thu, 05 Dec 2013 12:35:38 +0100 mgronlun 8028412: AsyncGetCallTrace() is broken on x86 in JDK 7u40
Wed, 04 Dec 2013 14:43:50 +0100 sla 8029395: SA: jstack throws WrongTypeException
Wed, 04 Dec 2013 08:10:31 -0500 hseigel 8027458: VM anonymous classes: wrong context for protected access checks
Fri, 06 Dec 2013 09:41:57 -0800 amurillo 8029693: new hotspot build - hs25-b63
Thu, 12 Dec 2013 05:20:55 -0800 katleman Added tag jdk8-b120 for changeset fca262db9c43
Fri, 06 Dec 2013 09:29:15 -0800 amurillo Added tag hs25-b62 for changeset 05fedd51e40djdk8-b120
Fri, 06 Dec 2013 09:29:14 -0800 amurillo Mergehs25-b62
Thu, 05 Dec 2013 12:49:55 -0800 anoll Merge
Wed, 04 Dec 2013 09:31:17 +0100 anoll 8028109: compiler/codecache/CheckReservedInitialCodeCacheSizeArgOrder.java crashes in RT_Baseline
Mon, 02 Dec 2013 11:12:32 +0100 simonis 8029190: VM_Version::determine_features() asserts on Fujitsu Sparc64 CPUs
Fri, 22 Nov 2013 15:26:37 +0100 rbackman 8028624: [TESTBUG] compiler/intrinsics/mathexact/DecExactLTest executes DecExactITest
Fri, 22 Nov 2013 14:14:26 +0100 rbackman 8028997: mathexact intrinsics are unstable
Thu, 05 Dec 2013 17:49:55 +0100 ehelin Merge
Tue, 03 Dec 2013 12:01:18 +0100 sjohanss 8029329: tmtools tests fail with NPE (in the tool) when run with G1 and FlightRecorder
Mon, 02 Dec 2013 15:43:04 +0100 ehelin Merge
Tue, 26 Nov 2013 14:35:38 +0100 sjohanss 8027675: Full collections with Serial slower in JDK 8 compared to 7u40
Tue, 03 Dec 2013 13:56:10 -0800 sspitsyn Merge
Tue, 03 Dec 2013 15:41:35 -0800 sspitsyn 8028126: nsk/jvmti/scenarios/hotswap/HS101/hs101t006 Crashed the vm on Solaris-sparc64 fastdebug builds: only current thread can flush its registers
Tue, 03 Dec 2013 11:13:14 -0800 acorn 8028438: static superclass method masks default methods
Tue, 03 Dec 2013 08:36:15 -0800 acorn 8026066: ICCE for invokeinterface static
Mon, 02 Dec 2013 11:42:10 +0100 mgronlun Merge
Wed, 27 Nov 2013 14:26:04 +0400 dsamersoff 7050685: jsdbproc64.sh has a typo in the package name
Sun, 01 Dec 2013 22:35:15 -0500 vladidan Merge
Tue, 19 Nov 2013 16:26:54 -0500 jprovino 8028396: Minimal VM: undefined symbol: _ZN23JvmtiCurrentBreakpoints11metadata_doEPFvP8MetadataE
Fri, 29 Nov 2013 11:20:34 -0800 amurillo 8029367: new hotspot build - hs25-b62
Wed, 04 Dec 2013 23:11:03 -0800 katleman Added tag jdk8-b119 for changeset ce42d815dd21
Fri, 29 Nov 2013 11:10:31 -0800 amurillo Added tag hs25-b61 for changeset b2426da30009jdk8-b119
Fri, 29 Nov 2013 11:10:30 -0800 amurillo Mergehs25-b61
Fri, 29 Nov 2013 11:32:45 -0500 drchase Merge
Tue, 26 Nov 2013 18:16:04 -0500 drchase 8016839: JSR292: AME instead of IAE when calling a method
Tue, 26 Nov 2013 16:03:57 -0500 hseigel 8028160: [TESTBUG] Exclude failing (runtime) jtreg tests using @ignore
Tue, 26 Nov 2013 09:52:22 -0500 hseigel 8026065: InterfaceMethodref for invokespecial must name a direct superinterface
Sat, 23 Nov 2013 12:25:13 +0100 mgronlun 8028128: Add a type safe alternative for working with counter based data
Sat, 23 Nov 2013 09:56:59 +0100 mgronlun Merge
Thu, 21 Nov 2013 14:41:13 -0500 hseigel 8028520: JVM should not throw VerifyError when a private method overrides a final method
Fri, 22 Nov 2013 13:42:46 -0800 amurillo 8028815: new hotspot build - hs25-b61
Thu, 28 Nov 2013 08:23:04 -0800 cl Added tag jdk8-b118 for changeset c9f439732b18
Fri, 22 Nov 2013 13:34:43 -0800 amurillo Added tag hs25-b60 for changeset abad3b2d905djdk8-b118
Fri, 22 Nov 2013 13:34:41 -0800 amurillo Mergehs25-b60
Fri, 22 Nov 2013 20:26:36 +0100 mgronlun Merge
Mon, 18 Nov 2013 08:21:19 +0100 sgabdura 8028341: PSR:FUNC: SCOPE PARAMETER MISSING FROM THE -XX:+PRINTFLAGSFINAL
Mon, 18 Nov 2013 10:20:13 +0100 sla 8027630: SIGSEGV in const char*Klass::external_name()
Fri, 15 Nov 2013 17:20:22 -0500 coleenp 8028347: Rewriter::scan_method asserts with array oob in RT_Baseline
Fri, 15 Nov 2013 21:39:27 +0100 mgronlun Merge
Thu, 14 Nov 2013 20:03:15 +0100 sla 6626412: jstack using SA prints some info messages into err stream
Thu, 14 Nov 2013 19:30:07 +0100 sla 6606002: jinfo doesn't detect dynamic vm flags changing
Wed, 13 Nov 2013 16:35:55 -0800 minqi Merge
Wed, 13 Nov 2013 16:24:33 -0800 minqi 8025632: Remove all references to MagicLambdaImpl from Hotspot
Wed, 20 Nov 2013 12:46:08 +0100 roland 8028308: nsk regression, assert(obj->is_oop()) failed: not an oop
Thu, 14 Nov 2013 19:27:07 +0100 anoll 8028306: nsk stress tests, CodeCache fills, then safepoint asserts
Mon, 18 Nov 2013 12:26:51 -0800 morris 8028319: ConflictingDefaultsTest.testReabstract spins when running with -mode invoke and -Xcomp
Fri, 15 Nov 2013 07:58:06 -0800 amurillo 8028444: new hotspot build - hs25-b60
Thu, 21 Nov 2013 09:22:49 -0800 cl Added tag jdk8-b117 for changeset f573d00213b7
Fri, 15 Nov 2013 07:50:05 -0800 amurillo Added tag hs25-b59 for changeset c78d517c7ea4jdk8-b117
Fri, 15 Nov 2013 07:50:04 -0800 amurillo Mergehs25-b59
Thu, 14 Nov 2013 13:38:49 -0800 drchase Merge
Thu, 14 Nov 2013 15:58:12 -0500 drchase Merge
Thu, 14 Nov 2013 09:14:39 -0800 vlivanov 8028159: C2: compiler stack overflow during inlining of @ForceInline methods
Wed, 13 Nov 2013 13:45:50 +0100 roland 8027572: assert(r != 0) failed: invalid
Wed, 13 Nov 2013 01:50:14 -0800 roland Merge
Wed, 13 Nov 2013 09:45:58 +0100 roland 8027631: "unexpected profiling mismatch" error with new type profiling
Tue, 12 Nov 2013 14:52:48 +0100 rbackman 8028207: assert(_outcnt==1) failed: not unique in compile.cpp
Tue, 12 Nov 2013 13:47:57 +0100 rbackman 8028198: SIGSEGV in PhaseIdealLoop::build_loop_late_post
Tue, 12 Nov 2013 13:58:37 +0100 roland 8027632: assert(xtype->klass_is_exact()) failed: Should be exact at graphKit.cpp
Tue, 12 Nov 2013 09:32:50 +0100 anoll 8027593: performance drop with constrained codecache starting with hs25 b111
Mon, 11 Nov 2013 11:53:33 -0800 kvn 8024830: SEGV in org.apache.lucene.codecs.compressing.CompressingTermVectorsReader.get
Fri, 08 Nov 2013 14:19:55 -0800 drchase Merge
Fri, 08 Nov 2013 01:13:11 -0800 vlivanov 8023037: Race between ciEnv::register_method and nmethod::make_not_entrant_or_zombie
Thu, 14 Nov 2013 21:05:16 +0100 ehelin Merge
Fri, 08 Nov 2013 17:46:53 +0100 sjohanss 8027960: Assertion assert(end >= start) failed during nightly testing on solaris
Mon, 11 Nov 2013 16:20:48 +0100 mgerdin Merge
Mon, 11 Nov 2013 05:05:36 -0800 jwilhelm Merge
Mon, 11 Nov 2013 13:50:10 +0100 jwilhelm 8028093: Initial young size is smaller than minimum young size
Sun, 10 Nov 2013 00:07:29 +0100 jwilhelm 8027911: Assertion in the collector policy when running gc/arguments/TestMaxNewSize.java
Fri, 08 Nov 2013 06:14:21 -0800 jmasa 8024483: assertion failure: (!mirror_alive || loader_alive) failed:
Wed, 16 Oct 2013 15:14:37 -0700 jmasa 8024954: CMS: CMSClassUnloadingMaxInterval is not implemented correctly. This change is also part of the fix for 8024483.
Thu, 07 Nov 2013 15:17:10 +0100 tschatzl 8027756: assert(!hr->isHumongous()) failed: code root in humongous region?
Sat, 02 Nov 2013 13:02:59 -0700 amurillo Merge
Fri, 01 Nov 2013 17:09:38 +0100 jwilhelm 8016309: assert(eden_size > 0 && survivor_size > 0) failed: just checking
Mon, 21 Oct 2013 18:56:20 +0200 jwilhelm 8026853: Prepare GC code for collector policy regression fix
Mon, 21 Oct 2013 18:52:13 +0200 jwilhelm 8026852: Use restricted_align_down in collector policy code
Mon, 21 Oct 2013 18:51:37 +0200 jwilhelm 8026851: Remove unnecessary code in GenRemSet
Wed, 13 Nov 2013 16:42:24 -0500 coleenp 8025937: assert(existing_f1 == NULL || existing_f1 == f1) failed: illegal field change
Wed, 13 Nov 2013 07:31:26 -0800 acorn 8027229: ICCE expected for >=2 maximally specific default methods.
Fri, 08 Nov 2013 23:49:20 +0000 mgerdin Merge
Fri, 08 Nov 2013 16:48:21 +0100 mgerdin 8027237: New tests on ReservedSpace/VirtualSpace classes
Fri, 08 Nov 2013 07:13:57 -0800 amurillo 8028061: new hotspot build - hs25-b59
Thu, 14 Nov 2013 09:04:59 -0800 cl Added tag jdk8-b116 for changeset 52b076e6ffae
Fri, 08 Nov 2013 07:02:54 -0800 amurillo Added tag hs25-b58 for changeset e510dfdec6ddjdk8-b116
Fri, 08 Nov 2013 07:02:53 -0800 amurillo Mergehs25-b58
Thu, 07 Nov 2013 10:02:28 -0500 drchase Merge
Wed, 06 Nov 2013 06:51:24 -0800 mikael 8026775: nsk/jvmti/RedefineClasses/StressRedefine crashes due to EXCEPTION_ACCESS_VIOLATION
Tue, 05 Nov 2013 02:29:41 -0800 iveresov Merge
Tue, 05 Nov 2013 01:57:18 -0800 iveresov 8017065: C2 allows safepoint checks to leak into G1 pre-barriers
Tue, 05 Nov 2013 00:59:30 -0800 iveresov 8027751: C1 crashes in Weblogic with G1 enabled
Mon, 04 Nov 2013 10:44:46 +0100 rbackman 8027622: java.time.Instant.create failing since hs25-b56
Mon, 04 Nov 2013 21:59:54 +0100 roland 8027445: SIGSEGV at TestFloatingDecimal.testAppendToDouble()I
Sat, 02 Nov 2013 20:56:18 +0100 mgronlun Merge
Fri, 01 Nov 2013 17:10:31 +0000 mgronlun Merge
Fri, 01 Nov 2013 15:56:06 +0100 mgronlun Merge
Fri, 01 Nov 2013 10:32:36 -0400 coleenp 8026946: JvmtiEnv::SetBreakpoint and JvmtiEnv::ClearBreakpoint should use MethodHandle
Thu, 31 Oct 2013 14:11:02 -0400 coleenp 8027616: Off by one error in putback for compressed oops nashorn performance improvement
Wed, 30 Oct 2013 09:26:44 -0700 acorn Merge
Wed, 30 Oct 2013 09:11:04 -0700 acorn 8027304: Lambda: inheriting abstract + 1 default -> default, not ICCE
Wed, 30 Oct 2013 15:35:25 +0100 mgerdin 8027252: Crash in interpreter because get_unsigned_2_byte_index_at_bcp reads 4 bytes
Fri, 01 Nov 2013 08:35:58 -0700 amurillo 8027580: new hotspot build - hs25-b58
Thu, 07 Nov 2013 08:16:14 -0800 cl Added tag jdk8-b115 for changeset 9ebaac78a8a0
Tue, 05 Nov 2013 14:06:23 -0800 amurillo Mergejdk8-b115
Fri, 01 Nov 2013 08:26:55 -0700 amurillo Added tag hs25-b57 for changeset 3b32d287da89
Fri, 01 Nov 2013 08:26:54 -0700 amurillo Mergehs25-b57
Thu, 31 Oct 2013 15:04:43 -0700 iveresov Merge
Thu, 31 Oct 2013 14:54:14 -0700 iveresov Merge
Thu, 31 Oct 2013 04:16:40 -0700 iveresov 8024919: G1: SPECjbb2013 crashes due to a broken object reference
Wed, 30 Oct 2013 22:55:11 -0700 iveresov 8026735: Stream tests throw java.lang.IncompatibleClassChangeError
Wed, 30 Oct 2013 13:14:09 +0100 rbackman 8027444: mathExact: assert(i < _max) failed: oob: i=1, _max=1
Mon, 28 Oct 2013 08:34:10 +0100 rbackman 8027353: Exact intrinsics: assert(n != NULL) failed: must not be null
Mon, 28 Oct 2013 17:32:02 -0700 iveresov Merge
Mon, 28 Oct 2013 15:16:17 -0700 iveresov Merge
Fri, 25 Oct 2013 22:57:13 +0200 anoll 8026949: -Xint flag prints wrong warning: Initialization of C1 thread failed (no space to run compilers)
Mon, 28 Oct 2013 12:21:00 -0700 roland Merge
Mon, 28 Oct 2013 09:58:59 +0100 roland 8027140: Assertion in compiler when running bigapps/Kitchensink/stability
Fri, 25 Oct 2013 12:40:10 -0700 adlertz Merge
Fri, 25 Oct 2013 10:13:40 +0200 adlertz 8026940: assert(n->outcnt() != 0 || C->top() == n || n->is_Proj()) failed: No dead instructions after post-alloc
Thu, 24 Oct 2013 16:26:31 -0700 twisti Merge
Thu, 24 Oct 2013 16:23:07 -0700 twisti 8026328: Setting a breakpoint on invokedynamic crashes the JVM
Thu, 31 Oct 2013 21:20:00 +0100 ehelin Merge
Mon, 28 Oct 2013 13:27:57 +0100 brutisso 8027132: Print deprecation warning message for the flags controlling the CMS foreground collector
Wed, 30 Oct 2013 16:31:33 -0700 vladidan Merge
Wed, 30 Oct 2013 16:06:48 -0400 jprovino Merge
Sun, 27 Oct 2013 14:11:06 -0400 jprovino Merge
Thu, 24 Oct 2013 00:33:14 -0400 dholmes 8026877: Error in opening JAR file when invalid jar specified with -Xbootclasspath/a on OpenJDK build
Wed, 30 Oct 2013 14:02:27 -0700 ccheung Merge
Mon, 28 Oct 2013 21:41:48 +0400 dsamersoff 8026950: Nits in agent ps_proc.c file breaks compilation of open hotspot
Fri, 25 Oct 2013 22:06:43 -0700 ccheung Merge
Fri, 25 Oct 2013 15:19:29 -0400 coleenp 8024927: Nashorn performance regression with CompressedOops
Fri, 25 Oct 2013 11:13:11 -0400 hseigel Merge
Fri, 25 Oct 2013 11:05:32 -0400 hseigel 8026822: metaspace/flags/maxMetaspaceSize throws OOM of unexpected type.java.lang.OutOfMemoryError: Compressed class space
Fri, 25 Oct 2013 09:07:58 +0200 jbachorik 8027294: Prepare hotspot for non TOD based uptime counter
Thu, 24 Oct 2013 22:19:48 -0700 iklam 8020753: JNI_CreateJavaVM on Mac OSX 10.9 Mavericks corrupts the callers stack size
Thu, 24 Oct 2013 10:02:02 +0200 farvidsson 8024423: JVMTI: GetLoadedClasses doesn't enumerate anonymous classes
Fri, 25 Oct 2013 13:43:39 -0700 amurillo 8027173: new hotspot build - hs25-b57
Thu, 31 Oct 2013 16:31:31 -0700 lana Merge
Wed, 30 Oct 2013 13:43:16 -0700 lana Merge
Mon, 28 Oct 2013 12:25:44 -0700 lana Merge
Sat, 19 Oct 2013 18:32:34 -0400 acorn 8026893: Push 8026365 to TL early and add test
Thu, 31 Oct 2013 12:36:10 -0700 cl Added tag jdk8-b114 for changeset 7fd913010dbb
Tue, 29 Oct 2013 14:56:30 -0700 katleman Mergejdk8-b114
Mon, 28 Oct 2013 16:02:40 -0700 katleman Merge
Thu, 24 Oct 2013 20:47:18 -0400 dholmes 8025673: [macosx] Disable X11 AWT toolkit
Fri, 25 Oct 2013 13:29:18 -0700 amurillo Added tag hs25-b56 for changeset 82a9cdbf683e
Fri, 25 Oct 2013 13:29:17 -0700 amurillo Mergehs25-b56
Fri, 25 Oct 2013 08:38:42 -0700 jcoomes Merge
Wed, 23 Oct 2013 10:23:06 +0200 tschatzl 8025728: Missing volatile specifier for field G1AllocRegion::_alloc_region
Tue, 22 Oct 2013 12:03:50 -0700 jcoomes Merge
Tue, 22 Oct 2013 11:50:12 +0200 sjohanss 8026848: -XX:+G1SummarizeRSetStats can result in wrong exit code and crash
Mon, 21 Oct 2013 14:20:47 +0200 ehelin 8025834: NPE in Parallel Scavenge with -XX:+CheckUnhandledOops
Mon, 21 Oct 2013 01:04:01 -0700 stefank Merge
Mon, 21 Oct 2013 09:34:10 +0200 stefank 8026781: Add missing test to exercise -XX:+UseLargePagesInMetaspace
Fri, 18 Oct 2013 09:31:59 +0200 mgerdin 8026698: Incorrect error handling in Metaspace::allocate
Tue, 15 Oct 2013 13:56:46 +0200 mgerdin 8015255: NPG: Don't waste fragment at the end of a VirtualSpaceNode before retiring it.
Thu, 24 Oct 2013 16:25:24 -0700 iveresov Merge
Thu, 24 Oct 2013 16:14:28 -0700 iveresov Merge
Thu, 24 Oct 2013 19:32:34 +0200 roland 8026978: JSR292: fatal error: Type profiling not implemented on this platform
Wed, 23 Oct 2013 20:20:03 +0400 vlivanov 8012941: JSR 292: too deep inlining might crash compiler because of stack overflow
Wed, 23 Oct 2013 20:15:24 +0400 sspitsyn 8023004: JSR 292: java.lang.RuntimeException: Original target method was called.
Tue, 15 Oct 2013 08:38:35 +0200 anoll 8025740: Typo. Error line for wrong ReservedCodeCacheSize value is printed twice
Fri, 18 Oct 2013 10:41:56 +0200 rbackman 8026844: Various Math functions needs intrinsification
Wed, 23 Oct 2013 16:25:48 -0700 iveresov Merge
Wed, 23 Oct 2013 15:44:12 -0700 twisti 8026502: java/lang/invoke/MethodHandleConstants.java fails on all platforms
Wed, 23 Oct 2013 11:15:24 -0700 iveresov 8026495: JVM Crashes when started with -XX:+DTraceMethodProbes on Solaris x86_64
Wed, 23 Oct 2013 19:22:28 +0000 adlertz Merge
Wed, 23 Oct 2013 10:44:12 +0200 adlertz 8026939: assert(Reachblock != NULL) failed: Reachblock must be non-NULL
Wed, 23 Oct 2013 12:40:23 +0200 roland 8024070: C2 needs some form of type speculation
Wed, 23 Oct 2013 10:00:39 +0200 anoll 8026407: VM crashes on linux-ppc and linux-i586 when there is not enough ReservedCodeCacheSize specified
Tue, 22 Oct 2013 14:02:15 +0000 rbackman Merge
Mon, 21 Oct 2013 15:31:16 +0200 rbackman 8026959: assert(!n->pinned() || n->is_MachConstantBase()) failed: only pinned MachConstantBase node is expected here
Tue, 22 Oct 2013 09:51:47 +0200 roland 8026251: New type profiling points: parameters to methods
Mon, 21 Oct 2013 17:34:27 -0700 iveresov Merge
Mon, 21 Oct 2013 09:21:41 +0400 iignatyev 8026865: [TESTBUG] 'compiler/print/PrintInlining.java' should specify -XX:+UnlockDiagnosticVMOptions
Sat, 19 Oct 2013 22:22:05 -0700 iveresov Merge
Sat, 19 Oct 2013 21:54:46 +0400 iignatyev 8023318: compiler/whitebox tests timeout with enabled TieredCompilation
Sat, 19 Oct 2013 21:54:44 +0400 iignatyev 8026414: [TESTBUG] Tests for Tiered/NonTiered levels
Sat, 19 Oct 2013 12:16:43 +0200 roland 8024069: replace_in_map() should operate on parent maps
Fri, 18 Oct 2013 12:15:32 -0700 morris 8008242: VerifyOops is broken on SPARC
Fri, 18 Oct 2013 09:36:35 +0000 adlertz Merge
Fri, 18 Oct 2013 10:50:17 +0200 adlertz 8022783: Nashorn test fails with: assert(!def_outside->member(r))
Thu, 17 Oct 2013 19:47:04 +0200 anoll 8026708: guarantee(codelet_size > 0 && (size_t)codelet_size > 2*K) failed: not enough space for interpreter generation
Thu, 24 Oct 2013 17:20:39 -0400 ccheung Merge
Wed, 23 Oct 2013 10:24:28 +0200 farvidsson 8026808: serviceability/sa/jmap-hprof/JMapHProfLargeHeapTest.java failed with unexpected exit value
Tue, 22 Oct 2013 22:14:57 -0400 hseigel Merge
Tue, 22 Oct 2013 15:54:50 -0400 hseigel 8026809: [TESTBUG] Create regression test for JDK-8026041
Tue, 22 Oct 2013 16:09:17 -0700 iklam Merge
Tue, 22 Oct 2013 14:29:02 -0700 iklam 8014910: deadlock between JVM/TI ClassPrepare event handler and CompilerThread
Tue, 22 Oct 2013 14:47:59 -0400 hseigel 8026394: Eclipse fails with JDK8 build 111
Mon, 21 Oct 2013 17:26:46 -0700 ccheung Merge
Sat, 19 Oct 2013 21:29:57 +0400 dsamersoff 8026930: In ManagementAgent.start it should be possible to set the jdp.name parameter (hotspot part)
Fri, 18 Oct 2013 19:44:40 -0700 ccheung Merge
Fri, 18 Oct 2013 10:37:26 +0000 dsamersoff Merge
Thu, 17 Oct 2013 17:01:04 +0000 dsamersoff Merge
Thu, 17 Oct 2013 16:45:08 +0400 dsamersoff 8005810: Update Hotspot Serviceability Agent for Method Parameter Reflection and Generic Type Signature Data
Thu, 17 Oct 2013 12:15:14 -0400 sla Merge
Thu, 17 Oct 2013 16:11:26 +0200 erikj 8026792: HOTSPOT: licensee reports a JDK8 build failure after 8005849/8005008 fixes integrated.
Thu, 17 Oct 2013 16:08:01 +0400 dsamersoff 8025812: tmtools/jmap/heap_config tests fail on Linux-ia32 because it Cant attach to the core file
Wed, 16 Oct 2013 15:26:12 -0400 hseigel Merge
Wed, 16 Oct 2013 14:32:05 -0400 hseigel 8024804: Crash when InterfaceMethodref resolves to Object.registerNatives
Wed, 16 Oct 2013 15:06:39 +0200 simonis 8026703: Wrongly placed <xsl:import> element in Event-Based JVM Tracing .xsl files
Wed, 16 Oct 2013 09:20:23 +0200 farvidsson 8025638: jmap returns 0 instead of 1 when it fails.
Mon, 21 Oct 2013 22:36:43 -0400 dholmes Merge
Mon, 21 Oct 2013 21:06:20 -0400 dholmes Merge
Mon, 21 Oct 2013 20:51:03 -0400 dholmes 8026872: [TESTBUG] Classes OOMCrashClass4000_1.class and OOMCrashClass1960_2.class from runtime/ClassFile/ tests won't run on compact profiles
Mon, 21 Oct 2013 14:38:11 -0700 amurillo 8023496: [jprt] build and test solaris 64-bits only
Sat, 19 Oct 2013 08:52:21 -0700 amurillo 8026928: new hotspot build - hs25-b56
Thu, 24 Oct 2013 09:10:27 -0700 cl Added tag jdk8-b113 for changeset 4589b398ab03