log

age author description
Fri, 19 Aug 2016 11:32:43 -0400 acorn 8163808: Fix asserts and logging for old classfile vtable construction
Fri, 19 Aug 2016 18:20:22 +0200 ctornqvi Merge
Fri, 19 Aug 2016 10:06:30 -0400 ctornqvi 8157957: ClassNotFoundException: jdk.test.lib.JDKToolFinder
Fri, 19 Aug 2016 16:02:21 +0200 erikj 8164297: Jtreg test exeinvoke fails to link on Ubuntu
Fri, 19 Aug 2016 01:20:39 -0400 ysuenaga 8164319: CLHSDB dumpcodecache throws StackOverflowError
Thu, 18 Aug 2016 21:37:26 -0400 dholmes 8152849: share/vm/runtime/mutex.cpp:1161 assert(((uintptr_t(_owner))|(uintptr_t(_LockWord.FullWord))|(uintptr_t(_EntryList))|(uintptr_t(_WaitSet))|(uintptr_t(_OnDeck))) == 0) failed
Thu, 18 Aug 2016 10:47:09 -0400 coleenp 8037138: x86: problem with JVMTI breakpoint
Thu, 18 Aug 2016 11:11:40 +0000 dsamersoff Merge
Thu, 18 Aug 2016 14:07:00 +0300 dsamersoff 8157236: attach on ARMv7 fails with com.sun.tools.attach.AttachNotSupportedException: Unable to open socket file
Thu, 18 Aug 2016 12:10:18 +0300 dsamersoff 8151345: compiler/codecache/jmx/PeakUsageTest.java is failing on jdk9/dev for JPRT -testset hotspot
Tue, 30 Aug 2016 17:48:27 -0700 mchung 8160851: Remove old launcher module-related options
Thu, 25 Aug 2016 22:36:30 +0000 lana Mergejdk-9+134
Thu, 25 Aug 2016 21:18:44 +0000 lana Added tag jdk-9+133 for changeset a25e0fb60332
Fri, 19 Aug 2016 17:19:47 +0200 jwilhelm 8164124: [BACKOUT] G1 does not implement millis_since_last_gc which is needed by RMI GC
Fri, 19 Aug 2016 11:22:14 -0700 amurillo Mergejdk-9+133
Tue, 16 Aug 2016 09:56:18 -0400 hseigel 8030221: Checking for anonymous class should check for NULL as well as potential nesting
Mon, 15 Aug 2016 13:14:08 -0700 cjplummer 8133740: NMT for Linux/x86/x64 and bsd/x64 slowdebug builds includes NativeCallStack::NativeCallStack() frame in backtrace
Mon, 15 Aug 2016 13:13:48 -0700 cjplummer 8133747: NMT includes an extra stack frame due to assumption NMT is making on tail calls being used
Mon, 15 Aug 2016 13:06:50 -0700 cjplummer 8133749: os::current_frame() is not returning the proper frame on ARM and solaris-x64
Mon, 15 Aug 2016 16:15:16 +0200 erikj 8069540: Remove universal binaries support from hotspot build
Tue, 09 Aug 2016 21:57:29 +0900 ysuenaga 8163185: jhsdb jstack cannot work with normal mode
Fri, 12 Aug 2016 14:12:55 -0700 amurillo Merge
Fri, 12 Aug 2016 08:46:17 -0700 fparain 8146697: VM crashes in test Test7005594
Fri, 12 Aug 2016 00:19:44 -0400 dholmes 8159461: bigapps/Kitchensink/stressExitCode hits assert: Must be VMThread or JavaThread
Thu, 11 Aug 2016 16:22:08 -0700 iveresov Merge
Tue, 09 Aug 2016 16:47:47 +0300 dpochepk 8160299: Test8015436 doesn't check which method was executed
Tue, 09 Aug 2016 14:17:28 +0300 dpochepk 8163366: compiler/codecache/jmx/ThresholdNotificationsTest.java doesn't set -XX:+UnlockDiagnosticVMOptions while using WB
Tue, 09 Aug 2016 14:16:44 +0300 dpochepk 8160083: compiler.codecache.jmx.InitialAndMaxUsageTest can not be used w/ disabled SegmentedCodeCache
Mon, 08 Aug 2016 17:06:21 +0200 dnsimon 8163105: SIGSEGV: constantPoolHandle::constantPoolHandle(ConstantPool*)
Mon, 08 Aug 2016 11:30:46 +0300 dpochepk 8163243: [TESTBUG] compiler/codecache/jmx/UsageThresholdIncreasedTest.java failed with: Failed to find sun/hotspot/WhiteBox.class
Sat, 06 Aug 2016 11:52:37 -0700 iveresov 8163313: assert(comp != __null) failed: compiler not available
Fri, 05 Aug 2016 13:37:53 -0700 iveresov Merge
Fri, 05 Aug 2016 16:23:44 +0300 dpochepk 8157498: compiler/codecache/jmx/InitialAndMaxUsageTest.java times out on 32-bit platforms
Fri, 05 Aug 2016 16:22:30 +0300 dpochepk 8161279: Various JMX-tests timed out
Thu, 04 Aug 2016 22:42:05 -0400 mdoerr 8162369: PPC64: Wrong ucontext used after SIGTRAP while in HTM critical section
Thu, 04 Aug 2016 10:34:34 +0200 thartmann 8136818: Test compiler/arraycopy/TestEliminatedArrayCopyDeopt.java fails with "m1 failed"
Thu, 04 Aug 2016 08:58:22 +0200 thartmann 8162881: Effect of -XX:CICompilerCount depends on ordering of other flags
Wed, 03 Aug 2016 15:52:38 +0000 never Merge
Tue, 02 Aug 2016 17:12:16 -0700 never 8162477: [JVMCI] assert(wf.check_method_context(ctxk, m)) failed: proper context
Tue, 02 Aug 2016 19:46:29 -0700 kvn 8163018: Slow compiler tests in JPRT
Thu, 11 Aug 2016 21:35:09 +0200 dcubed Merge
Thu, 11 Aug 2016 16:13:05 +0000 lfoltan Merge
Thu, 11 Aug 2016 11:41:11 -0400 lfoltan 8162553: Crash in class unloading due to null CLD having a zero _keep_alive value
Thu, 11 Aug 2016 17:47:25 +0300 dsamersoff 8163143: illegal bci error with interpreted frames in SA due to mirror being stored in interpreted frames
Wed, 10 Aug 2016 21:02:14 -0400 ysuenaga 8163580: Cannot get Monitor Cache Dump in HSDB
Wed, 10 Aug 2016 09:24:42 +0200 rehn 8161026: GPL header missing comma in year
Thu, 18 Aug 2016 21:33:36 +0000 lana Merge
Thu, 18 Aug 2016 21:01:21 +0000 lana Added tag jdk-9+132 for changeset 713951c08aa2
Tue, 16 Aug 2016 08:08:00 -0700 amurillo Merge
Thu, 11 Aug 2016 12:27:20 -0700 dcubed 8163879: quarantine serviceability/sa/sadebugd/SADebugDTest.java since it hangs intermittently
Fri, 12 Aug 2016 13:58:14 -0700 amurillo Merge
Mon, 08 Aug 2016 15:53:02 +0000 dsamersoff Merge
Mon, 08 Aug 2016 21:59:12 +0900 ysuenaga 8163272: jhsdb jinfo cannot show system properties
Mon, 08 Aug 2016 17:15:46 +0300 dsamersoff 8163269: Testcase missed in push for JDK-8160817
Fri, 05 Aug 2016 09:58:09 -0700 amurillo Merge
Thu, 04 Aug 2016 16:11:49 -0700 cjplummer 8162670: make of jtreg_tests fails if no tests are run, causing jprt test runs to also fail
Thu, 04 Aug 2016 23:17:33 +0200 mockner Merge
Thu, 04 Aug 2016 12:55:28 -0400 mockner 8145543: JPRT jobs see intermittent failures in compiler/floatingpoint/ModNaN.java
Thu, 04 Aug 2016 19:50:23 +0000 coleenp Merge
Thu, 04 Aug 2016 10:11:35 -0700 gthornbr 8162999: Build give extraneous find warnings
Thu, 04 Aug 2016 20:28:12 +0200 mockner Merge
Thu, 04 Aug 2016 18:34:40 +0200 mockner Merge
Thu, 04 Aug 2016 12:24:10 -0400 mockner 8159917: Space character is missing in ClassLoaderData::print_value_on
Thu, 04 Aug 2016 14:04:14 +0300 lmesnik 8162852: Mark stress compiler and gc tests with stress keyword
Wed, 03 Aug 2016 15:55:40 -0700 iveresov Merge
Tue, 02 Aug 2016 11:06:25 -0700 dlong 8029441: assert(!((nmethod*)_cb)->is_deopt_pc(_pc)) failed: invariant broken
Mon, 01 Aug 2016 22:34:23 -0700 kvn Merge
Sat, 30 Jul 2016 04:05:28 -0700 roland 8161652: Crash with assert(ft == _type) failed in PhiNode::Value()
Wed, 03 Aug 2016 13:56:27 -0700 cjplummer 8161030: GPL header missing comma after year
Wed, 03 Aug 2016 09:40:21 -0400 coleenp 8159284: bigapps/Jetty - assert(jfa->last_Java_sp() > sp()) failed with JFR in use
Tue, 02 Aug 2016 20:55:27 -0700 dcubed Merge
Tue, 02 Aug 2016 13:48:07 -0700 gthornbr 8161696: [TESTBUG] runtime/StackGuardPages/testme.sh uses invalid argument -Xss328k
Wed, 03 Aug 2016 02:10:23 +0000 jprovino Merge
Tue, 02 Aug 2016 16:39:33 -0400 jprovino 8071770: G1 does not implement millis_since_last_gc which is needed by RMI GC
Fri, 12 Aug 2016 08:59:20 -0700 mhaupt 8163533: jdk.vm.ci.hotspot.test.MethodHandleAccessProviderTest fails on jdk9/devjdk-9+132
Thu, 11 Aug 2016 17:02:27 +0000 lana Merge
Thu, 11 Aug 2016 15:47:07 +0000 lana Added tag jdk-9+131 for changeset 943bf73b49c3
Wed, 10 Aug 2016 15:48:04 -0700 hseigel 8136930: Simplify use of module-system options by custom launchers
Fri, 05 Aug 2016 09:50:25 -0700 amurillo Mergejdk-9+131
Tue, 02 Aug 2016 16:24:04 -0400 dholmes 7008747: Header files with conditional behaviour can not be precompiled
Tue, 02 Aug 2016 15:22:41 +0300 mchernov 8161604: TestNewSizeFlags fails with RuntimeException: max new size != MaxNewSize value
Mon, 01 Aug 2016 20:47:51 -0700 kvn Merge
Fri, 29 Jul 2016 17:41:14 +0300 tpivovarova 8161138: testlibrary_tests/ctw/* failed with "Failed. Unexpected exit from test [exit code: 0]"
Mon, 01 Aug 2016 20:41:15 -0400 clanger 8162869: Small fixes for AIX perf memory and attach listener
Mon, 01 Aug 2016 16:28:23 -0400 coleenp 8161445: [BACKOUT] MemberNameTable doesn't purge stale entries
Mon, 01 Aug 2016 15:38:58 +0300 dsamersoff 8160817: Add jsadebugd functionality to jhsdb
Mon, 01 Aug 2016 10:51:22 +0300 dsamersoff 8158050: Remove SA-JDI
Fri, 29 Jul 2016 16:50:45 -0700 amurillo Merge
Fri, 29 Jul 2016 16:11:55 -0700 amurillo Merge
Fri, 29 Jul 2016 20:23:24 +0000 jmasa Merge
Wed, 08 Jun 2016 14:11:51 -0700 jmasa 8159073: : Error handling incomplete when creating GC threads lazily
Fri, 29 Jul 2016 11:38:07 -0700 dcubed 8161601: Solaris: __USE_LEGACY_PROTOTYPES__ is redundant and should be removed
Fri, 29 Jul 2016 08:17:43 +0000 rbackman Merge
Fri, 29 Jul 2016 09:23:05 +0200 rbackman Merge
Thu, 28 Jul 2016 16:09:31 +0300 dpochepk 8162603: Unrecognized VM option 'UseCountedLoopSafepoints'
Thu, 28 Jul 2016 08:19:35 +0000 zmajo Merge
Wed, 27 Jul 2016 12:33:33 +0200 roland 8162384: Performance regression: bimorphic inlining may be bypassed by type speculation
Wed, 27 Jul 2016 10:56:01 -0700 dlong 8160742: Node::operator new invokes undefined behavior
Wed, 20 Jul 2016 12:34:11 +0200 goetz 8161907: adlc: Fix crash in cisc_spill_match if _rChild == NULL
Mon, 25 Jul 2016 14:31:42 -0700 roland 8161147: jvm crashes when -XX:+UseCountedLoopSafepoints is enabled
Thu, 23 Jun 2016 17:58:59 +0000 aph 8157306: Random infrequent null pointer exceptions in javac
Mon, 25 Jul 2016 21:02:51 +0300 dpochepk 8162376: TestSHA512Intrinsics.java failed with Unexpected count of intrinsic _sha5_implCompress is expected
Fri, 22 Jul 2016 12:47:08 -1000 twisti 8162427: fix indent in CompileTask::print_tty
Mon, 18 Jul 2016 20:45:51 +0200 roland 8161651: Logic in ConnectionGraph::split_unique_types() wrongly assumes node always have memory input
Fri, 22 Jul 2016 17:52:03 +0000 dnsimon Merge
Wed, 20 Jul 2016 22:18:13 +0000 dnsimon 8161265: [JVMCI] EnableJVMCI should only be required when its not implied by other flags
Fri, 22 Jul 2016 17:05:08 +0100 aph 8161190: AArch64: Fix overflow in immediate cmp instruction
Wed, 20 Jul 2016 19:35:08 +0300 dpochepk 8071652: -XX:CompileOnly does not behave as documented
Wed, 20 Jul 2016 19:33:22 +0300 dpochepk 8161695: compiler/jsr292/MHInlineTest.java can't be run on client-only platforms
Wed, 20 Jul 2016 19:31:34 +0300 dpochepk 8158756: [Testbug] serviceability/dcmd/compiler/CompilerQueueTest.java fails with TieredStopAtLevel=1
Wed, 20 Jul 2016 19:29:10 +0300 dpochepk 8161508: JVMCI: MaterializeVirtualObjectTest fails w/ "CASE: invalidate=true: has no virtual object before materialization
Tue, 19 Jul 2016 18:17:40 -0700 never 8161603: [JVMCI] HotSpotVMConfig.baseVtableLength is incorrectly computed
Tue, 19 Jul 2016 18:59:11 +0000 dnsimon 8161274: [JVMCI] compiler/jvmci/events/JvmciNotifyInstallEventTest.java fails with NoClassDefFound
Tue, 19 Jul 2016 18:11:03 +0000 never 8161292: [JVMCI] missing test files from 8159368
Tue, 19 Jul 2016 13:15:46 +0200 rbackman Merge
Thu, 23 Jun 2016 22:33:46 +0200 goetz 8160245: C1: Clean up platform #defines in c1_LIR.hpp.
Thu, 14 Jul 2016 20:11:55 +0300 dpochepk 8157861: [TESTBUG] compiler/jvmci/compilerToVM/ReprofileTest.java failed with RuntimeException
Thu, 14 Jul 2016 20:10:16 +0300 dpochepk 8157984: [TESTBUG] Several compiler tests fails when are executed with -XX:TieredStopAtLevel=1
Thu, 14 Jul 2016 14:44:53 +0000 tpivovarova Merge
Wed, 13 Jul 2016 18:03:15 +0300 tpivovarova 8151280: update hotspot tests to use vm.compMode instead of their own logic