log

age author description
Thu, 14 Jun 2018 20:20:14 -0700 vromero update unit tests after last API changejep-334
Thu, 14 Jun 2018 14:59:06 -0700 vromero dont add readResolve if readObject is implemented, plus adding more cases to test CheckReadResolveMethodTestdatum
Thu, 14 Jun 2018 14:58:13 -0700 vromero manual merge with defaultdatum
Thu, 14 Jun 2018 13:27:14 -0700 vromero manual merge with jep-334 branchcondy-folding
Thu, 14 Jun 2018 21:49:46 +0200 stuefe 8203343: VM.{metaspace|classloaders|classhierarchy...} jcmd should show invocation targets for Generated{Method|Constructor}AccessorImpl classes
Wed, 13 Jun 2018 16:32:02 -0700 lmesnik 8203491: [TESTBUG] Port heapdump tests into java
Thu, 14 Jun 2018 09:31:59 -0700 darcy 8205003: Replace selected link tags with linkplain in java.lang.Class
Thu, 14 Jun 2018 10:33:54 -0400 hseigel 8204620: ModuleEntry::is_non_jdk_module() determination for what is a jdk module is incorrect
Thu, 14 Jun 2018 05:50:21 -0700 bsrbnd 8203813: javac accepts an illegal name as a receiver parameter name
Thu, 14 Jun 2018 09:38:31 -0300 jlaskey 8204172: Predicate::not should explicitly mention "NullPointerException - if target is null"
Thu, 14 Jun 2018 13:16:21 +0200 jlahoda 8196618: Create API to list supported values for javac --release option
Thu, 14 Jun 2018 13:07:33 +0200 tschatzl 8204169: Humongous continues region remembered set states do not match the one from the corresponding humongous start region
Thu, 14 Jun 2018 11:13:39 +0100 mcimadamore 8178150: Regression in logic for handling inference stuck constraints
Thu, 14 Jun 2018 11:13:30 +0200 lkorinth 8202740: runtime/8176717/TestInheritFD.java fails with java.lang.RuntimeException: could not match: VM RESULT => RETAINS FD
Thu, 14 Jun 2018 11:46:53 +0200 ihse 8204664: PrepareFailureLogs should be done after sequential make targets
Thu, 14 Jun 2018 11:22:04 +0200 thartmann 8205034: [BACKOUT] Induction variable of over-unrolled loop conflicts with range checks
Thu, 14 Jun 2018 16:56:58 +0900 ysuenaga 8204531: Remove unused chars following '\0'
Thu, 14 Jun 2018 00:07:10 -0700 epavlova 8204978: [Graal] Disable Epsilon GC tests from running with Graal
Thu, 14 Jun 2018 09:04:55 +0200 thartmann 8203915: Induction variable of over-unrolled loop conflicts with range checks
Thu, 14 Jun 2018 02:01:31 -0400 dholmes 8204668: Cleanup management of the java.vm.info System property
Thu, 14 Jun 2018 07:26:27 +0200 rehn 8204613: StringTable: Calculates wrong number of uncleaned items.
Thu, 14 Jun 2018 09:48:04 +0800 amlu 8204944: Remove java/util/Map/InPlaceOpsCollisions.java from ProblemList
Thu, 14 Jun 2018 02:49:19 +0200 jwilhelm Added tag jdk-11+18 for changeset e1b3def12624
Wed, 13 Jun 2018 13:12:50 -0700 bpb 8204915: (fs) Add some print diagnostics to java/nio/file/Files/CopyAndMove.java
Wed, 13 Jun 2018 12:50:45 -0700 joehw 8201276: (fs) Add methods to Files for reading/writing a string from/to a file
Wed, 13 Jun 2018 10:36:13 -0700 dtitov 8203809: [Graal] JDI tests fail with: JDITestRuntimeException : ** event IS NOT a breakpoint **
Wed, 13 Jun 2018 07:53:27 +0200 stuefe 8204935: [aix] TOC overflow in libjvm.so (release build)
Wed, 13 Jun 2018 20:11:18 +0200 stuefe 8204663: clean up remaining native parts after JDK-8187631
Wed, 13 Jun 2018 13:48:39 -0400 bobv Merge
Wed, 13 Jun 2018 13:44:56 -0400 bobv Merge
Tue, 12 Jun 2018 18:53:38 -0400 bobv Merge
Tue, 12 Jun 2018 18:51:45 -0400 bobv 8203357: Container Metrics
Tue, 12 Jun 2018 18:44:01 -0400 bobv 8203691: Test /runtime/containers/cgroup/PlainRead.java fails
Wed, 13 Jun 2018 10:47:14 -0700 erikj 8204922: Create bootcycle jib profiles
Tue, 12 Jun 2018 22:23:35 -0700 vtheeyarath 8204342: methods in java.time s TCKZoneRules OpenJDK test miss Test annotation
Wed, 13 Jun 2018 08:44:23 -0700 rhalade 8204923: Restore Symantec root verisignclass2g2ca
Wed, 13 Jun 2018 15:08:08 +0200 eosterlund 8203344: Make C1 leal patchable on SPARC
Wed, 13 Jun 2018 12:52:21 +0200 jlahoda 8193302: Javac AssertionError: typeSig ERROR on usage of @Generated
Wed, 13 Jun 2018 10:34:51 +0200 glaubitz 8203301: Linux-sparc fails to build after JDK-8199712 (Flight Recorder)
Wed, 13 Jun 2018 10:15:35 +0200 rkennke 8204685: Abstraction for TLAB dummy object
Wed, 13 Jun 2018 10:01:53 +0200 rkennke 8203157: Object equals abstraction for BarrierSetAssembler
Wed, 13 Jun 2018 06:35:04 +0200 stuefe 8202772: NMT thread stack tracking causes crashes on AIXjdk-11+18
Tue, 12 Jun 2018 21:29:47 -0700 kvn 8201193: Use XMM/YMM for objects initialization
Mon, 11 Jun 2018 14:06:50 -0700 cushon 8203679: AssertionError in DeferredAttr with parenthesized method reference
Tue, 12 Jun 2018 18:12:59 -0400 kbarrett 8204585: Remove IN_ARCHIVE_ROOT from Access API
Tue, 12 Jun 2018 14:08:24 -0700 bchristi 8204565: (spec) Document java.{vm.}?specification.version system properties' relation to $FEATURE
Tue, 12 Jun 2018 13:24:37 -0700 smarks 8204243: remove Thread.destroy() and Thread.stop(Throwable)
Tue, 12 Jun 2018 11:34:48 -0700 rhalade 8196141: Add GoDaddy root certificates
Mon, 11 Jun 2018 15:32:43 +0100 aph 8204680: Disassembly does not display code strings in stubs
Tue, 12 Jun 2018 13:07:47 -0400 rriggs 8197930: JNI exception pending in initializeEncoding of jni_util.c
Tue, 12 Jun 2018 11:21:07 -0400 zgu 8204557: NMT: Linux os::committed_in_range() does not break out outer loop when contiguous region is found
Tue, 12 Jun 2018 17:40:28 +0200 pliden 8204210: Implementation: JEP 333: ZGC: A Scalable Low-Latency Garbage Collector (Experimental)
Tue, 12 Jun 2018 07:52:30 -0700 kvn 8204113: Upgrade linker used in AOT tests to be same version as build toolchain
Tue, 12 Jun 2018 15:03:00 +0200 shade 8204180: Implementation: JEP 318: Epsilon, A No-Op Garbage Collector
Tue, 12 Jun 2018 18:30:52 +0530 sdama 8204861: fix for 8196993 has broken the build on linux
Tue, 12 Jun 2018 10:01:23 +0200 shade 8204850: BarrierSet::make_* should be static
Tue, 12 Jun 2018 11:11:59 +0000 adinn Merge
Tue, 12 Jun 2018 10:27:49 +0000 aph 8204606: [Aarch64] SIGSEGVs caused by C1 because of improper register usage
Tue, 12 Jun 2018 12:14:46 +0200 jlahoda 8204674: Inconsistent lambda parameter span
Sun, 10 Jun 2018 20:53:10 +0100 smonteith 8204628: [AArch64] Assertion failure in BarrierSetAssembler::load_at
Wed, 30 May 2018 14:46:17 +0200 goetz 8204477: Count linkage errors and print in Exceptions::print_exception_counts_on_error
Wed, 30 May 2018 14:46:17 +0200 goetz 8204476: Add additional statistics to CodeCache::print_summary
Tue, 12 Jun 2018 14:16:41 +0530 sdama 8196993: Resolve disabled warnings for libunpack
Mon, 11 Jun 2018 22:35:07 -0400 kbarrett 8204097: Simplify OopStorage::AllocateList block entry access
Tue, 12 Jun 2018 08:51:28 +0800 xyin 8201528: Add new test to check for package versioning information in OpenJDK
Tue, 12 Jun 2018 01:31:49 +0200 erikj 8204127: Change bundle format on Windows to zip
Mon, 11 Jun 2018 21:56:58 +0000 valeriep 8178374: Problematic ByteBuffer handling in CipherSpi.bufferCrypt method
Mon, 11 Jun 2018 14:29:38 -0700 epavlova 8204694: Add failed compiler/stable tests into ProblemList-graal.txt
Mon, 11 Jun 2018 19:39:05 +0000 valeriep 8194073: Invalid SunNativeProvider.INSTANCE initialization
Mon, 11 Jun 2018 20:18:38 +0200 ihse 8204682: Parsing for LOG=report=none is broken when combined with other keywords
Mon, 11 Jun 2018 19:09:15 +0200 simonis 8204684: [AIX] Build of libjli_static broken after change 8204572 (SetupJdkLibrary)
Mon, 11 Jun 2018 09:40:20 -0700 ccheung 8204563: UseAppCDS obsolete message confusing
Fri, 08 Jun 2018 14:14:44 +0200 mbaesken 8204598: add more thread-related system settings info to hs_error file on Linux
Mon, 11 Jun 2018 14:16:43 +0200 roland 8202747: C2: assert(mode == ControlAroundStripMined && use == sfpt) failed: missed a node
Sun, 10 Jun 2018 17:26:13 +0200 goetz 8204652: [aix] fix thread stack allocation, too big stack sizes not recognized
Mon, 11 Jun 2018 12:09:59 +0200 tschatzl 8204618: The parallel GC reference processing task executor enqueues a wrong number of tasks into the queue
Mon, 11 Jun 2018 12:09:57 +0200 tschatzl 8204617: ParallelGC parallel reference processing does not set MT degree in reference processor
Sun, 10 Jun 2018 12:58:38 +0300 dsamersoff 8202705: ARM32 build crashes on long JavaThread offsets
Sat, 09 Jun 2018 20:57:43 -0700 mchung 8204648: test/jdk/tools/launchers/SourceMode.java fails with long shebang line
Fri, 08 Jun 2018 15:24:51 -0700 jjg 8204588: Test failures after "Launch Single-File Source-Code Programs"
Mon, 04 Jun 2018 15:11:17 +0200 rkennke 8203172: Primitive heap access for interpreter BarrierSetAssembler/aarch64
Fri, 08 Jun 2018 13:32:51 -0700 prr Merge
Fri, 08 Jun 2018 12:51:46 -0700 prr Merge
Fri, 08 Jun 2018 12:52:50 +0530 psadhukhan 8202864: [TESTBUG] Need to replace the image used in two Swing tests
Thu, 07 Jun 2018 11:35:42 -0700 prr 8204126: MonospacedGlyphWidthTest.java failed again
Wed, 06 Jun 2018 15:37:10 -0700 serb 8203224: java.awt.desktop.*Event classes could not be instantiated if Desktop feature is not supported
Wed, 06 Jun 2018 13:16:12 -0700 erikj 8200132: Remove jre images and bundles
Wed, 06 Jun 2018 13:04:25 -0700 prr 8204187: Remove proprietary JPEG code from javax.imageio
Wed, 06 Jun 2018 12:51:44 -0700 prr 8203796: Define API to support specifying ownership of print dialogs
Wed, 06 Jun 2018 12:35:44 -0700 prr 8204496: backout fix for 8203796 which was pushed under another ID
Wed, 06 Jun 2018 10:44:27 -0700 prr 8203499: Uninitialised memory in WinAccessBridge.cpp
Wed, 06 Jun 2018 09:41:16 -0700 prr Merge
Mon, 04 Jun 2018 16:11:21 +0200 mbaesken 8204211: windows : handle potential C++ exception in GDIRenderer
Tue, 05 Jun 2018 14:42:21 -0700 prr 8203499: Uninitialised memory in WinAccessBridge.cpp
Mon, 04 Jun 2018 20:32:19 -0700 serb 8196030: AWT Robot mouseMove fails on Windows 10 1709 with HiDPI
Mon, 04 Jun 2018 19:36:28 -0700 serb 8204118: [macos] Nonsensical self == [super init] in CFileDialog.m
Mon, 04 Jun 2018 19:01:16 -0700 serb 8203308: Remove the appletviewer classes
Mon, 04 Jun 2018 10:54:20 -0700 prr 8203367: Upgrade to freetype 2.9.1
Wed, 09 Aug 2017 14:54:37 -0700 naoto 8202088: Japanese new era implementation
Fri, 08 Jun 2018 11:38:40 -0700 dl 8204375: Add TimeUnit#convert(Duration)
Fri, 08 Jun 2018 11:04:58 -0700 ccheung 8204110: serviceability/sa/ClhsdbSymbol.java and ClhsdbInspect.java failed when running in CDS mode
Fri, 08 Jun 2018 10:09:40 -0700 sherman 8204229: Formatter and String.format ignore the width with the percent modifier (%5%)
Fri, 08 Jun 2018 09:37:52 -0700 martin 8204377: Rename Object#wait parameter name from "timeout" to "timeoutMillis"
Fri, 08 Jun 2018 09:36:10 -0700 martin 8204444: java.time cleanup
Fri, 08 Jun 2018 18:15:58 +0200 ihse 8204602: Add devkit for linux-arm32
Fri, 08 Jun 2018 18:11:32 +0200 ihse 8204572: SetupJdkLibrary should setup SRC and -I flags automatically
Fri, 08 Jun 2018 11:30:10 +0200 eosterlund 8204504: Fix for 8198285 breaks slowdebug builds
Fri, 08 Jun 2018 21:06:54 +0530 sdama 8196990: Resolve disabled warnings for libjli
Fri, 08 Jun 2018 16:33:40 +0100 mcimadamore 8204610: Compiler confused by parenthesized "this" in final fields assignments
Fri, 08 Jun 2018 08:30:18 -0700 mchung 8204584: jdeps generates illegal dot file containing ranksep=0,600000
Fri, 08 Jun 2018 07:58:19 -0700 bpb 8204576: (fs) java/nio/file/Files/CopyAndMove.java does not set isUnix = true on macOS
Fri, 08 Jun 2018 14:50:18 +0200 neliasso 8203425: assert(is_Loop()) failed: invalid node class
Fri, 08 Jun 2018 13:06:08 +0200 mbaesken 8204539: improve error messages in matchJavaTZ [windows]
Fri, 08 Jun 2018 11:41:43 +0200 shade 8204479: Bitwise AND on byte value sometimes produces wrong result
Fri, 08 Jun 2018 11:11:06 +0200 hannesw 8204290: Add check to limit number of capture groups
Fri, 08 Jun 2018 11:08:38 +0200 hannesw 8204288: Matching the end of a string followed by an empty greedy regex and a word boundary fails
Fri, 08 Jun 2018 10:22:26 +0200 simonis 8204335: [ppc] Assembler::add_const_optimized incorrect for some inputs
Thu, 07 Jun 2018 15:08:16 +0200 goetz 8204549: [aix][testbug] signal tests fail because vm can not start in primordial thread.
Fri, 08 Jun 2018 06:59:16 +0200 rrich 8204561: JVM_GetClassSigners: wrap signers oop in an objArrayHandle for subsequent safepoint
Thu, 07 Jun 2018 22:26:02 -0400 dholmes 8204589: ProblemList failing launcher tests