log

age author description
Tue, 02 Aug 2016 10:46:08 +0530 rchamyal 8144594: HiDPI: awt.Choice looks improperly (Win 8)
Mon, 01 Aug 2016 10:06:09 -0700 prr Merge
Fri, 29 Jul 2016 11:25:59 +0300 ssadetsky 8157827: AWT_Desktop/Automated/Exceptions/BasicTest loads incorrect GTK version when jdk.gtk.version=3
Fri, 29 Jul 2016 11:19:28 +0300 ssadetsky 8160448: Make GTK3 menus appearence similar to native.
Fri, 29 Jul 2016 11:14:05 +0300 ssadetsky 8161195: Regression: closed/javax/swing/text/FlowView/LayoutTest.java
Fri, 29 Jul 2016 11:08:34 +0300 ssadetsky 8016313: java.awt.Headless exception has no spec since its creation
Fri, 29 Jul 2016 11:04:52 +0300 ssadetsky 8117886: There is no tooltip while moving the mouse on the tray icon.
Fri, 29 Jul 2016 10:59:43 +0300 ssadetsky 8161273: [hidpi] The frame insets size is wrong on Linux HiDPI because it is not scaled.
Fri, 29 Jul 2016 10:56:30 +0300 ssadetsky 8160246: Regression: 4410243 reproducible with GTK LaF
Fri, 29 Jul 2016 10:50:49 +0300 ssadetsky 8161007: GPL header missing comma in year
Thu, 28 Jul 2016 10:27:46 -0700 ddehaven Merge
Thu, 28 Jul 2016 09:29:38 -0700 ddehaven Merge
Thu, 28 Jul 2016 09:54:55 -0700 prr 8056210: Move libawt file to windows directory
Thu, 28 Jul 2016 09:53:08 -0700 prr 8148477: Native memory leak in font layout subsystem
Thu, 28 Jul 2016 06:02:40 -0700 prr 8149714: [parfait] char array lengths don't match in awt_Font.cpp:1701
Wed, 27 Jul 2016 15:32:25 +0300 aivanov 8160664: JVM crashed with font manager on Solaris 12
Tue, 26 Jul 2016 11:50:19 -0700 prr 8162488: JDK should be updated to use LittleCMS 2.8
Tue, 26 Jul 2016 11:30:40 -0700 prr 8074827: Resolve disabled warnings for libjavajpeg
Tue, 26 Jul 2016 18:45:05 +0300 vadim 8162545: Mac build failure
Tue, 26 Jul 2016 15:55:22 +0300 serb 8159899: [TEST_BUG] Timeout in tests when OOM should be generated
Tue, 26 Jul 2016 14:54:26 +0300 vadim 8161742: [parfait] Uninitialised memory in isXTestAvailable of awt_Robot.c:65
Tue, 26 Jul 2016 14:19:40 +0300 vadim 8161733: [parfait] Memory leak in imageioJPEG.c:2803
Tue, 26 Jul 2016 14:19:15 +0300 vadim 8161740: [parfait] Memory leak in Java_sun_awt_UNIXToolkit_load_1gtk_1icon of awt_UNIXToolkit.c:132
Tue, 26 Jul 2016 14:18:43 +0300 vadim 8161761: [parfait] 2 JNI exception pending defect groups in GraphicsPrimitiveMgr.c
Tue, 26 Jul 2016 12:37:21 +0530 psadhukhan 6591280: getting IPP connection causes disabling jar caches
Mon, 25 Jul 2016 11:03:53 -0700 prr 7175487: Cannot customize font configuration on Linux
Mon, 25 Jul 2016 10:36:12 -0700 prr 8147542: ClassCastException when repainting after display resolution change
Mon, 25 Jul 2016 15:29:24 +0530 rchamyal 8147648: [hidpi] multiresolution image: wrong resolution variant is used as icon in the Unity panel
Fri, 22 Jul 2016 16:09:52 -0700 prr 8162429: Clean up obsolete font preferences for JDS.
Fri, 22 Jul 2016 16:07:45 -0700 prr 8162432: Clean up references in font code to old Solaris releases.
Fri, 22 Jul 2016 15:57:57 -0700 prr 8140314: Verify IIOMetadataFormat class on loading
Fri, 22 Jul 2016 14:32:49 -0700 bpb 8148454: [PIT] Failure of ReplaceMetadataTest on TIFF with IllegalStateException
Sat, 23 Jul 2016 02:08:17 +0530 jdv 8161902: [PIT][TEST_BUG]sun/awt/image/OffScreenImageSource/ImageConsumerUnregisterTest.java compilation fails
Fri, 22 Jul 2016 11:16:08 -0700 bpb 8149016: Misleading IllegalArgumentException message when a type that is neither LONG nor IFD pointer is supplied to TIFFField constructor
Fri, 22 Jul 2016 12:16:33 +0530 pkbalakr 8144709: [hidpi] [TestBug] java/awt/GridLayout/ChangeGridSize/ChangeGridSize.java, java/awt/GridLayout/ComponentPreferredSize/ComponentPreferredSize.java are failing
Fri, 22 Jul 2016 12:13:24 +0530 aghaisas 7096375: Swing ignores first click after decreasing system's time
Fri, 22 Jul 2016 10:53:01 +0530 psadhukhan 4882305: StreamPrintServ.getSupportedAttributeValues returns null for Orientation attr
Thu, 21 Jul 2016 12:27:27 -0700 dtitov 8156960: Deprecate JSObject.getWindow(Applet) method
Thu, 21 Jul 2016 20:30:18 +0530 rchamyal 8158918: setExtendedState(1) for maximized Frame results in state==7
Wed, 20 Jul 2016 17:08:04 +0200 simonis 4908075: Press shift and another key using robot does not trigger events properly - WinXP
Thu, 07 Jul 2016 16:21:45 +0200 goetz 8160974: [TESTBUG] Mark more headful tests with @key headful.
Wed, 20 Jul 2016 14:17:41 +0530 aniyogi 8161470: Failure javax/swing/JRadioButton/FocusTraversal/FocusTraversal.java
Wed, 20 Jul 2016 11:25:57 +0530 aniyogi 8160438: javax/swing/plaf/nimbus/8057791/bug8057791.java fails
Fri, 05 Aug 2016 18:16:45 +0530 sundar 8163256: jlink/plugins/ExcludeVMPluginTest.java failed with Selected VM server doesn't exist
Fri, 05 Aug 2016 09:42:05 +0530 sundar 8163116: jlink exclude VM plugin does not fully support cross platform image creation
Thu, 04 Aug 2016 14:29:27 -0700 bpb 8162902: Add some debugging output to test/java/nio/file/WatchService/DeleteInterference
Thu, 04 Aug 2016 17:49:12 +0000 amurillo Merge
Thu, 04 Aug 2016 19:39:42 +0530 sundar 8146721: FileCopierPlugin should not create fake module
Thu, 04 Aug 2016 16:05:37 +0300 igerasim 8163180: Typos around @code javadoc tag usage
Thu, 04 Aug 2016 15:45:24 +0800 amlu 8161024: Remove intermittent key from java/lang/Runtime/exec/LotsOfOutput.java
Wed, 03 Aug 2016 21:15:05 +0200 clanger 8162819: fix minor Javadoc issues and remove warnings in java.net.Socket
Wed, 03 Aug 2016 12:55:44 -0400 rriggs 8160151: java/lang/ProcessBuilder/Zombies.java failed with error "1 zombies!"
Wed, 03 Aug 2016 08:13:45 -0700 darcy 8162817: Annotation toString output not reusable for source input
Wed, 03 Aug 2016 13:32:59 +0800 amlu 8161970: Remove tools/jlink/JLinkOptimTest.java from ProblemList.txt
Wed, 03 Aug 2016 09:37:57 +0900 nishjain 8035133: Locale matching: Weight q=0 isn't handled correctly.
Tue, 02 Aug 2016 10:58:16 -0700 naoto 8162797: Code clean-up in IncludeLocalesPlugin
Tue, 02 Aug 2016 10:36:33 -0700 tidu 8160337: Remove intermittent key from sun/security/pkcs11/rsa/TestKeyPairGenerator.java
Tue, 02 Aug 2016 17:33:50 +0530 sundar 8159487: Add JAVA_VERSION, OS_NAME, OS_ARCH properties in release file
Thu, 04 Aug 2016 17:32:53 +0000 amurillo Added tag jdk-9+130 for changeset cd4f403f9618
Wed, 05 Jul 2017 22:02:42 +0200 duke Merge
Fri, 05 Aug 2016 09:50:25 -0700 amurillo Merge
Tue, 02 Aug 2016 16:24:04 -0400 dholmes 7008747: Header files with conditional behaviour can not be precompiled
Tue, 02 Aug 2016 15:22:41 +0300 mchernov 8161604: TestNewSizeFlags fails with RuntimeException: max new size != MaxNewSize value
Mon, 01 Aug 2016 20:47:51 -0700 kvn Merge
Fri, 29 Jul 2016 17:41:14 +0300 tpivovarova 8161138: testlibrary_tests/ctw/* failed with "Failed. Unexpected exit from test [exit code: 0]"
Mon, 01 Aug 2016 20:41:15 -0400 clanger 8162869: Small fixes for AIX perf memory and attach listener
Mon, 01 Aug 2016 16:28:23 -0400 coleenp 8161445: [BACKOUT] MemberNameTable doesn't purge stale entries
Mon, 01 Aug 2016 15:38:58 +0300 dsamersoff 8160817: Add jsadebugd functionality to jhsdb
Mon, 01 Aug 2016 10:51:22 +0300 dsamersoff 8158050: Remove SA-JDI
Fri, 29 Jul 2016 16:50:45 -0700 amurillo Merge
Fri, 29 Jul 2016 16:11:55 -0700 amurillo Merge
Fri, 29 Jul 2016 20:23:24 +0000 jmasa Merge
Wed, 08 Jun 2016 14:11:51 -0700 jmasa 8159073: : Error handling incomplete when creating GC threads lazily
Fri, 29 Jul 2016 11:38:07 -0700 dcubed 8161601: Solaris: __USE_LEGACY_PROTOTYPES__ is redundant and should be removed
Fri, 29 Jul 2016 08:17:43 +0000 rbackman Merge
Fri, 29 Jul 2016 09:23:05 +0200 rbackman Merge
Thu, 28 Jul 2016 16:09:31 +0300 dpochepk 8162603: Unrecognized VM option 'UseCountedLoopSafepoints'
Thu, 28 Jul 2016 08:19:35 +0000 zmajo Merge
Wed, 27 Jul 2016 12:33:33 +0200 roland 8162384: Performance regression: bimorphic inlining may be bypassed by type speculation
Wed, 27 Jul 2016 10:56:01 -0700 dlong 8160742: Node::operator new invokes undefined behavior
Wed, 20 Jul 2016 12:34:11 +0200 goetz 8161907: adlc: Fix crash in cisc_spill_match if _rChild == NULL
Mon, 25 Jul 2016 14:31:42 -0700 roland 8161147: jvm crashes when -XX:+UseCountedLoopSafepoints is enabled
Thu, 23 Jun 2016 17:58:59 +0000 aph 8157306: Random infrequent null pointer exceptions in javac
Mon, 25 Jul 2016 21:02:51 +0300 dpochepk 8162376: TestSHA512Intrinsics.java failed with Unexpected count of intrinsic _sha5_implCompress is expected
Fri, 22 Jul 2016 12:47:08 -1000 twisti 8162427: fix indent in CompileTask::print_tty
Mon, 18 Jul 2016 20:45:51 +0200 roland 8161651: Logic in ConnectionGraph::split_unique_types() wrongly assumes node always have memory input
Fri, 22 Jul 2016 17:52:03 +0000 dnsimon Merge
Wed, 20 Jul 2016 22:18:13 +0000 dnsimon 8161265: [JVMCI] EnableJVMCI should only be required when its not implied by other flags
Fri, 22 Jul 2016 17:05:08 +0100 aph 8161190: AArch64: Fix overflow in immediate cmp instruction
Wed, 20 Jul 2016 19:35:08 +0300 dpochepk 8071652: -XX:CompileOnly does not behave as documented
Wed, 20 Jul 2016 19:33:22 +0300 dpochepk 8161695: compiler/jsr292/MHInlineTest.java can't be run on client-only platforms
Wed, 20 Jul 2016 19:31:34 +0300 dpochepk 8158756: [Testbug] serviceability/dcmd/compiler/CompilerQueueTest.java fails with TieredStopAtLevel=1
Wed, 20 Jul 2016 19:29:10 +0300 dpochepk 8161508: JVMCI: MaterializeVirtualObjectTest fails w/ "CASE: invalidate=true: has no virtual object before materialization
Tue, 19 Jul 2016 18:17:40 -0700 never 8161603: [JVMCI] HotSpotVMConfig.baseVtableLength is incorrectly computed
Tue, 19 Jul 2016 18:59:11 +0000 dnsimon 8161274: [JVMCI] compiler/jvmci/events/JvmciNotifyInstallEventTest.java fails with NoClassDefFound
Tue, 19 Jul 2016 18:11:03 +0000 never 8161292: [JVMCI] missing test files from 8159368
Tue, 19 Jul 2016 13:15:46 +0200 rbackman Merge
Thu, 23 Jun 2016 22:33:46 +0200 goetz 8160245: C1: Clean up platform #defines in c1_LIR.hpp.
Thu, 14 Jul 2016 20:11:55 +0300 dpochepk 8157861: [TESTBUG] compiler/jvmci/compilerToVM/ReprofileTest.java failed with RuntimeException
Thu, 14 Jul 2016 20:10:16 +0300 dpochepk 8157984: [TESTBUG] Several compiler tests fails when are executed with -XX:TieredStopAtLevel=1
Thu, 14 Jul 2016 14:44:53 +0000 tpivovarova Merge
Wed, 13 Jul 2016 18:03:15 +0300 tpivovarova 8151280: update hotspot tests to use vm.compMode instead of their own logic
Thu, 14 Jul 2016 15:18:15 +0100 aph Merge
Wed, 13 Jul 2016 15:19:34 +0100 aph 8159467: AArch64: Enable compact strings
Fri, 08 Jul 2016 17:11:37 +0100 aph 8161072: AArch64: jtreg compiler/uncommontrap/TestDeoptOOM failure
Thu, 14 Jul 2016 08:33:08 +0200 mhaupt 8161068: jdk.vm.ci.hotspot.test.MethodHandleAccessProviderTest fails
Wed, 13 Jul 2016 19:08:07 +0300 ppunegov 8160761: [TESTBUG] Several compiler tests fail with product bits
Mon, 04 Jul 2016 16:28:27 +0200 goetz 8056950: Compiled code (64-bit) on SPARC should sign extend INT parameters passed on registers to runtime or native methods.
Tue, 12 Jul 2016 20:42:46 +0000 sanzinger 8159368: [JVMCI] SPARCHotSpotRegisterConfig.callingConvention gives incorrect calling convention for native calls containing fp args
Tue, 12 Jul 2016 18:24:48 +0300 tpivovarova 8132919: Put compiler tests in packages
Tue, 12 Jul 2016 08:42:46 +0000 zmajo Merge
Tue, 12 Jul 2016 10:16:36 +0200 zmajo 8098573: Compiler accesses to shared archive fail if archive is remapped
Tue, 12 Jul 2016 08:57:00 +0200 thartmann 8160898: assert while replaying ciReplay file created using TieredStopAtLevel=1
Mon, 11 Jul 2016 19:15:21 +0000 dnsimon 8160730: [JVMCI] compiler selection should work without -Djvmci.Compiler
Mon, 11 Jul 2016 13:14:19 +0200 rbackman Merge
Fri, 08 Jul 2016 21:26:02 +0300 iignatyev 8160657: Compiler HotSpot tests should use the "run driver" directive where applicable
Fri, 08 Jul 2016 20:14:18 +0300 dpochepk 8160276: Jittester: bytecode tests generation hangs in ClassWriter infinite loop
Fri, 08 Jul 2016 17:02:10 +0100 aph 8160969: aarch64: CDS is broken after 8079507
Thu, 07 Jul 2016 15:39:12 +0100 aph Merge
Thu, 07 Jul 2016 15:07:13 +0100 aph 8141633: Implement VarHandles/Unsafe intrinsics on AArch64
Thu, 07 Jul 2016 13:53:52 +0300 tpivovarova 8160773: error: package jdk.internal.jimage does not exist
Wed, 06 Jul 2016 15:05:28 +0300 vlivanov 8160360: Mismatched field loads are folded in LoadNode::Value
Tue, 05 Jul 2016 17:57:20 -0700 dnsimon 8159888: [JVMCI] the client VM build is broken when INCLUDE_JVMCI is defined
Tue, 05 Jul 2016 07:57:09 +0200 thartmann 8159129: TestStringIntrinsicRangeChecks fails w/ No exception thrown for compressByte/inflateByte
Mon, 04 Jul 2016 09:14:02 +0200 thartmann 8160651: StubRoutines::_dtan does not restore callee save register rbx
Sat, 02 Jul 2016 00:27:19 +0000 dnsimon 8160647: [JVMCI] need to be able to copy internal arrays from LocalVariableTable and LineNumberTable
Thu, 30 Jun 2016 05:05:52 -0700 rraghavan 8153194: PreserveFPRegistersTest.java runs out of memory in the nightlies.
Tue, 24 May 2016 01:13:57 -0700 enevill 8156943: aarch64: string compare does not support CompactStrings
Thu, 30 Jun 2016 08:24:51 +0200 thartmann 8160425: Vectorization with signalling NaN returns wrong result
Wed, 29 Jun 2016 18:04:04 +0300 ppunegov 8160471: compiler/rangechecks/TestRangeCheckEliminationDisabled.java fails after JDK-8150900
Wed, 29 Jun 2016 11:38:58 +0000 tpivovarova Merge
Wed, 29 Jun 2016 14:32:13 +0300 tpivovarova 8153515: [ctw] CompileTheWorld testlibrary should trigger compilation of <clinit> and <init>
Wed, 29 Jun 2016 11:24:13 +0000 enevill 8160534: aarch64: fails to build after 8157834
Tue, 28 Jun 2016 20:08:43 +0000 never Merge
Tue, 28 Jun 2016 17:22:56 +0000 never 8160121: [JVMCI] JvmciNotifyBootstrapFinishedEventTest.java failed NoClassDefFoundError: jdk/vm/ci/runtime/JVMCI
Tue, 28 Jun 2016 19:58:15 +0300 tpivovarova 8143081: [ctw] Test CompileTheWorld.java needs to be updated for Jigsaw
Mon, 27 Jun 2016 17:23:15 +0300 dpochepk 8132318: -XX:TraceJumps is broken on Sparc
Mon, 27 Jun 2016 10:10:11 +0200 thartmann 8159016: Over-unrolled loop is partially removed
Fri, 24 Jun 2016 15:30:50 -0700 kvn Merge
Fri, 24 Jun 2016 19:06:00 +0000 iveresov Merge
Fri, 24 Jun 2016 11:22:08 -0700 iveresov 8157249: [JVMCI] remove ConstantReflectionProvider.isEmbeddable method
Fri, 24 Jun 2016 17:12:50 +0000 ppunegov Merge
Fri, 24 Jun 2016 19:06:15 +0300 ppunegov 8160085: @library' must appear before first `@run'
Fri, 24 Jun 2016 17:11:17 +0000 rschatz Merge
Fri, 24 Jun 2016 15:45:47 +0000 rschatz 8160177: [JVMCI] race condition in HotSpotMemoryAccessProviderImpl.verifyReadRawObject
Thu, 16 Jun 2016 06:42:08 -0400 enevill 8159063: aarch64: optimise unaligned array copy long
Wed, 22 Jun 2016 17:05:40 +0200 simonis 8159620: -XX:-UseOnStackReplacement does not work together with -XX:+TieredCompilation on ppc64 and sparc
Fri, 29 Jul 2016 08:36:13 +0200 thartmann 8162540: Crash in C2 escape analysis with assert: "node should be registered"
Thu, 28 Jul 2016 09:57:49 -0400 lfoltan 8160487: JVM should validate a module by checking for an instance of java.lang.reflect.Module
Wed, 27 Jul 2016 18:43:52 +0300 mchernov 8159606: gc/g1/TestShrinkAuxiliaryData* tests fail because GC triggered before VM initialization completed
Wed, 27 Jul 2016 21:16:38 +0400 dfazunen 8161990: Un-quarantine TestParallelHeapSizeFlags.java and TestSmallHeap.java.
Wed, 27 Jul 2016 13:33:52 +0000 acorn Merge
Wed, 27 Jul 2016 08:31:48 -0400 acorn 8162340: Better class stream parsing
Tue, 26 Jul 2016 23:52:25 -0400 dholmes 8140723: Remove source code conditionalized on JAVASE_EMBEDDED
Tue, 26 Jul 2016 17:25:58 -0400 jiangli 8156959: compiler/codecache/jmx/UsageThresholdExceededSeveralTimesTest.java fails with exit 134.
Tue, 26 Jul 2016 10:29:27 -0400 lfoltan 8154239: -Xbootclasspath/a breaks exploded build
Tue, 26 Jul 2016 11:04:20 +0200 tschatzl 8161993: G1 crashes if active_processor_count changes during startup
Tue, 26 Jul 2016 11:04:20 +0200 tschatzl 8147910: Cache initial active_processor_count
Wed, 13 Jul 2016 12:23:05 +0200 goetz 8161258: Simplify including platform files.
Mon, 25 Jul 2016 18:52:59 +0000 amurillo Merge
Mon, 25 Jul 2016 15:30:23 +0000 amurillo Merge
Fri, 22 Jul 2016 19:04:38 +0000 amurillo Merge
Fri, 22 Jul 2016 10:35:46 -0700 amurillo Merge
Fri, 22 Jul 2016 10:14:23 -0700 amurillo Merge
Mon, 25 Jul 2016 17:35:25 +0200 ddmitriev Merge
Fri, 22 Jul 2016 16:55:55 +0300 akulyakh 8153978: New test to verify the modules info as returned by the JVMTI
Mon, 25 Jul 2016 09:40:31 -0400 mockner 8038332: The trace event vm/class/load is not always being sent
Fri, 22 Jul 2016 10:15:42 -0700 bchristi 8161028: GPL header missing comma after year
Thu, 21 Jul 2016 14:55:54 +0200 ehelin 8159464: DumpHeap.java hits assert in G1 code
Fri, 22 Jul 2016 02:36:39 -0700 sspitsyn 8145627: sun.jvm.hotspot.oops.InstanceKlass::getSize() returns the incorrect size and has no test
Fri, 22 Jul 2016 04:05:04 +0000 amurillo Merge
Thu, 21 Jul 2016 20:09:19 -0700 amurillo Merge
Thu, 21 Jul 2016 19:50:41 -0700 amurillo Merge
Thu, 21 Jul 2016 19:29:33 -0700 ccheung 8161539: 8159666 breaks minimal VM
Thu, 21 Jul 2016 16:45:56 +0000 dfazunen Merge
Thu, 21 Jul 2016 17:12:35 +0400 dfazunen 8161552: Test issue: VM init failed: GC triggered before VM initialization completed. Try increasing NewSize, current value 768K.
Thu, 21 Jul 2016 16:29:21 +0200 psandoz 8161947: runtime/Unsafe/GetUnsafe.java is failing on jdk9/dev
Thu, 21 Jul 2016 14:06:22 +0200 mgerdin 8161915: Linking gtestLauncher may end up linking with non-gtest libjvm
Wed, 20 Jul 2016 14:47:53 +0300 bmoloden 8160119: Utils.tryFindJvmPid sometimes find incorrect pid
Tue, 19 Jul 2016 22:14:22 +0200 jiangli Merge
Tue, 19 Jul 2016 20:39:23 +0200 jiangli Merge
Tue, 19 Jul 2016 20:07:06 +0200 jiangli Merge
Tue, 19 Jul 2016 13:52:14 -0400 jiangli 8141341: CDS should be disabled if JvmtiExport::should_post_class_file_load_hook() is true.
Tue, 19 Jul 2016 19:05:06 +0000 jmasa Merge
Wed, 06 Jul 2016 13:23:10 -0700 jmasa 8155263: DisableStartThread should not be applied to GC worker threads
Tue, 19 Jul 2016 17:26:51 +0000 gziemski Merge
Tue, 19 Jul 2016 11:00:45 -0500 gziemski 8138760: [JVMCI] VM warning: Performance bug: SystemDictionary lookup_count=21831450 lookup_length=1275207287 average=58.411479 load=5.572844
Tue, 19 Jul 2016 18:15:46 +0300 mchernov 8160827: gc/stress/TestStressG1Humongous.java fails with OOME
Tue, 19 Jul 2016 09:30:30 +0200 tschatzl 8157459: G1 IHOP JFR event attribute with incorrect content type
Tue, 19 Jul 2016 10:31:41 +0200 tschatzl 8034842: Parallelize the Free CSet phase in G1
Mon, 18 Jul 2016 14:20:30 -0700 dcubed 8161173: quarantine compiler/arraycopy/TestEliminatedArrayCopyDeopt.java
Mon, 18 Jul 2016 14:30:39 +0200 mgerdin 8161027: GPL header missing comma after year
Sat, 16 Jul 2016 23:10:00 +0300 igerasim 8160892: Race at the VM exit causes "WaitForMultipleObjects timed out"
Fri, 15 Jul 2016 17:05:10 -0700 dcubed Merge
Fri, 15 Jul 2016 10:46:08 -0700 gthornbr 8144278: [TESTBUG] hotspot/runtime/StackGuardPages/testme.sh should use native library build support
Fri, 15 Jul 2016 10:31:50 -0700 gthornbr 8144279: [TESTBUG] hotspot/runtime/jsig/Test8017498.sh should use native library build support
Fri, 15 Jul 2016 10:25:16 -0700 gthornbr 8081770: [TESTBUG] regression Test7107135 needs to remove dependence on locally installed gcc
Fri, 15 Jul 2016 18:09:33 +0000 dcubed Merge
Fri, 15 Jul 2016 09:36:28 -0700 dcubed 8160997: Solaris: deprecated <pwd.h> and <gid.h> interfaces should be replaced
Fri, 15 Jul 2016 09:10:36 -0700 amurillo Merge
Fri, 15 Jul 2016 12:40:47 +0000 psandoz Merge
Fri, 15 Jul 2016 12:36:18 +0200 psandoz 8151163: All Buffer implementations should leverage Unsafe unaligned accessors
Fri, 15 Jul 2016 13:33:44 +0200 tschatzl 8160897: Concurrent mark mark stack memory allocation leaks memory
Tue, 12 Jul 2016 15:06:18 +0300 mchernov 8158508: gc/logging/TestUnifiedLoggingSwitchStress.java timeout
Wed, 13 Jul 2016 18:26:51 -0700 ccheung 8159901: missing newline char in the exception messages in diagnosticArgument.cpp
Thu, 07 Jul 2016 18:40:53 +0100 andrew 8156980: Hotspot build doesn't have -std=gnu++98 gcc option
Wed, 13 Jul 2016 10:51:19 +0300 dsamersoff 8134434: JVM_DoPrivileged() fires assert(_exception_caught == false) failed: _exception_caught is out of phase
Tue, 21 Jun 2016 19:37:30 +0200 jwilhelm 8024137: Flags should be set using the proper macro
Tue, 21 Jun 2016 19:35:39 +0200 jwilhelm 8048093: Explicitly setting := vs = in the -XX:+PrintFlagsFinal output
Thu, 04 Aug 2016 15:52:14 -0700 darcy 8163231: A couple of runtime tests failing for the -testset hotspot snapshot job
Thu, 04 Aug 2016 17:32:52 +0000 amurillo Added tag jdk-9+130 for changeset af79a51e7d04
Mon, 08 Aug 2016 08:12:18 -0700 amurillo Merge
Fri, 05 Aug 2016 09:50:23 -0700 amurillo Merge
Tue, 02 Aug 2016 15:21:53 +0300 mchernov 8161604: TestNewSizeFlags fails with RuntimeException: max new size != MaxNewSize value
Mon, 01 Aug 2016 10:51:51 +0300 dsamersoff 8158050: Remove SA-JDI
Fri, 29 Jul 2016 16:50:45 -0700 amurillo Merge
Fri, 29 Jul 2016 16:11:52 -0700 amurillo Merge
Fri, 29 Jul 2016 09:23:00 +0200 rbackman Merge
Tue, 19 Jul 2016 13:15:45 +0200 rbackman Merge
Wed, 13 Jul 2016 18:03:18 +0300 tpivovarova 8151280: update hotspot tests to use vm.compMode instead of their own logic
Mon, 11 Jul 2016 17:23:20 -0700 sanzinger 8160825: Update minimum Solaris Studio compiler version to 5.13
Mon, 11 Jul 2016 13:14:19 +0200 rbackman Merge
Tue, 05 Jul 2016 18:00:06 -0700 dnsimon 8159888: [JVMCI] the client VM build is broken when INCLUDE_JVMCI is defined
Fri, 22 Jul 2016 10:35:46 -0700 amurillo Merge
Fri, 22 Jul 2016 10:14:22 -0700 amurillo Merge
Thu, 21 Jul 2016 20:09:19 -0700 amurillo Merge
Thu, 21 Jul 2016 19:50:38 -0700 amurillo Merge
Thu, 21 Jul 2016 16:07:41 +0300 mchernov 8161208: Unable to run jtreg tests with MinimalVM
Wed, 20 Jul 2016 12:52:45 -0700 dcubed 8161057: Solaris: deprecated/obsolete compiler flags should be removed
Fri, 15 Jul 2016 17:04:51 -0700 dcubed Merge
Fri, 15 Jul 2016 16:52:33 -0700 gthornbr 8144278: [TESTBUG] hotspot/runtime/StackGuardPages/testme.sh should use native library build support
Fri, 15 Jul 2016 09:10:35 -0700 amurillo Merge
Sun, 10 Jul 2016 22:00:03 +0100 andrew 8156980: Hotspot build doesn't have -std=gnu++98 gcc option
Fri, 05 Aug 2016 10:23:39 -0700 prr Merge
Mon, 01 Aug 2016 10:06:00 -0700 prr Merge
Thu, 28 Jul 2016 09:29:36 -0700 ddehaven Merge
Thu, 21 Jul 2016 12:26:07 -0700 dtitov 8156960: Deprecate JSObject.getWindow(Applet) method
Thu, 04 Aug 2016 17:48:34 +0000 amurillo Merge
Wed, 03 Aug 2016 16:00:49 -0700 ksrini 8039305: [javadoc] broken link in jdk/api/javadoc/taglet/com/sun/tools/doclets/Taglet.html
Thu, 04 Aug 2016 10:05:40 +0200 erikj 8160334: Building --with-parfait= fails with No rule to make target 'PARFAIT_NATIVEJMOD