log

age author description
Fri, 27 Jul 2018 14:20:07 +0530 nishjain 8021322: [Fmt-Ch] Implementation of ChoiceFormat math methods should delegate to java.lang.Math methods
Fri, 27 Jul 2018 09:49:03 +0200 tschatzl 8208297: Allow printing of taskqueue stats if compiled in in product builds
Thu, 26 Jul 2018 16:22:58 -0700 dtitov 8207364: nsk/jvmti/ResourceExhausted/resexhausted003 fails to start
Thu, 26 Jul 2018 11:53:59 -0700 jcbeyler 8208251: serviceability/jvmti/HeapMonitor/MyPackage/HeapMonitorGCCMSTest.java fails intermittently on Linux-X64
Thu, 26 Jul 2018 22:07:46 +0200 mcimadamore Automatic merge with jep-334condy-folding
Thu, 26 Jul 2018 22:07:25 +0200 mcimadamore Automatic merge with defaultpatterns
Thu, 26 Jul 2018 22:07:04 +0200 mcimadamore Automatic merge with defaultlambda-leftovers
Thu, 26 Jul 2018 22:06:43 +0200 mcimadamore Automatic merge with defaultenhanced-enums
Thu, 26 Jul 2018 22:06:22 +0200 mcimadamore Automatic merge with defaultswitch
Thu, 26 Jul 2018 22:06:00 +0200 mcimadamore Automatic merge with defaultdatum
Thu, 26 Jul 2018 22:05:38 +0200 mcimadamore Automatic merge with defaultraw-string-literal
Thu, 26 Jul 2018 22:05:16 +0200 mcimadamore Automatic merge with defaultstats-before-this-super
Thu, 26 Jul 2018 22:04:55 +0200 mcimadamore Automatic merge with defaultjep-334
Thu, 26 Jul 2018 11:31:15 -0700 amenkov 8199155: Accessibility issues in jdk.jdi
Thu, 26 Jul 2018 13:08:42 -0400 dcubed 8208305: ProblemList compiler/jvmci/compilerToVM/GetFlagValueTest.java
Thu, 26 Jul 2018 10:00:40 -0700 prr Merge
Thu, 26 Jul 2018 09:27:30 -0700 prr Added tag jdk-11+24 for changeset ea900a7dc7d7
Thu, 26 Jul 2018 10:25:33 -0300 jlaskey 8208164: (str) improve specification of String::lines
Mon, 23 Jul 2018 15:17:14 +0200 simonis 8205608: Fix 'frames()' in ThreadReferenceImpl.c to prevent quadratic runtime behavior
Thu, 26 Jul 2018 14:15:24 +0530 rgoel 8206965: java/util/TimeZone/Bug8149452.java failed on de_DE and ja_JP locale.
Wed, 25 Jul 2018 22:48:53 -0700 ljiang 8207948: JDK 11 L10n resource file update msg drop 10
Thu, 26 Jul 2018 08:46:27 +0800 jjiang 8206258: [Test Error] sun/security/pkcs11 tests fail if NSS libs not found
Wed, 25 Jul 2018 17:21:04 -0700 xuelei 8208166: Still unable to use custom SSLEngine with default TrustManagerFactory after JDK-8207029
Wed, 25 Jul 2018 17:22:25 -0400 dcubed 8208226: ProblemList com/sun/jdi/BasicJDWPConnectionTest.java
Wed, 25 Jul 2018 13:15:36 -0700 cjplummer 8151259: [TESTBUG] nsk/jvmti/RedefineClasses/redefclass030 fails with "unexpected values of outer fields of the class" when running with -Xcomp
Wed, 25 Jul 2018 15:38:37 -0400 dcubed 8208205: ProblemList tests that fail due to 'Error attaching to process: Can't create thread_db agent!'
Wed, 25 Jul 2018 10:51:16 -0700 jcbeyler 8207765: HeapMonitorTest.java intermittent failure
Wed, 25 Jul 2018 09:48:31 -0700 jnimeh 8207237: SSLSocket#setEnabledCipherSuites is accepting empty string
Wed, 25 Jul 2018 12:32:06 -0400 dcubed 8208189: ProblemList compiler/graalunit/JttThreadsTest.java
Wed, 25 Jul 2018 08:36:46 -0700 erikj 8208096: Update build documentation to reflect compiler upgrades at Oraclejdk-11+24
Wed, 25 Jul 2018 10:08:39 +0100 chegar 8207846: Generalize the jdk.net.includeInExceptions security property
Tue, 24 Jul 2018 12:12:16 -0700 rhalade 8203230: update VerifyCACerts test
Tue, 24 Jul 2018 10:35:25 -0700 cjplummer 8208075: Quarantine vmTestbase/nsk/jvmti/RedefineClasses/StressRedefineWithoutBytecodeCorruption/TestDescription.java
Tue, 24 Jul 2018 12:57:40 +0200 ghaug 8207392: [PPC64] Implement JFR profiling.
Tue, 24 Jul 2018 10:07:26 +0100 chegar 8207960: Non-negative WINDOW_UPDATE increments may leave the stream window size negative
Mon, 23 Jul 2018 11:47:03 +0100 chegar 8207959: The initial value of SETTINGS_MAX_CONCURRENT_STREAMS should have no limit
Tue, 24 Jul 2018 13:55:57 +0800 mli 8208111: Problem list java/nio/channels/Selector/RacyDeregister.java
Mon, 23 Jul 2018 23:18:19 +0000 valeriep 8206171: Signature#getParameters for RSASSA-PSS throws ProviderException when not initialized
Mon, 23 Jul 2018 12:01:43 -0700 dlong 8207383: [Graal] SelfChangedCDS.java fails with "guarantee(disp == (intptr_t)(jint)disp) failed: must be 32-bit offset"
Mon, 23 Jul 2018 14:41:06 -0400 dcubed 8208092: ProblemList serviceability/sa/ClhsdbCDSCore.java
Mon, 23 Jul 2018 19:58:43 +0530 sdama 8206445: JImageListTest.java failed in Windows
Thu, 19 Jul 2018 16:56:05 -0400 gromero 8189922: UseNUMA memory interleaving vs membind
Sun, 22 Jul 2018 20:00:39 -0700 jcbeyler 8207252: C1 still does eden allocations when TLAB is enabled
Mon, 23 Jul 2018 10:02:10 +0800 xiaofeya 8207952: Problem-list 3 sctp tests
Sat, 21 Jul 2018 21:46:42 +0800 weijun 8207223: SSL Handshake failures are reported with more generic SSLException
Fri, 20 Jul 2018 18:03:23 -0400 coleenp 8203820: [TESTBUG] vmTestbase/metaspace/staticReferences/StaticReferences.java timed out
Fri, 20 Jul 2018 14:34:51 -0700 smarks 8206865: RMI activation tests fail with InvalidClassException
Fri, 20 Jul 2018 11:39:52 -0700 epavlova 8206241: compiler/graalunit/PhasesCommonTest.java fails with java.lang.Error: TESTBUG: no tests found for prefix org.graalvm.compiler.phases.common.test
Fri, 20 Jul 2018 11:39:37 -0700 iignatyev 8207915: [AOT] jaotc w/ '--ignore-errors' should ignore illegal class files
Fri, 20 Jul 2018 10:12:34 -0700 naoto 8206886: Java does not set the default format locale correctly on mac10.13
Fri, 20 Jul 2018 09:55:15 -0700 ascarpino 8204196: integer cleanup
Fri, 20 Jul 2018 09:07:37 -0700 erikj 8207365: Make man pages optional
Fri, 20 Jul 2018 09:46:57 +0200 goetz 8207830: [aix] disable jfr in build and tests
Fri, 20 Jul 2018 09:33:49 +0200 goetz 8207766: [testbug] Adapt tests for Aix.
Fri, 20 Jul 2018 01:23:38 -0700 rraghavan 8203504: [Graal] org.graalvm.compiler.debug.test.DebugContextTest fails with java.util.ServiceConfigurationError
Fri, 20 Jul 2018 15:24:42 +0800 mli 8207833: java/nio/channels/Selector/SelectWithConsumer.java testCancel() fails intermittently
Thu, 19 Jul 2018 18:21:24 -0700 jcbeyler 8207765: HeapMonitorStatIntervalTest.java fails with ZGC
Fri, 20 Jul 2018 08:40:14 +0800 mli 8207244: java/nio/channels/Selector/SelectWithConsumer.java testInterruptDuringSelect() fails intermittently
Wed, 11 Jul 2018 13:55:38 -0400 zgu 8207056: Epsilon GC to support object pinning
Thu, 19 Jul 2018 14:25:42 -0700 erikj 8207243: Fix translation filtering to also support zh_HK and zh_TW
Thu, 19 Jul 2018 13:41:56 -0700 kvn 8207069: [AOT] we should check that VM uses the same GC as one used for AOT library generation.
Thu, 19 Jul 2018 21:46:52 +0300 bulasevich 8207584: ARM32: ShouldNotReachHere assertion on Test8168712 jtreg test
Thu, 26 Jul 2018 09:30:58 -0700 prr Added tag jdk-12+4 for changeset 499b873761d8
Fri, 27 Jul 2018 00:54:39 +0900 ysuenaga 8205992: jhsdb cannot attach to Java processes running in Docker containers
Thu, 26 Jul 2018 10:56:58 -0400 dbuck 8208183: update HSDIS plugin license to UPL
Wed, 25 Jul 2018 17:26:35 -0700 jjg 8208227: tools/jdeps/DotFileTest.java fails on Win-X64
Wed, 25 Jul 2018 17:22:26 -0700 darcy 8208200: Add missing periods to sentences in RoundEnvironment specs
Wed, 25 Jul 2018 17:22:25 -0400 dcubed 8208226: ProblemList com/sun/jdi/BasicJDWPConnectionTest.java
Wed, 25 Jul 2018 12:54:58 -0700 darcy 8208201: Update SourceVersion.RELEASE_11 docs to mention var for lambda param
Wed, 25 Jul 2018 21:47:40 +0200 rkennke 8204970: Remaing object comparisons need to use oopDesc::equals()
Wed, 25 Jul 2018 15:38:37 -0400 dcubed 8208205: ProblemList tests that fail due to 'Error attaching to process: Can't create thread_db agent!'
Wed, 25 Jul 2018 10:51:16 -0700 jcbeyler 8207765: HeapMonitorTest.java intermittent failure
Wed, 25 Jul 2018 12:32:59 -0700 darcy 8190886: package-info handling in RoundEnvironment.getElementsAnnotatedWith
Wed, 25 Jul 2018 12:32:06 -0400 dcubed 8208189: ProblemList compiler/graalunit/JttThreadsTest.java
Wed, 25 Jul 2018 11:03:07 +0800 xyin 8198882: Add 10 JNDI tests to com/sun/jndi/dns/AttributeTests/jdk-12+4
Tue, 24 Jul 2018 08:58:32 -0700 shurailine 8208157: requires.VMProps throws NPE for missing properties in "release" file
Tue, 24 Jul 2018 11:37:43 -0700 jjg 8207214: Broken links in JDK API serialized-form page
Tue, 24 Jul 2018 09:27:42 +0200 mbaesken 8207941: javax/swing/plaf/basic/BasicGraphicsUtils/8132119/bug8132119.java fails on machines without Arial font [testbug]
Thu, 19 Jul 2018 11:04:46 +0200 mbaesken 8207395: jar has issues with UNC-path arguments for the jar -C parameter [windows]
Mon, 23 Jul 2018 22:07:55 -0700 igerasim 8207314: Unnecessary reallocation when constructing WeakHashMap from a large Map
Mon, 23 Jul 2018 18:29:35 -0700 kvn 8207262: enable applications/ctw/modules/java_desktop_2.java test again
Mon, 23 Jul 2018 14:41:06 -0400 dcubed 8208092: ProblemList serviceability/sa/ClhsdbCDSCore.java
Mon, 23 Jul 2018 11:38:28 -0400 tonyp 8207849: Allow the addition of more number to the Java version string
Mon, 23 Jul 2018 17:32:04 +0200 tschatzl 8207953: Remove dead code in G1CopyingKeepAliveClosure
Fri, 20 Jul 2018 14:48:41 -0700 vromero 8205493: OptionSmokeTest.java uses hard-coded release values
Fri, 20 Jul 2018 14:46:43 -0700 darcy 8208060: Additional corrections of serial-related declarations
Fri, 20 Jul 2018 12:19:28 -0700 iklam 8203382: Rename SystemDictionary::initialize_wk_klass to resolve_wk_klass
Fri, 20 Jul 2018 14:52:11 -0400 coleenp 8207359: Make SymbolTable increment_refcount disallow zero
Fri, 20 Jul 2018 11:55:05 -0700 kvn 8206075: On x86, assert on unbound assembler Labels used as branch targets
Wed, 18 Jul 2018 00:23:06 -0700 darcy 8193462: Fix Filer handling of package-info initial elements
Wed, 18 Jul 2018 00:16:37 -0700 darcy 8193214: Incorrect annotations.without.processors warnings with JDK 9
Thu, 19 Jul 2018 18:21:24 -0700 jcbeyler 8207765: HeapMonitorStatIntervalTest.java fails with ZGC
Fri, 20 Jul 2018 09:15:54 -0400 ctornqvi 8207855: Make applications/jcstress invoke tests in batches
Thu, 19 Jul 2018 16:53:33 -0700 dtitov 8204695: [Graal] vmTestbase/nsk/jdi/ClassPrepareRequest/addSourceNameFilter/addSourceNameFilter002/addSourceNameFilter002.java fails
Thu, 19 Jul 2018 15:13:10 -0700 vromero 8206874: Evaluate LoadClassFromJava6CreatedJarTest.java after dropping -source 6
Thu, 19 Jul 2018 13:41:26 -0700 igerasim 8207753: Handle to process snapshot is leaked if Process32First() fails
Thu, 19 Jul 2018 12:55:24 -0700 never 8207202: [Graal] compiler/graalunit/CoreTest.java fails
Fri, 20 Jul 2018 06:15:21 -0700 vromero manual merge with defaultpatterns
Thu, 19 Jul 2018 16:14:56 -0700 vromero manual merge with jep-334condy-folding
Thu, 19 Jul 2018 15:49:36 -0700 vromero manual merge with defaultlambda-leftovers
Thu, 19 Jul 2018 15:27:26 -0700 vromero manual merge with defaultenhanced-enums
Thu, 19 Jul 2018 15:06:03 -0700 vromero manual merge with defaultswitch
Thu, 19 Jul 2018 13:59:10 -0700 vromero manual merge with defaultdatum
Thu, 19 Jul 2018 22:05:42 +0200 mcimadamore Automatic merge with defaultraw-string-literal
Thu, 19 Jul 2018 22:05:14 +0200 mcimadamore Automatic merge with defaultstats-before-this-super
Thu, 19 Jul 2018 22:04:53 +0200 mcimadamore Automatic merge with defaultjep-334
Thu, 19 Jul 2018 11:15:38 -0700 naoto 8206886: Java does not set the default format locale correctly on mac10.13
Thu, 19 Jul 2018 10:53:38 -0700 prr Merge
Thu, 19 Jul 2018 13:49:44 +0530 kaddepalli 8206343: There is a typo in the java documentation of javax.swing.JScrollBar.
Thu, 12 Jul 2018 11:09:23 -0700 prr Merge
Tue, 03 Jul 2018 16:09:25 +0530 sveerabhadra 8195991: [TEST_BUG]:Regression manual Test java/awt/TrayIcon/RightClickWhenBalloonDisplayed/RightClickWhenBalloonDisplayed.html fails
Mon, 02 Jul 2018 14:31:33 +0530 kaddepalli 8197810: Test java/awt/Choice/SelectCurrentItemTest/SelectCurrentItemTest.html fails on Windows
Thu, 19 Jul 2018 10:17:22 -0700 prr Merge
Thu, 19 Jul 2018 12:57:12 -0400 bobv 8206456: [TESTBUG] docker jtreg tests fail on systems without cpuset.effective_cpus / cpuset.effective_mem
Thu, 19 Jul 2018 09:42:15 -0700 prr Added tag jdk-11+23 for changeset 1edcf36fe15f
Wed, 18 Jul 2018 20:54:12 -0700 sspitsyn 8207819: Problem list serviceability/jvmti/HeapMonitor/MyPackage/HeapMonitorStatRateTest.java
Thu, 19 Jul 2018 10:30:24 +0800 amlu 8207818: Problem list several rmi tests
Fri, 22 Jun 2018 17:08:00 -0700 smarks 8205491: adjust reflective access checks
Thu, 07 Jun 2018 18:21:29 +0530 vtewari 8200666: Improve LDAP support
Thu, 31 May 2018 11:31:20 -0700 smarks 8197925: Better stack walking
Mon, 09 Apr 2018 14:10:56 -0400 apetcher 8200332: Improve GCM counting
Thu, 15 Mar 2018 16:04:30 -0700 sherman 8199547: Exception to Pattern Syntax
Mon, 05 Feb 2018 14:18:22 -0800 igerasim 8196224: Even better Internet address support
Wed, 31 Jan 2018 18:13:13 -0800 serb 8191239: Improve desktop file usage
Thu, 18 Jan 2018 13:55:26 +0530 vtewari 8193419: Better Internet address support
Wed, 18 Jul 2018 14:44:04 -0700 epavlova 8207761: Split compiler/graalunit/JttReflectFTest.java
Sun, 24 Jun 2018 17:11:17 -0400 gromero 8205578: jtreg: Fix failing TestRTMAbortRatio on PPC64
Sat, 23 Jun 2018 18:02:46 -0400 gromero 8205390: jtreg: Fix failing TestRTMSpinLoopCount on PPC64
Fri, 06 Jul 2018 16:25:07 -0400 gromero 8205582: PPC64: RTM: Fix counter for aborts on nested transactions
Tue, 26 Jun 2018 08:33:17 -0400 gromero 8205581: PPC64: RTM: Fix abort on native calls
Sun, 24 Jun 2018 21:48:42 -0400 gromero 8205580: PPC64: RTM: Don't retry lock on abort if abort was intentional
Wed, 18 Jul 2018 13:24:25 -0700 epavlova 8207380: compiler/graalunit/JttLangMTest.java timeout
Wed, 11 Jul 2018 08:44:00 +0200 shade 8206931: Misleading "COMPILE SKIPPED: invalid non-klass dependency" compile log
Thu, 19 Jul 2018 00:14:40 +0800 weijun 8202837: PBES2 AlgorithmId encoding error in PKCS12 KeyStore
Thu, 19 Jul 2018 00:14:29 +0800 weijun 8207250: setUseClientMode post handshake with the same value as before does not throw IAE
Wed, 18 Jul 2018 11:57:51 -0400 jcbeyler 8207763: serviceability/jvmti/HeapMonitor/MyPackage/HeapMonitorStatRateTest.java failed with Error. Parse Exception: Can't find source file: HeapMonitorStatIntervalTest.javajdk-11+23
Wed, 18 Jul 2018 11:27:14 +0200 mdoerr 8207342: error occurred during error reporting (printing register info)
Tue, 17 Jul 2018 19:59:38 -0700 jcbeyler 8205725: Update the JVMTI Spec for Heap Sampling
Tue, 17 Jul 2018 17:52:03 -0700 jcbeyler 8205652: serviceability/jvmti/HeapMonitor/MyPackage/HeapMonitorStatRateTest.java fails
Tue, 17 Jul 2018 15:09:27 -0700 jcbeyler 8205541: serviceability/jvmti/HeapMonitor/MyPackage/HeapMonitorStatArrayCorrectnessTest.java fails with Should not have any events stored yet.
Tue, 17 Jul 2018 11:20:16 -0700 dtitov 8207261: [Graal] JDI and JDWP tests that consume all memory should be filtered out to not run with Graal
Tue, 17 Jul 2018 13:04:40 -0400 apetcher 8206929: Check session context for TLS 1.3 session resumption
Tue, 17 Jul 2018 19:25:45 +0300 dpochepk 8207240: AARCH64: C2-only VM does not build
Tue, 17 Jul 2018 15:28:17 +0100 aph 8207345: AArch64: Trampoline generation code reads from unitialized memory
Tue, 17 Jul 2018 22:22:00 +0800 weijun 8207318: KeyStore#getInstance(File, LoadStoreParameter) does not load the keystore
Tue, 17 Jul 2018 09:37:24 -0400 coleenp Merge
Tue, 10 Jul 2018 11:13:33 -0400 coleenp 8206471: Race with ConcurrentHashTable deleting items on insert with cleanup thread
Tue, 17 Jul 2018 12:22:41 +0100 chegar 8207265: Bad HTML in {@link} in HttpResponse.BodySubscribers.ofPublisher
Tue, 17 Jul 2018 16:49:55 +0530 pmuthuswamy 8207190: JDK 11 javadoc generates bad code example
Mon, 16 Jul 2018 15:09:19 -0700 dlong 8181855: [Graal] runtime/ReservedStack/ReservedStackTest.java triggers: assert(thread->deopt_mark() == __null) failed: no stack overflow from deopt blob/uncommon trap
Mon, 16 Jul 2018 10:58:28 -0700 bpb 8206448: (fs) Extended attributes assumed to be enabled on ext3 (lnx)
Mon, 16 Jul 2018 16:57:37 +0200 lucy 8206271: CodeHeap State Analytics must digest new method state
Mon, 16 Jul 2018 16:31:33 +0200 jlahoda 8207032: Compilation succeeds without checking readability when --add-exports used
Mon, 16 Jul 2018 12:58:49 +0200 jlahoda 8189747: JDK9 javax.lang.model.util.Elements#getTypeElement regressed 1000x in performance.
Sun, 15 Jul 2018 20:15:17 +0300 dsamersoff 8206265: aarch64 jtreg: assert in TestOptionsWithRanges.jtr
Fri, 13 Jul 2018 17:42:24 +0200 goetz 8207233: Minor improvements of jdk C-coding
Thu, 19 Jul 2018 09:46:29 -0700 prr Added tag jdk-12+3 for changeset 990db216e719
Thu, 19 Jul 2018 09:20:08 -0700 darcy 8207816: Align declaration of SerializedLambda.readResolve with serialization conventions
Thu, 19 Jul 2018 16:22:19 +0800 mli 8207316: java/nio/channels/spi/SelectorProvider/inheritedChannel/InheritedChannelTest.java failed
Wed, 18 Jul 2018 16:13:21 -0700 darcy 8203263: Remove unnecessary throws clauses from serialization-related methods
Wed, 18 Jul 2018 14:32:46 -0700 jnimeh 8207237: SSLSocket#setEnabledCipherSuites is accepting empty string
Wed, 18 Jul 2018 09:50:04 -0700 rhalade 8203230: update VerifyCACerts testjdk-12+3
Wed, 18 Jul 2018 08:27:53 -0700 darcy 8207751: Remove misleading serialVersionUID from JulienFields.Field
Wed, 18 Jul 2018 09:46:03 -0400 rriggs 8189717: Too much documentation of ProcessBuilder.start copied to ProcessBuilder.startPipeline
Wed, 18 Jul 2018 07:39:54 +0100 alanb 8207393: ServiceLoader class description improvements
Tue, 17 Jul 2018 17:36:27 -0700 martin 8206863: A closed JarVerifier.VerifierStream should throw IOException
Tue, 17 Jul 2018 17:17:16 -0700 igerasim 8207750: Native handle leak in java.io.WinNTFileSystem.list()
Tue, 17 Jul 2018 16:22:26 -0700 bpb 8207748: Fix for 8202794 breaks tier1 builds
Tue, 17 Jul 2018 17:14:03 -0400 rriggs 8205610: [TESTLIB] Improve listing of open file descriptors
Tue, 17 Jul 2018 15:59:47 -0400 kbarrett 8202353: os::readdir should use readdir instead of readdir_r
Tue, 17 Jul 2018 12:03:10 -0700 bpb 8202794: Native Unix code should use readdir rather than readdir_r
Tue, 17 Jul 2018 11:58:53 -0700 ccheung 8204591: Expire/remove the UseAppCDS option in JDK 12
Tue, 17 Jul 2018 14:28:56 +0200 jlahoda 8207229: Trees.getScope crashes for broken lambda
Tue, 17 Jul 2018 08:10:48 +0100 alanb 8207340: (fs) UnixNativeDispatcher close and readdir usages should be fixed
Mon, 16 Jul 2018 21:53:49 -0700 darcy 8207248: Reduce incidence of compiler.warn.source.no.bootclasspath in javac tests
Mon, 16 Jul 2018 10:58:28 -0700 bpb 8206448: (fs) Extended attributes assumed to be enabled on ext3 (lnx)
Mon, 16 Jul 2018 10:07:22 -0700 igerasim 8207016: Avoid redundant native memory allocation in getFinalPath()
Mon, 16 Jul 2018 08:59:39 -0700 rhalade 8207321: Merge error with 8199779
Mon, 16 Jul 2018 11:34:17 -0400 lfoltan 8205611: Improve the wording of LinkageErrors to include module and class loader information
Mon, 16 Jul 2018 09:06:33 -0400 lfoltan 8178712: ResourceMark may be missing inside initialize_[vi]table
Thu, 12 Jul 2018 16:28:31 +0200 sgehwolf 8207057: No debug info for assembler files
Mon, 16 Jul 2018 12:35:25 +0200 jlahoda 8189747: JDK9 javax.lang.model.util.Elements#getTypeElement regressed 1000x in performance.
Sun, 15 Jul 2018 18:16:55 +0300 dsamersoff 8206265: aarch64 jtreg: assert in TestOptionsWithRanges.jtr
Sat, 14 Jul 2018 02:14:54 +0200 jwilhelm Merge
Fri, 13 Jul 2018 13:00:36 -0700 jjg 8207213: The help-doc.html generated by the doclet is incomplete
Fri, 13 Jul 2018 11:13:34 -0700 kvn 8207065: Cleanup compiler tests for Client VM
Fri, 13 Jul 2018 09:48:52 -0700 rhalade 8199779: Add T-Systems, GlobalSign and Starfield services root certificates
Fri, 13 Jul 2018 18:39:11 +0200 redestad 8207235: ManagementFactory.getPlatformMXBeans(BufferPoolMXBean.class) throws NPE
Thu, 12 Jul 2018 22:53:35 -0700 dtitov 8191948: db error: InvalidTypeException: Can't assign double[][][] to double[][][]
Fri, 13 Jul 2018 10:42:30 -0400 apetcher 8206915: XDH TCK issues
Fri, 13 Jul 2018 15:44:54 +0200 roland 8200282: Serializing non-zero byte as zero to ByteBuffer
Fri, 13 Jul 2018 07:08:59 -0700 xuelei 8207029: Unable to use custom SSLEngine with default TrustManagerFactory after updating to JDK 11 b21
Fri, 13 Jul 2018 07:01:51 -0700 bulasevich 8207047: Multiple VM variants build fail
Fri, 13 Jul 2018 11:07:43 +0200 simonis 8206998: [test] runtime/ElfDecoder/TestElfDirectRead.java requires longer timeout on ppc64
Wed, 11 Jul 2018 19:23:27 +0200 simonis 8207067: [test] prevent timeouts in serviceability/tmtools/jstat/{GcTest02,GcCauseTest02}.java
Wed, 11 Jul 2018 15:00:33 +0800 zyao 8206975: AArch64: Fix CompareAndSwapOp when useLSE is enabled in Graal
Fri, 13 Jul 2018 01:31:23 -0700 rraghavan 8206873: 2 Null pointer dereference defect groups in LIRGenerator
Thu, 12 Jul 2018 16:31:28 +0200 goetz 8207049: Minor improvements of compiler code.
Fri, 13 Jul 2018 11:21:55 +0800 xiaofeya 8202481: RegisterDuringSelect.java fails with java.util.concurrent.ExecutionException: java.nio.channels.ClosedSelectorException
Thu, 12 Jul 2018 17:32:37 -0700 mikael 8207217: Problem list java/lang/management/ThreadMXBean/AllThreadIds.java
Thu, 12 Jul 2018 15:02:41 -0700 mikael 8207210: Problem list javax/sound/sampled/Clip/AutoCloseTimeCheck.java
Thu, 12 Jul 2018 12:00:52 -0700 jcbeyler 8206960: HeapMonitor tests fail with Graal
Thu, 12 Jul 2018 11:57:06 -0700 kvn 8206953: compiler/profiling/TestTypeProfiling.java fails when JVMCI build disabled
Thu, 12 Jul 2018 11:24:10 -0700 naoto 8207152: Placeholder for Japanese new era should be two characters
Wed, 11 Jul 2018 15:35:47 -0700 psandoz 8207027: Lookup.accessClass fails for an array type in the same package when assertions are enabled
Wed, 11 Jul 2018 16:11:10 +0200 goetz 8206977: Minor improvements of runtime code.
Thu, 12 Jul 2018 16:30:47 +0200 erikj 8207001: *.obj.log files get truncated causing unreliable incremental builds on Windows
Thu, 12 Jul 2018 07:14:30 -0700 erikj 8206903: Unable to build Client VM with JVMCI
Thu, 12 Jul 2018 17:34:36 +0530 kaddepalli 8206238: Aspect ratio is not maintained when Image is scaled in JEditorPane
Thu, 12 Jul 2018 13:40:20 +0200 jwilhelm Added tag jdk-11+22 for changeset 9937ef7499dc
Thu, 12 Jul 2018 15:17:18 +0530 mhalder 8204860: The frame could be resized by dragging a corner of the frame with the mouse
Thu, 12 Jul 2018 09:13:55 +0200 shade 8207006: serviceability/sa/TestUniverse.java#id0 crashes with EpsilonGC and AOT
Thu, 12 Jul 2018 08:44:39 +0800 weijun 8206189: sun/security/pkcs12/EmptyPassword.java fails with Sequence tag error
Wed, 11 Jul 2018 14:54:35 -0700 rhalade 8207068: Add Entrust root certificates
Wed, 11 Jul 2018 14:47:43 -0700 naoto 8206980: ZonedDateTime could not parse timezone name with zh_CN locale correctly.
Tue, 10 Jul 2018 15:29:25 -0700 jcbeyler 8205643: HeapMonitorGCCMSTest fails with Graal
Thu, 12 Jul 2018 15:02:41 -0700 mikael 8207210: Problem list javax/sound/sampled/Clip/AutoCloseTimeCheck.java
Sat, 14 Jul 2018 07:31:26 +0800 jjiang 8206443: Update security libs manual test to cope with removal of javac -source/-target 6
Fri, 13 Jul 2018 13:58:17 -0400 coleenp 8206470: Incorrect use of os::lasterror in ClassListParser
Sun, 03 Jun 2018 23:33:00 -0700 iklam 8204267: Generate comments in -XX:+PrintInterpreter to link to source code
Fri, 13 Jul 2018 10:10:51 -0700 amenkov 8201513: nsk/jvmti/IterateThroughHeap/filter-* are broken
Fri, 13 Jul 2018 14:04:59 +0530 nishjain 8193444: SimpleDateFormat throws ArrayIndexOutOfBoundsException when format contains long sequences of unicode characters
Thu, 12 Jul 2018 22:53:35 -0700 dtitov 8191948: db error: InvalidTypeException: Can't assign double[][][] to double[][][]
Fri, 13 Jul 2018 02:36:42 +0000 valeriep 8179098: Crypto AES/ECB encryption/decryption performance regression (introduced in jdk9b73)
Thu, 12 Jul 2018 08:44:39 +0800 weijun 8206189: sun/security/pkcs12/EmptyPassword.java fails with Sequence tag error
Thu, 12 Jul 2018 17:29:48 -0700 mikael 8207011: Remove uses of the register storage class specifier
Thu, 12 Jul 2018 10:41:44 -0400 gadams 8206007: nsk/jdb/exclude001 test is taking a long time on some builds
Thu, 12 Jul 2018 13:32:45 -0700 lmesnik 8139876: Exclude hanging nsk/stress/stack from execution with deoptimization enabled
Thu, 12 Jul 2018 14:13:15 -0700 darcy 8028563: Remove javac support for 6/1.6 source and target values
Tue, 17 Jul 2018 15:23:21 -0700 vromero fixing test CheckForCorrectMRefTest.javacondy-folding
Tue, 17 Jul 2018 13:28:17 -0700 vromero fixes for regression test MethodHandleRefTest.javacondy-folding
Tue, 17 Jul 2018 12:48:03 -0700 vromero fixing failing regression testscondy-folding
Thu, 12 Jul 2018 14:15:23 -0700 vromero manual merge with defaultswitch
Thu, 12 Jul 2018 13:57:46 -0700 vromero manual merge with defaultdatum
Thu, 12 Jul 2018 12:54:12 -0700 vromero skip the record attribute during class file parsing for nowdatum
Thu, 12 Jul 2018 22:07:12 +0200 mcimadamore Automatic merge with jep-334condy-folding
Thu, 12 Jul 2018 22:06:43 +0200 mcimadamore Automatic merge with defaultlambda-leftovers
Thu, 12 Jul 2018 22:06:22 +0200 mcimadamore Automatic merge with defaultraw-string-literal
Thu, 12 Jul 2018 22:06:00 +0200 mcimadamore Automatic merge with defaultpatterns
Thu, 12 Jul 2018 22:05:39 +0200 mcimadamore Automatic merge with defaultenhanced-enums
Thu, 12 Jul 2018 22:05:18 +0200 mcimadamore Automatic merge with defaultstats-before-this-super
Thu, 12 Jul 2018 22:04:57 +0200 mcimadamore Automatic merge with defaultjep-334
Thu, 12 Jul 2018 12:06:22 -0700 joehw 8194680: StartElement#getAttributes and getNamespaces refer to incorrect package
Thu, 12 Jul 2018 11:32:14 -0700 igerasim 8206122: Use Queue in place of ArrayList when need to remove first element
Thu, 12 Jul 2018 11:18:01 -0700 igerasim 8207060: Memory leak when malloc fails within WITH_UNICODE_STRING block
Thu, 12 Jul 2018 06:04:57 -0700 igerasim 8207145: (fs) Native memory leak in WindowsNativeDispatcher.LookupPrivilegeValue0
Wed, 11 Jul 2018 13:55:38 -0400 zgu 8207056: Epsilon GC to support object pinning
Thu, 12 Jul 2018 12:22:54 +0200 jwilhelm Added tag jdk-12+2 for changeset 69b438908512
Wed, 11 Jul 2018 16:12:18 -0700 darcy 8207055: Make javac -help output for -source and -target more informative
Wed, 11 Jul 2018 14:32:42 -0700 bchristi 8207005: Disable the file canonicalization cache by default
Wed, 11 Jul 2018 21:41:43 +0200 jwilhelm Merge
Wed, 11 Jul 2018 15:08:44 -0400 bulasevich 8207044: minimal vm build fail: missing #include
Wed, 11 Jul 2018 11:17:09 -0700 rhalade 8205967: Remove sun/security/krb5/auto/UnboundSSL.java from ProblemList.txt
Tue, 10 Jul 2018 10:24:08 -0700 dl 8205576: forkjoin/FJExceptionTableLeak.java fails "AssertionError: failed to satisfy condition"
Tue, 10 Jul 2018 11:36:36 +0200 ghaug 8206919: s390: add missing info to vm_version_ext_s390jdk-11+22
Wed, 11 Jul 2018 13:41:25 +0300 serb 8202264: Race condition in AudioClip.loop()
Wed, 11 Jul 2018 13:17:48 +0300 serb 8205973: Client jtreg ProblemList cleanup
Wed, 11 Jul 2018 10:39:58 +0800 jjiang 8199645: javax/net/ssl/SSLSession/TestEnabledProtocols.java failed with Connection reset
Tue, 10 Jul 2018 19:42:48 -0700 kvn 8206135: Building jvm with AOT but without JVMCI should fail at configure time
Tue, 10 Jul 2018 16:14:48 -0700 mikael 8207007: Add missing license header to zHash.inline.hpp
Tue, 10 Jul 2018 13:54:17 -0700 epavlova 8206951: [Graal] org.graalvm.compiler.hotspot.test.GraalOSRTest to ProblemList-graal.txt
Tue, 10 Jul 2018 13:34:32 -0400 kbarrett 8204691: HeapRegion.apply_to_marked_objects_other_vm_test fails with assert(!hr->is_free() || hr->is_empty()) failed: Free region 0 is not empty for set Free list #
Tue, 10 Jul 2018 15:33:55 +0200 thartmann 8205472: Deadlock in Kitchensink when trying to print compile queues causing timeout
Tue, 10 Jul 2018 15:09:34 +0200 tschatzl 8206476: Wrong assert in phase_enum_2_phase_string() in referenceProcessorPhaseTimes.cpp
Fri, 29 Jun 2018 17:59:44 +0200 roland 8202123: C2 Crash in Node::in(unsigned int) const+0x14
Tue, 10 Jul 2018 03:14:55 -0400 dholmes 8206954: Test runtime/Thread/ThreadPriorities.java crashes with SEGV in pthread_getcpuclockid
Mon, 09 Jul 2018 22:20:02 -0700 kvn 8206952: java/lang/Class/GetPackageBootLoaderChildLayer.java fails with Graal
Tue, 10 Jul 2018 10:59:57 +0800 jjiang 8203007: Address missing block coverage for ChaCha20 and Poly1305 algorithms
Mon, 09 Jul 2018 20:17:32 -0400 dholmes 8205878: pthread_getcpuclockid is expected to return 0 code
Mon, 09 Jul 2018 14:21:33 -0700 erikj 8206323: Missing some legal notices in docs bundle
Mon, 09 Jul 2018 13:26:59 -0700 jjg 8185740: The help-doc.html generated by the doclet is outdated
Mon, 09 Jul 2018 13:25:08 -0700 vdeshpande 8194740: UseSubwordForMaxVector causes performance regression
Mon, 09 Jul 2018 11:15:55 -0700 iignatyev 8206287: fix legal notice in hotspot tests
Mon, 09 Jul 2018 10:25:55 -0700 prr 8206106: [solaris sparc] jck tests api/javax_print/PrintService failing
Mon, 09 Jul 2018 10:23:17 -0700 prr 8205646: Broken link in jdk.jsobject
Mon, 09 Jul 2018 09:09:21 -0700 erikj 8206433: Several jib profiles missing autoconf dependency
Mon, 09 Jul 2018 19:09:29 +0300 serb 8205588: Deprecate for removal com.sun.awt.SecurityWarning
Mon, 09 Jul 2018 12:51:58 +0200 ghaug 8206408: Add missing CPU/system info to vm_version_ext on PPC64
Mon, 09 Jul 2018 16:36:05 +0300 serb 8201611: Broken links in java.desktop javadoc
Mon, 09 Jul 2018 15:26:58 +0200 mdoerr 8206459: [s390] Prevent restoring incorrect bcp and locals in interpreter and avoid incorrect size of partialSubtypeCheckNode in C2
Mon, 09 Jul 2018 09:38:11 +0100 adinn 8206163: AArch64: incorrect code generation for StoreCM
Mon, 09 Jul 2018 10:19:51 +0200 tschatzl 8205426: Humongous continues remembered set does not match humongous start region one after Remark
Mon, 09 Jul 2018 12:20:56 +0800 weijun 8198352: java.util.MissingResourceException: sun.security.util.AuthResources when trying to use com.sun.security.auth.module.UnixLoginModule
Sun, 08 Jul 2018 20:00:46 -0400 dholmes 8205966: [testbug] New Nestmates JDI test times out with Xcomp on sparc
Sun, 08 Jul 2018 11:54:08 +0200 mgronlun 8203943: eventThreadGroup was null in TestJavaBlockedEvent.java
Fri, 06 Jul 2018 12:10:43 -0700 cushon 8204630: Generating an anonymous class with Filer#createClassFile causes an NPE in JavacProcessingEnvironment
Fri, 06 Jul 2018 13:45:41 -0700 kvn 8193126: Incorrect setting of MetaspaceSize and NewSizeThreadIncrease when using JVMCI compiler
Fri, 06 Jul 2018 10:39:38 -0700 prr 8206375: ProblemList update of bug ID for SwingFontMetricsTest
Fri, 06 Jul 2018 10:37:47 -0700 prr 8206428: Upgrade JDK11 to harfbuzz 1.8.2
Fri, 06 Jul 2018 13:38:56 +0530 sdama 8206450: Add JImageListTest.java to ProblemList.txt
Fri, 06 Jul 2018 09:22:18 +0200 simonis 8206436: sun/nio/cs/TestIBMBugs.java no longer compiles
Thu, 05 Jul 2018 20:00:04 -0700 iignatyev 8206429: [REDO] 8202561 clean up TEST.groups
Thu, 05 Jul 2018 12:38:36 -0700 kvn 8206324: compiler/whitebox/DeoptimizeFramesTest.java to ProblemList-graal.txt
Thu, 05 Jul 2018 09:38:15 +0200 mbaesken 8206394: missing ResourceMark in AOTCompiledMethod::metadata_do, AOTCompiledMethod::clear_inline_caches , CompiledMethod::clear_ic_stubs , CompiledMethod::cleanup_inline_caches_impl
Fri, 06 Jul 2018 00:40:12 +0530 sdama 8198405: JImageExtractTest.java & JImageListTest.java failed in Windows.
Thu, 05 Jul 2018 21:29:11 +0300 serb 8205454: & is displayed in some Swing docs
Tue, 12 Jun 2018 13:00:50 +0530 simonis 8202329: [AIX] Fix codepage mappings for IBM-943 and Big5
Thu, 05 Jul 2018 19:05:08 +0300 serb 8189604: possible hang in sun.awt.shell.Win32ShellFolder2$KnownFolderDefinition::<clinit>
Thu, 05 Jul 2018 13:26:50 +0200 jwilhelm Added tag jdk-11+21 for changeset 14708e1acdc3
Thu, 05 Jul 2018 11:56:19 +0200 stuefe 8206243: java -XshowSettings fails if memory.limit_in_bytes overflows LONG.max
Thu, 05 Jul 2018 13:22:44 +0800 xiaofeya 8206378: Backout JDK-8202561
Wed, 04 Jul 2018 11:49:46 -0700 ssahoo 8206355: SSLSessionImpl.getLocalPrincipal() throws NPE
Wed, 04 Jul 2018 18:39:26 +0200 mgronlun 8198346: assert(!_cld->claimed()) failed in TestObjectDescription.java
Wed, 04 Jul 2018 16:16:24 +0100 michaelm 8206001: Enable TLS1.3 by default in Http Client
Wed, 04 Jul 2018 16:54:56 +0200 mbaesken 8206145: dbgsysSocketClose - do not restart close if errno is EINTR [linux]
Tue, 03 Jul 2018 12:40:42 +0200 mbaesken 8206255: fix compiler/intrinsics/sha/cli/TestUseSHAOptionOnSupportedCPU.java jtreg test on linux s390x
Tue, 03 Jul 2018 09:11:00 +0200 neliasso 8205999: C2 compilation fails with "assert(store->find_edge(load) != -1) failed: missing precedence edge"
Wed, 04 Jul 2018 17:49:21 +0530 sdama 8198819: tools/jimage/JImageExtractTest.java, fails intermittently at testExtract (macos)
Wed, 04 Jul 2018 12:04:02 +0200 pliden 8206316: ZGC: Preferred tmpfs mount point not found on Debian
Wed, 04 Jul 2018 12:04:02 +0200 pliden 8205924: ZGC: Premature OOME due to failure to expand backing file
Wed, 04 Jul 2018 16:49:34 +0800 xyin 8187069: The case auto failed with the java.lang.ClassNotFoundException: IPv6NameserverPlatformParsingTest exception
Wed, 04 Jul 2018 10:24:16 +0200 mgronlun 8206254: Unable to complete emergency dump during safepoint
Wed, 04 Jul 2018 09:21:19 +0200 simonis 8206173: MallocSiteTable::initialize() doesn't take function descriptors into account
Wed, 04 Jul 2018 08:33:00 +0200 pliden 8206322: ZGC: Incorrect license header in gtests
Wed, 04 Jul 2018 11:55:11 +0530 rgoel 8204603: Short week days, NaN value and timezone name are inconsistent between CLDR and Java in zh_CN, zh_TW locales.
Tue, 03 Jul 2018 15:08:00 -0400 bobv Merge
Tue, 03 Jul 2018 10:59:18 -0400 bobv 8205928: [TESTBUG] jdk/internal/platform/docker/TestDockerMemoryMetrics
Mon, 02 Jul 2018 10:09:01 -0700 psandoz 8202769: jck test fails with C2: vm/jvmti/FollowReferences/fref001/fref00113/fref00113.html
Thu, 28 Jun 2018 10:51:02 -0700 iignatyev 8202561: clean up TEST.groups file
Tue, 03 Jul 2018 11:16:25 -0700 mchung 8206184: docs-reference build fails due to extlink.spec.version property not set
Tue, 03 Jul 2018 09:27:41 +0800 jjiang 8205984: javax/net/ssl/compatibility/Compatibility.java failed to access port log filejdk-11+21
Mon, 02 Jul 2018 17:54:36 -0700 jjg 8205563: modules/AnnotationProcessing.java failed testGenerateSingleModule
Wed, 11 Jul 2018 14:44:05 -0400 coleenp 8198720: Obsolete PrintSafepointStatistics, PrintSafepointStatisticsTimeout and PrintSafepointStatisticsCount options
Wed, 11 Jul 2018 13:28:07 -0400 zgu 8206183: Possible construct EMPTY_STACK and allocation stack, etc. on first use
Wed, 11 Jul 2018 08:24:39 -0700 darcy 8173606: Deprecate constructors of 7-era visitors
Wed, 11 Jul 2018 08:44:00 +0200 shade 8206931: Misleading "COMPILE SKIPPED: invalid non-klass dependency" compile logjdk-12+2
Tue, 10 Jul 2018 19:04:13 -0700 ccheung 8205946: JVM crash after call to ClassLoader::setup_bootstrap_search_path()
Tue, 10 Jul 2018 10:24:08 -0700 dl 8205620: Miscellaneous changes imported from jsr166 CVS 2018-07
Tue, 10 Jul 2018 10:24:08 -0700 dl 8205576: forkjoin/FJExceptionTableLeak.java fails "AssertionError: failed to satisfy condition"
Tue, 10 Jul 2018 10:24:08 -0700 dl 8206123: ArrayDeque created with default constructor can only hold 15 elements
Tue, 10 Jul 2018 11:13:33 -0400 coleenp 8206471: Race with ConcurrentHashTable deleting items on insert with cleanup thread
Tue, 10 Jul 2018 03:14:55 -0400 dholmes 8206954: Test runtime/Thread/ThreadPriorities.java crashes with SEGV in pthread_getcpuclockid
Mon, 09 Jul 2018 20:17:32 -0400 dholmes 8205878: pthread_getcpuclockid is expected to return 0 code
Mon, 09 Jul 2018 13:08:30 -0700 sherman 8206389: JarEntry.setCreation/LastAccessTime without setLastModifiedTime causes Invalid CEN header
Mon, 09 Jul 2018 13:35:55 -0400 kbarrett 8204834: Fix confusing "allocate" naming in OopStorage
Mon, 09 Jul 2018 14:12:50 +0200 tschatzl 8206453: Taskqueue stats should count real steal attempts, not calls to GenericTaskQueueSet::steal
Sun, 08 Jul 2018 20:00:46 -0400 dholmes 8205966: [testbug] New Nestmates JDI test times out with Xcomp on sparc
Sun, 08 Jul 2018 12:43:05 -0400 jiangli 8202035: Archive the set of ModuleDescriptor and ModuleReference objects for observable system modules with unnamed initial module.
Fri, 06 Jul 2018 15:22:07 -0400 rriggs 8206495: Redundant System.setProperty(null) tests
Fri, 06 Jul 2018 10:28:56 -0700 darcy 8206439: Remove javac -source/-target 6 from langtools regression tests
Fri, 06 Jul 2018 09:37:44 -0700 darcy 8206440: Remove javac -source/-target 6 from jdk regression tests
Fri, 06 Jul 2018 09:26:01 -0700 joehw 8206164: forgot to "throw" TransformerConfigurationException
Fri, 06 Jul 2018 09:10:07 -0400 coleenp 8205417: Obsolete UnlinkSymbolsALot debugging option
Fri, 06 Jul 2018 06:26:25 -0700 hseigel 8203911: Test runtime/modules/getModuleJNI/GetModule fails with -Xcheck:jni
Fri, 06 Jul 2018 09:00:48 -0400 coleenp 8202737: Obsolete AllowNonVirtualCalls option
Thu, 05 Jul 2018 14:35:03 -0700 jjg 8206318: Enhance package documentation for internal javadoc packages
Thu, 05 Jul 2018 14:23:45 -0700 naoto 8206350: java/util/Locale/bcp47u/SystemPropertyTests.java failed on Mac 10.13 with zh_CN and zh_TW locales.
Thu, 05 Jul 2018 19:22:53 +0200 rkennke 8206272: Remove stray BarrierSetAssembler call
Thu, 05 Jul 2018 19:22:38 +0200 rkennke 8206407: Primitive atomic_cmpxchg_in_heap_at() in BarrierSet::Access needs to call non-oop raw method
Thu, 05 Jul 2018 09:11:33 -0700 ccheung 8205548: Remove multi-release jar related vm code
Thu, 05 Jul 2018 07:22:21 -0700 bpb 8194899: Remove unused sun.net classes
Thu, 05 Jul 2018 13:31:04 +0200 jwilhelm Added tag jdk-12+1 for changeset 00b16d0457e4
Wed, 04 Jul 2018 03:44:32 -0700 ssahoo 8205653: test/jdk/sun/management/jmxremote/bootstrap/RmiRegistrySslTest.java and RmiSslBootstrapTest.sh fail with handshake_failurejdk-12+1
Tue, 03 Jul 2018 16:14:46 -0700 darcy 8206114: Refactor langtools/tools/javac/classfiles/ClassVersionChecker.java
Tue, 03 Jul 2018 15:59:09 -0700 darcy 8206085: Refactor langtools/tools/javac/versions/Versions.java
Tue, 03 Jul 2018 15:02:46 -0700 bpb 8202252: (aio) Closed AsynchronousSocketChannel keeps completion handler alive
Tue, 03 Jul 2018 14:42:13 -0700 naoto 8206120: Add test cases for lenient Japanese era parsing
Tue, 03 Jul 2018 15:40:08 -0400 coleenp 8206309: Tier1 SA tests fail
Tue, 03 Jul 2018 15:08:01 -0400 coleenp 8134538: Duplicate implementations of os::lasterror
Tue, 03 Jul 2018 13:41:18 -0400 coleenp 8205534: Remove SymbolTable dependency from serviceability agent
Tue, 03 Jul 2018 18:46:51 +0200 erikj 8206087: windows-x64-cmp-baseline fails with The files do not have the same suffix type
Mon, 02 Jul 2018 23:33:40 -0700 vtheeyarath 8177275: IllegalArgumentException when MH would have too many parameters is not specified for several methods
Tue, 03 Jul 2018 10:47:50 +0200 neliasso 8205999: C2 compilation fails with "assert(store->find_edge(load) != -1) failed: missing precedence edge"
Tue, 03 Jul 2018 02:07:49 +0200 jwilhelm Merge
Mon, 02 Jul 2018 16:28:09 -0400 zgu 8205965: SIGSEGV on write to NativeCallStack::EMPTY_STACK
Mon, 02 Jul 2018 10:44:46 +0200 roland 8205515: assert(opcode == Op_RangeCheck) failed: no other if variant here
Mon, 02 Jul 2018 13:11:41 +0200 jwilhelm Added tag jdk-11+20 for changeset 9816d7cc655e
Mon, 02 Jul 2018 11:46:15 +0200 mdoerr 8206003: SafepointSynchronize with TLH: StoreStore barriers should be moved out of the loop
Mon, 02 Jul 2018 09:38:20 +0200 tschatzl 8203848: Missing remembered set entry in j.l.ref.references after JDK-8203028
Mon, 02 Jul 2018 09:28:23 +0200 thartmann 8206093: compiler/graalunit/HotspotTest.java fails in CheckGraalIntrinsics
Sat, 30 Jun 2018 00:33:05 +0000 valeriep 8205720: KeyFactory#getKeySpec and translateKey thorws NullPointerException with Invalid key
Fri, 29 Jun 2018 13:58:16 -0700 serb 8201552: Ellipsis in "Classical" label in SwingSet2 demo with Windows L&F at Hidpi
Fri, 29 Jun 2018 13:44:13 -0700 iignatyev 8204355: [Graal] org.graalvm.compiler.debug.test.CSVUtilTest fails on Windows due to improper line separator used
Fri, 29 Jun 2018 13:44:09 -0700 iignatyev 8204517: [Graal] org.graalvm.compiler.debug.test.VersionsTest fails with InvalidPathException on windows
Fri, 29 Jun 2018 13:43:35 -0700 iignatyev 8206117: failed to get JDK properties for JVM w/o JVMCI
Fri, 29 Jun 2018 11:10:47 +0200 thartmann 8205940: LoadNode::find_previous_arraycopy fails with "broken allocation" assertjdk-11+20
Fri, 29 Jun 2018 11:08:38 +0200 thartmann 8205499: C1 temporary code buffers are not removed with -XX:+UseDynamicNumberOfCompilerThreads
Thu, 28 Jun 2018 21:58:23 -0700 iignatyev 8206088: 8205207 broke builds
Thu, 28 Jun 2018 19:33:00 -0700 epavlova 8195630: [Graal] vmTestbase/nsk/jvmti/AttachOnDemand/attach024/TestDescription.java fails with Graal
Fri, 29 Jun 2018 08:21:15 +0800 weijun 8205927: Update src/java.base/share/legal/public_suffix.md to match the actual file version
Thu, 28 Jun 2018 17:07:34 -0700 epavlova 8205207: Port Graal unit tests under jtreg
Thu, 28 Jun 2018 16:45:15 -0700 iignatyev 8149729: [jittester] Replace all 'path1 +"/" + path2' with Paths::get
Fri, 29 Jun 2018 01:09:29 +0200 jwilhelm 8206006: Build failed on Windows
Mon, 02 Jul 2018 13:54:01 -0700 joehw 8204329: Java API doc for XMLStreamReader.next() needs to be clarified for the exception thrown when hasNext() method returns false
Mon, 02 Jul 2018 16:28:09 -0400 zgu 8205965: SIGSEGV on write to NativeCallStack::EMPTY_STACK
Mon, 02 Jul 2018 00:55:24 -0700 rraghavan 8203504: [Graal] org.graalvm.compiler.debug.test.DebugContextTest fails with java.util.ServiceConfigurationError
Mon, 02 Jul 2018 09:21:06 +0200 thartmann 8206093: compiler/graalunit/HotspotTest.java fails in CheckGraalIntrinsics
Fri, 29 Jun 2018 17:35:04 -0700 igerasim 8204310: Simpler RandomAccessFile.setLength() on Windows
Fri, 29 Jun 2018 12:34:03 -0700 dtitov 8206086: [Graal] JDI tests fail with com.sun.jdi.ObjectCollectedException
Fri, 29 Jun 2018 10:13:24 -0700 joehw 8190835: Subtraction with two javax.xml.datatype.Duration gives incorrect result
Fri, 29 Jun 2018 10:41:10 +0200 jlahoda 8205418: Assorted improvements to source code model
Thu, 28 Jun 2018 17:49:13 -0700 darcy 8206083: Make tools/javac/api/T6265137.java robust to JDK version changes
Thu, 28 Jun 2018 17:45:59 -0700 mikael 8206022: Add test to check that the JVM accepts class files with version 56
Thu, 28 Jun 2018 15:46:27 -0700 jjg 8202959: Rearrange the top and bottom navigation bar in the javadoc generated pages
Thu, 28 Jun 2018 22:28:41 +0200 jwilhelm 8206006: Build failed on Windows
Wed, 11 Jul 2018 15:13:07 -0700 vromero changing the impl for Class::isRecorddatum
Wed, 11 Jul 2018 14:30:16 -0700 vromero adding method Class::isRecord non-native versiondatum
Wed, 11 Jul 2018 14:30:14 -0700 vromero removing Class::isRecord native versiondatum
Wed, 11 Jul 2018 13:02:59 -0700 vromero adding method Class::isRecorddatum
Wed, 11 Jul 2018 15:56:44 +0200 jlahoda Adjusting test output.switch
Wed, 11 Jul 2018 10:42:58 +0100 gbierman More tests for switch expressionswitch
Wed, 11 Jul 2018 11:07:00 +0200 jlahoda Ambiguity between expression and label in breaks should be an error.switch
Wed, 11 Jul 2018 11:06:01 +0200 jlahoda Adding example for compiler.misc.incompatible.type.in.switch.expression.switch
Wed, 11 Jul 2018 11:04:50 +0200 jlahoda Adjusting output files.switch
Tue, 10 Jul 2018 14:07:43 -0700 vromero manual merge with jep-334condy-folding
Tue, 10 Jul 2018 17:14:40 +0200 jlahoda Adding @bug tags.switch
Tue, 10 Jul 2018 14:54:32 +0200 jlahoda Marking new APIs as terminally deprecated.switch
Tue, 10 Jul 2018 14:19:38 +0200 jlahoda Fixing error message when there are incompatible types in switch expression.switch
Tue, 10 Jul 2018 10:56:51 +0200 jlahoda Various bugfixes for problems reported by mcimadamore and gbierman.switch
Mon, 09 Jul 2018 12:55:55 -0700 psandoz Invoke dynamic constant bootstrap methods that are ordinary static methodscondy-folding
Mon, 09 Jul 2018 15:02:42 +0100 gbierman Added more tests for switch expressionsswitch
Tue, 03 Jul 2018 08:17:31 -0700 vromero adding the Record attributedatum
Fri, 29 Jun 2018 08:11:37 -0700 vromero manual merge with defaultjep-334
Fri, 29 Jun 2018 08:00:56 -0700 vromero manual merge with defaultlambda-leftovers
Fri, 29 Jun 2018 16:40:37 +0200 jlahoda Changing switch enhancements to be preview features.switch
Fri, 29 Jun 2018 13:42:14 +0200 jlahoda Assorted cleanups to the switch branch.switch
Thu, 28 Jun 2018 22:14:21 +0200 mcimadamore Automatic merge with defaultraw-string-literal
Thu, 28 Jun 2018 22:13:55 +0200 mcimadamore Automatic merge with defaultswitch
Thu, 28 Jun 2018 22:13:25 +0200 mcimadamore Automatic merge with defaultpatterns
Thu, 28 Jun 2018 22:13:01 +0200 mcimadamore Automatic merge with defaultenhanced-enums
Thu, 28 Jun 2018 22:12:36 +0200 mcimadamore Automatic merge with defaultstats-before-this-super
Thu, 28 Jun 2018 22:12:08 +0200 mcimadamore Automatic merge with defaultdatum
Thu, 28 Jun 2018 21:11:50 +0200 jwilhelm Added tag jdk-12+0 for changeset 95aad0c785e4
Wed, 27 Jun 2018 21:01:12 -0700 darcy 8205615: Start of release updates for JDK 12
Thu, 28 Jun 2018 19:55:44 +0200 jwilhelm Added tag jdk-12+0 for changeset c9cd3ec6a0eb
Thu, 28 Jun 2018 11:41:45 -0700 rhalade 8195774: Add Entrust root certificates
Thu, 28 Jun 2018 10:31:39 -0400 gadams 8205508: hotspot/jtreg/vmTestbase/nsk/jdb/exclude/exclude001/exclude001.java fails with Prompt is not received during 300200 milliseconds.jdk-12+0
Thu, 28 Jun 2018 10:50:10 -0400 dcubed Merge
Thu, 28 Jun 2018 15:17:44 +0200 egahlin 8137164: Include PID in the JFR jcmd hint
Thu, 28 Jun 2018 10:46:05 -0400 dcubed 8206004: [BACKOUT] errant changeset for JDK-8137164
Thu, 28 Jun 2018 07:30:38 -0700 mr 8205956: Fix usage of "OpenJDK" in build and test instructions
Thu, 28 Jun 2018 19:44:58 +0530 sdama 8204967: Resolve disabled warnings for libunpack
Thu, 28 Jun 2018 15:18:17 +0200 jlahoda 8205985: Remove tools/javac/options/release/ReleaseOptionUnsupported.java from problem list
Thu, 28 Jun 2018 14:22:28 +0200 eosterlund 8205683: Refactor heap allocation to separate concerns
Thu, 28 Jun 2018 15:17:44 +0200 egahlin 8197425: Liveset information for Old Object sample event
Thu, 28 Jun 2018 15:13:39 +0200 egahlin 8197425: Liveset information for Old Object sample event
Thu, 28 Jun 2018 15:06:55 +0200 rwestberg 8003209: JFR events for network utilization
Thu, 28 Jun 2018 18:04:19 +0530 sundar 8204492: Add deprecation annotation to Nashorn APIs and warning to nashorn, jjs
Thu, 28 Jun 2018 13:58:30 +0200 mgronlun 8205996: JDK-8205906 broke the build on Mac
Thu, 28 Jun 2018 03:45:49 -0700 amenkov 8205681: [TEST_BUG] vmTestbase/nsk/jvmti/Allocate/alloc001/TestDescription.java fails with exit code 98
Thu, 28 Jun 2018 12:14:37 +0200 pliden 8205993: ZGC: Fix typos and incorrect indentations
Thu, 28 Jun 2018 10:09:58 +0000 adinn 8205694: AArch64: Add test to validate volatile load, store and CAS code generation
Thu, 28 Jun 2018 11:37:02 +0200 mgronlun 8205906: jdk.jfr.jcmd.TestJcmdDumpLimited fails due to erronous processing of -XX:FlightRecorderOptions
Thu, 28 Jun 2018 11:32:32 +0200 stuefe 8205925: Print correct and more information about secondary errors
Wed, 27 Jun 2018 15:04:27 +0200 stefank 8205923: ZGC: Verification applies load barriers before verification
Wed, 27 Jun 2018 15:02:53 +0200 stefank 8205923: ZGC: Verification applies load barrier before verification
Thu, 28 Jun 2018 01:10:09 -0700 igerasim 8205959: Do not restart close if errno is EINTR
Thu, 28 Jun 2018 10:05:43 +0200 jlahoda 8205913: Inconsistent source code model
Thu, 28 Jun 2018 10:05:39 +0200 jlahoda 8195986: Incorrect javac -h output with annotation processing and missing classes
Thu, 28 Jun 2018 09:15:53 +0200 pliden 8205679: Remove unused ThreadLocalAllocBuffer::undo_allocate()
Thu, 28 Jun 2018 09:06:54 +0200 simonis 8205916: [test] Fix jdk/tools/launcher/RunpathTest to handle both, RPATH and RUNPATH
Thu, 28 Jun 2018 07:22:59 +0200 pliden 8205702: assert(UseCompressedClassPointers) failed in universe.hpp
Thu, 28 Jun 2018 07:00:35 +0200 stuefe 8205531: jcmd VM.classloaders should fold similar loaders
Thu, 28 Jun 2018 00:34:55 -0400 kbarrett 8205577: parallel/TestPrintGCDetailsVerbose.java fails assertion
Thu, 28 Jun 2018 09:40:46 +0530 hb 8192953: sun/management/jmxremote/bootstrap/*.sh tests fail with error : revokeall.exe: Permission denied
Wed, 27 Jun 2018 20:21:42 -0700 kvn 8205528: Base64 encoding algorithm using AVX512 instructions
Wed, 27 Jun 2018 19:09:17 -0700 cjplummer 8205719: Windows Java_sun_tools_attach_VirtualMachineImpl_enqueue() method should include exitCode in exception message
Wed, 27 Jun 2018 17:02:41 -0700 never 8205824: Update Graal
Wed, 27 Jun 2018 16:57:21 -0700 iignatyev 8160673: Jittester: investigate bytecode generation hangs during bytecode tests generation
Thu, 28 Jun 2018 01:46:03 +0200 hannesw 8190876: javadoc search on "java.se" shows "java.se" the last one among other modules
Wed, 27 Jun 2018 16:19:28 -0700 iignatyev 8205954: clean up hotspot ProblemList
Wed, 27 Jun 2018 16:17:11 -0700 erikj 8205942: Build failure on macosx after JDK-8189429
Wed, 27 Jun 2018 15:15:11 -0700 iignatyev 8202554: Remove hotspot tests for javafx.* modules
Wed, 27 Jun 2018 22:26:41 +0200 redestad 8205926: Support invokeSpecialIFC in GenerateJLIClassesPlugin
Wed, 27 Jun 2018 14:46:15 -0700 ccheung 8203664: JFR start failure after AppCDS archive created with JFR StartFlightRecording
Wed, 27 Jun 2018 14:20:41 -0700 jjg 8205438: Re-enable shebang tests in test/jdk/tools/launchers/SourceMode.java
Wed, 27 Jun 2018 13:43:52 -0700 iignatyev 8199265: java/util/Arrays/TimSortStackSize2.java fails with OOM
Wed, 27 Jun 2018 21:18:33 +0100 dfuchs 8205945: Revert unintended changes to make/gensrc/Gensrc-jdk.hotspot.agent.gmk
Wed, 27 Jun 2018 21:56:11 +0200 glaubitz 8205616: Build fails with system headers after 8204572
Wed, 27 Jun 2018 20:19:59 +0100 dfuchs 8205397: InetAddress has wrong declaration for readObjectNoData
Wed, 27 Jun 2018 19:45:06 +0200 pliden 8205678: ZGC: Remove unused ZAllocationFlags::java_thread()
Wed, 27 Jun 2018 19:45:05 +0200 pliden 8205676: ZGC: Remove TLAB allocations in relocation path
Wed, 27 Jun 2018 10:06:03 -0700 prr Merge
Mon, 25 Jun 2018 17:34:55 -0700 serb 4475138: getBestCursorSize and XFree86 4.1.0
Mon, 25 Jun 2018 14:56:07 -0700 prr Merge
Mon, 25 Jun 2018 11:40:46 -0700 srl 8187100: Support Unicode Variation Selectors
Mon, 25 Jun 2018 10:21:50 -0700 prr Merge
Mon, 25 Jun 2018 14:32:46 +0530 sveerabhadra 8153732: Windows remote printer changes do not reflect in lookupPrintServices()
Mon, 25 Jun 2018 12:50:25 +0530 pbansal 8194873: right ALT key hotkeys no longer work in Swing components
Mon, 25 Jun 2018 16:01:01 +0530 pkbalakr 8202696: Remove exclusion range for phonetic chars in windows fontconfig.properties