log

age author description
Wed, 24 Jul 2019 11:49:39 +0200 tschatzl 8227719: G1 Pending cards estimation too conservative in cost prediction
Wed, 24 Jul 2019 11:49:39 +0200 tschatzl 8226913: Scale cards per chunk used during heap root scanning with region size
Tue, 23 Jul 2019 20:03:03 -0700 mchung 8219774: Reexamine the initialization of LangReflectAccess shared secret at AccessibleObject::<clinit>
Tue, 23 Jul 2019 11:36:05 -0700 mseledtsov 8227122: [TESTBUG] Create Docker sidecar test cases
Tue, 23 Jul 2019 13:56:41 -0400 coleenp 8228484: Remove NoAllocVerifier because nothing uses it
Thu, 18 Jul 2019 13:58:34 -0700 ascarpino 8228396: Re-enable Stateless Resumption On by default for merge to mainline
Tue, 23 Jul 2019 11:17:59 -0700 mikael Merge
Mon, 22 Jul 2019 15:54:25 -0700 jjg 8228492: Remove pako.md
Mon, 22 Jul 2019 10:39:10 -0700 ascarpino 8228399: Remove mistaken open.iml
Mon, 22 Jul 2019 08:07:15 -0700 naoto 8228450: unicode.md and icu.md text should be pre-formatted
Wed, 10 Jul 2019 11:11:30 +0200 mbaesken 8227247: tools/sjavac/IdleShutdown.java fails with AssertionError: Error too big on windows
Thu, 18 Jul 2019 12:29:57 -0700 dtitov 8221303: sun/management/jmxremote/bootstrap/JMXInterfaceBindingTest.java fails due to java.rmi.server.ExportException: Port already in use
Thu, 18 Jul 2019 11:47:52 -0700 iignatyev 8226910: make it possible to use jtreg's -match via run-test framework
Thu, 18 Jul 2019 09:15:26 -0700 kbarrett 8228340: JVMCI deleteGlobalHandle doesn't delete the handle
Tue, 02 Jul 2019 10:28:20 +0200 stuefe 8227041: runtime/memory/RunUnitTestsConcurrently.java has a memory leak
Thu, 18 Jul 2019 11:15:20 +0200 eosterlund 8224674: NMethod state machine is not monotonic
Thu, 18 Jul 2019 13:41:55 +0800 weijun 8228342: Add SignTwice.java to problem list
Thu, 18 Jul 2019 08:53:06 +0800 weijun 8217375: jarsigner breaks old signature with long lines in manifest
Wed, 17 Jul 2019 12:26:56 -0300 mbalao 8227437: S4U2proxy cannot continue because server's TGT cannot be found
Wed, 17 Jul 2019 16:13:26 -0700 rhalade 8048595: problemList failing/ignored manual tests in security-libs
Wed, 17 Jul 2019 14:37:50 -0700 ascarpino 8226338: Updates to Stateless Resumption
Wed, 17 Jul 2019 13:41:12 -0700 mikael Added tag jdk-13+30 for changeset 2e63fb0a885f
Wed, 17 Jul 2019 12:31:21 -0700 ascarpino 8227551: Session Resumption without Server-Side State off by default
Wed, 17 Jul 2019 08:34:45 -0700 ccheung 8227646: [TESTBUG] appcds/SharedArchiveConsistency timed outjdk-13+30
Fri, 19 Jul 2019 11:09:41 +0200 mbaesken 8228426: xlc: switch to clang-style warning disabling
Mon, 22 Jul 2019 10:15:46 +0200 mbaesken 8228468: awt_Robot.c : format string contains 0 within the string body
Tue, 23 Jul 2019 00:29:31 -0400 dholmes 8225782: Remove expired flags in JDK 14
Thu, 11 Jul 2019 03:28:43 +0530 rpatil 8154520: java.time: appendLocalizedOffset() should return the localized "GMT" string
Mon, 22 Jul 2019 16:10:25 -0700 jjg 8222791: Order of evaluation of -link params in Javadoc tool reversed -> regression with split packages
Sat, 13 Jul 2019 12:15:17 -0400 zgu 8227866: Shenandoah: Split weak root processing and class unloading in parallel cleaning task
Mon, 22 Jul 2019 10:26:21 -0700 amenkov 8227693: HTML error in jdwp-protocol.html
Mon, 22 Jul 2019 14:40:00 +0200 rschmelter 8227868: jinfo and jstack can fail converting UTF8 output to strings
Mon, 22 Jul 2019 10:48:14 +0200 sgehwolf 8228434: jdk/net/Sockets/Test.java fails after JDK-8227642
Mon, 22 Jul 2019 12:21:18 +0200 jlahoda 8227923: End position of EndElementTree is -1
Mon, 22 Jul 2019 14:31:04 +0800 jiefu 8225648: [TESTBUG] java/lang/annotation/loaderLeak/Main.java fails with -Xcomp
Wed, 17 Jul 2019 15:40:27 +0200 mbaesken 8227869: fix wrong format specifiers in os_aix.cpp
Tue, 16 Jul 2019 16:01:10 +0200 mbaesken 8227737: avoid implicit-function-declaration on AIX
Fri, 19 Jul 2019 16:47:11 -0400 kbarrett 8162929: Enqueuing dirty cards into a single DCQS during GC does not scale
Fri, 19 Jul 2019 12:39:31 -0400 tonyp 8227179: Test for new gc+metaspace=info output format
Fri, 19 Jul 2019 15:36:23 +0200 redestad 8228394: Cleanup unused java.net SharedSecrets classes
Fri, 19 Jul 2019 16:25:04 +0300 vlivanov 8227260: JNI upcalls should bypass class initialization barrier in c2i adapter
Mon, 08 Jul 2019 17:44:34 +0200 sgehwolf 8227397: Add --with-extra-asflags configure option
Fri, 19 Jul 2019 12:35:33 +0200 mbaesken 8228420: compile error in shenandoahSupport.cpp with clang 9
Fri, 12 Jul 2019 19:37:25 +0200 sgehwolf 8227642: [TESTBUG] Make docker tests podman compatible
Fri, 19 Jul 2019 10:18:48 +0200 mdoerr 8227692: Remove develop feature PrintMallocStatistics
Thu, 18 Jul 2019 14:01:54 +0200 mbaesken 8228368: avoid incompatible pointer to integer conversion initializing gint in gtk2_interface
Tue, 16 Jul 2019 14:42:36 +0200 mbaesken 8227633: avoid comparing this pointers to NULL
Fri, 19 Jul 2019 02:40:59 +0000 joehw 8157830: Errors in XSLT stylesheet are not dispatched correctly to ErrorListener
Thu, 18 Jul 2019 17:10:33 -0700 bpb 8228392: Backout incorrect change done by JDK-8067801
Thu, 18 Jul 2019 14:57:32 -0400 kbarrett 8227653: Add VM Global OopStorage
Wed, 17 Jul 2019 08:33:38 -0400 zgu 8227755: Need more than 2 distinct CodeCache unloading cycles
Thu, 18 Jul 2019 11:54:54 -0400 kbarrett 8227652: SetupOperatorNewDeleteCheck should discuss deleting destructors
Thu, 18 Jul 2019 07:54:21 -0700 bpb 8228338: tools/pack200/TimeStamp.java fails with NullPointerException
Thu, 18 Jul 2019 21:25:41 +0900 ysuenaga 8227815: Minimal VM: set_state is not a member of AttachListener
Thu, 18 Jul 2019 13:16:10 +0200 rkennke 8228364: Shenandoah: Remove unused code from ShenandoahBarrierSetC1
Thu, 18 Jul 2019 07:06:33 -0400 coleenp 8227766: CheckUnhandledOops is broken in MemAllocator
Thu, 18 Jul 2019 10:25:49 +0200 rschmelter 8227435: Perf::attach() should not throw a java.lang.Exception
Wed, 17 Jul 2019 09:58:42 +0200 mbaesken 8227834: build.log output from failing commands : include the hs_error file path in case of crashes in build
Wed, 10 Jul 2019 11:11:30 +0200 mbaesken 8227247: tools/sjavac/IdleShutdown.java fails with AssertionError: Error too big on windows
Wed, 17 Jul 2019 15:12:47 -0700 bpb 8073213: javadoc of PushbackInputStream methods should specify NullPointerExceptions
Wed, 17 Jul 2019 15:12:30 -0700 bpb 8228204: Fix for JDK-8067801 breaks java/io/NegativeInitSize.java
Wed, 17 Jul 2019 14:24:37 -0700 bpb 8067801: Enforce null check for underlying I/O streams
Wed, 17 Jul 2019 14:24:24 -0700 bpb 8131664: Javadoc for PrintStream is now incorrect
Wed, 17 Jul 2019 13:41:38 -0700 mikael Added tag jdk-14+6 for changeset 443f7359b34d
Wed, 17 Jul 2019 11:23:51 -0700 dtitov 8206179: com/sun/management/OperatingSystemMXBean/GetCommittedVirtualMemorySize.java fails with Committed virtual memory size illegal value
Wed, 17 Jul 2019 16:33:19 +0200 tschatzl 8227090: G1 does not account the OptMergeRS in cost per card calculation
Wed, 17 Jul 2019 16:33:19 +0200 tschatzl 8227089: Add timing information for merging humongous remembered sets
Wed, 17 Jul 2019 16:33:19 +0200 tschatzl 8227084: Add timing information for merge heap root preparation
Wed, 17 Jul 2019 16:33:19 +0200 tschatzl 8227671: G1: assert_used_and_recalculate_used_equal performs work in product builds
Wed, 17 Jul 2019 16:33:19 +0200 tschatzl 8226232: Move merge heap roots code out from G1RemSetScanState
Wed, 17 Jul 2019 23:22:48 +0900 ysuenaga 8227738: jvmti/DataDumpRequest/datadumpreq001 failed due to "exit code is 134"
Sat, 13 Jul 2019 12:14:24 -0400 zgu 8227635: Shenandoah: SHBSA::load_at() needs to deal IN_NATIVE load
Wed, 17 Jul 2019 04:33:37 -0700 mikael Merge
Wed, 17 Jul 2019 00:21:02 +0000 henryjen Merge
Thu, 02 May 2019 17:43:26 -0700 jnimeh 8222678: Improve TLS negotiation
Tue, 23 Apr 2019 08:34:51 +0800 weijun 8222751: closed/test/jdk/sun/security/util/DerIndefLenConverter/IndefBerPkcs12.java fail
Thu, 11 Apr 2019 17:58:18 -0700 xuelei 8218873: Improve JSSE endpoint checking
Wed, 10 Apr 2019 14:43:13 -0700 serb 8218876: Improve PNG support options
Wed, 10 Apr 2019 15:49:24 +0100 dfuchs 8221518: Normalize normalization
Wed, 03 Apr 2019 13:35:11 -0700 jnimeh 8221345: Better Poly1305 support
Thu, 28 Mar 2019 14:18:57 -0700 darcy 8212328: Exceptional throw cases
Wed, 27 Mar 2019 00:24:13 -0700 serb 8220517: Enhanced GIF support
Thu, 07 Mar 2019 22:19:12 -0800 jnimeh 8219775: Certificate validation improvements
Wed, 27 Feb 2019 13:58:04 -0800 xuelei 8218863: Better endpoint checks
Thu, 07 Feb 2019 08:47:10 -0500 mullan 8216381: More limited privilege usage
Wed, 30 Jan 2019 14:14:57 +0000 prappo 8213431: Improve file protocol handling
Wed, 30 Jan 2019 10:51:50 +0800 weijun 8217563: Improve realm maintenance
Wed, 23 Jan 2019 14:45:54 -0800 smarks 8213432: Better copies of CopiesList
Tue, 16 Jul 2019 15:15:45 +0100 alitvinov 8227392: Colors with alpha are painted incorrectly on Linux, after JDK-8214579
Tue, 16 Jul 2019 10:48:22 +0200 jlahoda 8227640: javac crashes on text blocks with invalid escapes.
Mon, 15 Jul 2019 16:25:23 -0700 serb 8226653: [accessibility] Can edit text cell correctly, but Accessibility Tool reads nothing about editor
Mon, 15 Jul 2019 09:53:23 -0700 ccheung 8227496: Update NUM_CDS_REGIONS and CURRENT_CDS_ARCHIVE_VERSION in cds.h
Sat, 13 Jul 2019 10:43:45 +0000 plevart 8227368: EnumSet.class serialization broken in JDK 9+
Fri, 12 Jul 2019 21:38:46 +0200 clanger 8227636: Fix output dir for jlink_jre target in Images.gmk
Thu, 04 Jul 2019 11:55:00 +0200 stuefe 8227252: [aix] Disable jdk/java/lang/reflect/exeCallerAccessTest
Fri, 12 Jul 2019 08:40:37 -0700 ccheung 8226406: JVM fails to detect mismatched or corrupt CDS archive
Wed, 17 Jul 2019 12:35:46 +0200 redestad 8227587: Add internal privileged System.loadLibrary
Wed, 17 Jul 2019 11:43:38 +0200 rkennke 8227677: Shenandoah: C2: Make in-native LRB special case of normal LRB
Tue, 16 Jul 2019 11:10:38 +0200 mbaesken 8227631: Adjust AIX version checkjdk-14+6
Wed, 17 Jul 2019 10:11:05 +0800 njian 8227615: [TESTBUG] JTReg "jdk/sun/security/util/FilePermCompat/CompatImpact.java" fails with graal
Tue, 16 Jul 2019 00:57:00 +0000 pli 8227512: [TESTBUG] Fix JTReg javac test failures with Graal
Tue, 16 Jul 2019 21:12:14 +0000 joehw 8176447: javax.xml.validation.Validator validates incorrectly on uniqueness constraint
Tue, 16 Jul 2019 17:50:54 +0200 redestad 8227720: Improve ExtendedSocketOptions initialization
Tue, 16 Jul 2019 18:05:42 +0300 bulasevich 8227632: Incorrect PrintCompilation message: made not compilable on levels 0 1 2 3 4
Tue, 16 Jul 2019 13:57:13 +0200 rschmelter 8227440: Implement fix to JDK-8224642 on all platforms
Mon, 15 Jul 2019 03:14:28 +0000 njian 8227574: [TESTBUG] JTReg tests fail with Graal due to access denied
Fri, 12 Jul 2019 12:19:58 +0200 mbaesken 8227630: adjust format specifiers in loadlib_aix.cpp
Tue, 16 Jul 2019 07:29:12 +0900 ysuenaga 8225690: Multiple AttachListener threads can be created
Mon, 15 Jul 2019 11:23:05 -0400 zgu 8225483: Shenandoah: Enhance native access barrier
Mon, 15 Jul 2019 10:21:33 +0800 yzhou 8227289: Enable assertions for some shell to java conversion tests after JDK-8218960
Mon, 15 Jul 2019 15:27:06 +0200 rkennke 8227676: Shenandoah: More consistent naming of LRB entry points
Mon, 15 Jul 2019 12:31:35 +0200 rkennke 8227637: Adjust Shenandoah C2 verifier to recognize IN_NATIVE barriers
Mon, 15 Jul 2019 17:53:36 +0800 fyuan 8227438: [TESTLIB] Determine if file exists by Files.exists in function FileUtils.deleteFileIfExistsWithRetry
Sat, 13 Jul 2019 20:55:25 +0900 ysuenaga 8227594: sadebugd/DebugdConnectTest.java fails due to "java.rmi.NotBoundException: SARemoteDebugger"
Fri, 12 Jul 2019 15:15:07 -0700 jjg 8227644: make more build-time variables available to Markdown files
Fri, 12 Jul 2019 11:51:07 -0700 jcm 8227068: [Graal] MappedByteBuffer bulk access memory failures are not handled gracefully
Fri, 12 Jul 2019 10:44:11 -0700 jjg 8227613: "draft" header should be in a <header> instead of <div>
Fri, 12 Jul 2019 10:39:19 -0700 jiangli 8227582: runtime/TLS/testtls.sh fails on x86_32
Fri, 12 Jul 2019 02:50:43 -0700 mikael Merge
Fri, 12 Jul 2019 10:57:27 +0200 clanger 8227578: Wrong JRE targets in Images.gmk after JDK-8219971
Fri, 12 Jul 2019 13:59:22 +0800 fyuan 8227422: sun/net/www/protocol/file/DirPermissionDenied.java failed on Windows 2016 because DirPermissionDenied directory has no read permission
Fri, 12 Jul 2019 09:27:00 +0530 psadhukhan 8225423: GTK L&F: JSplitPane: There is no divider shown
Thu, 11 Jul 2019 20:11:47 +0000 valeriep 8225745: NoSuchAlgorithmException exception for SHA256withECDSA with RSASSA-PSS support
Thu, 11 Jul 2019 12:13:52 -0700 jjg 8227602: Update nroff version of man pages
Thu, 11 Jul 2019 17:11:54 +0200 hannesw 8227391: Update double-conversion to version 3.1.5
Thu, 11 Jul 2019 11:36:56 +0100 aph Merge
Tue, 02 Jul 2019 16:54:52 +0100 aph 8226525: HotSpot compile-time error for x86-32
Wed, 10 Jul 2019 13:14:22 -0700 jjg 8227549: Fix style of links in specs for consistency
Wed, 10 Jul 2019 18:43:45 +0000 valeriep 8181386: CipherSpi ByteBuffer to byte array conversion fails for certain data overlap conditions
Wed, 10 Jul 2019 18:48:05 +0200 neliasso 8226536: Catch OOM from deopt that fails rematerializing objects
Wed, 10 Jul 2019 08:24:31 -0700 mikael Added tag jdk-13+29 for changeset 3081f39a3d30
Thu, 11 Jul 2019 15:58:54 +0000 joehw 8178843: A bug in an inner loop in MethodGenerator's getLocals method
Thu, 11 Jul 2019 16:43:15 +0200 hannesw 8223451: Make optimistic types disabled by default
Thu, 11 Jul 2019 15:38:09 +0200 redestad 8227527: LogDecorations should lazily resolve host name
Thu, 11 Jul 2019 09:26:04 -0400 hseigel 8226798: JVM crash in klassItable::initialize_itable_for_interface(int, InstanceKlass*, bool, Thread*)
Thu, 04 Jul 2019 17:31:03 +0200 rkennke 8226695: Shenandoah: Wire C1 and C2 IN_NATIVE barrier
Thu, 11 Jul 2019 06:56:51 +0200 stuefe 8227275: Within native OOM error handling, assertions may hang the process
Thu, 11 Jul 2019 06:49:49 +0200 stuefe 8227031: Print NMT statistics on fatal errors
Wed, 10 Jul 2019 16:23:59 -0700 jjg 8227416: Add a "Table Of Contents" to HTML version of man pages
Thu, 11 Jul 2019 08:19:56 +0900 ysuenaga 8209790: SA tools not providing option to connect to debug server
Wed, 10 Jul 2019 22:33:23 +0200 dfuchs 8227539: Replace wildcard address with loopback or local host in tests - part 20
Wed, 10 Jul 2019 16:45:28 +0000 joehw 7148925: StAXSource causes exceptions to be thrown with certain wellformed XML instances
Tue, 02 Jul 2019 08:43:44 -0700 fmatte 8225715: jhsdb jmap fails to write binary heap dump of a jshell process
Wed, 10 Jul 2019 08:20:41 -0700 mikael Added tag jdk-14+5 for changeset 0f1e29c77e50
Wed, 10 Jul 2019 16:09:20 +0100 aefimov 8226756: Replace wildcard address with loopback or local host in tests - part 18
Wed, 10 Jul 2019 07:27:58 -0700 mikael Merge
Wed, 10 Jul 2019 05:12:23 +0100 rpatil 8224560: (tz) Upgrade time-zone data to tzdata2019a
Wed, 10 Jul 2019 01:19:18 -0700 ljiang 8227009: JDK 13 L10n resource files update - msgdrop 10
Wed, 10 Jul 2019 09:04:42 +0200 jlahoda 8220041: NullPointerException at jdk.compiler/com.sun.tools.javac.jvm.Code.emitop0
Wed, 10 Jul 2019 09:43:35 +0800 weijun 8227059: sun/security/tools/keytool/DefaultSignatureAlgorithm.java timed outjdk-13+29
Wed, 10 Jul 2019 09:43:34 +0800 weijun 8227381: GSS login fails with PREAUTH_FAILED
Wed, 10 Jul 2019 09:43:34 +0800 weijun 8225687: Newly added sspi.cpp in JDK-6722928 still contains some small errors
Wed, 10 Jul 2019 10:18:06 -0400 dcubed 8227338: templateInterpreter.cpp: copy_table() needs to be safer
Wed, 10 Jul 2019 14:27:51 +0100 michaelm 8225479: com.sun.net.httpserver.HttpContext that does not end with '/' has surprising matches
Wed, 10 Jul 2019 07:58:24 -0400 coleenp 8222446: assert(C->env()->system_dictionary_modification_counter_changed()) failed: Must invalidate if TypeFuncs differ
Wed, 10 Jul 2019 05:12:23 +0100 rpatil 8224560: (tz) Upgrade time-zone data to tzdata2019ajdk-14+5
Tue, 09 Jul 2019 16:37:30 -0700 mikael Merge
Tue, 09 Jul 2019 15:42:44 -0700 jbhateja 8227222: vmTestbase/jit/FloatingPoint/gen_math/Loops04/Loops04.java failed XMM register should be 0-15
Tue, 09 Jul 2019 14:59:12 -0700 never 8227034: Graal crash with gcbasher
Tue, 09 Jul 2019 13:46:39 -0400 dlong 8227237: [Graal] org.graalvm.compiler.api.directives.test.ProbabilityDirectiveTest fails with -Xcomp
Tue, 09 Jul 2019 16:39:41 +0200 eosterlund 8224531: SEGV while collecting Klass statistics
Tue, 09 Jul 2019 16:39:37 +0200 eosterlund 8227277: HeapInspection::find_instances_at_safepoint walks dead objects
Tue, 09 Jul 2019 08:05:38 -0700 naoto 8227127: Era designator not displayed correctly using the COMPAT provider
Tue, 09 Jul 2019 15:02:28 -0700 jbhateja 8227222: vmTestbase/jit/FloatingPoint/gen_math/Loops04/Loops04.java failed XMM register should be 0-15
Tue, 09 Jul 2019 14:38:48 -0400 pchilanomate 8191890: Biased locking still uses the inferior stop the world safepoint for revocation
Tue, 09 Jul 2019 10:27:38 -0700 jiangli 8225035: Thread stack size issue caused by large TLS size
Mon, 08 Jul 2019 13:29:02 +0200 mbaesken 8227389: Remove unsupported xlc16 compile options on aix
Tue, 09 Jul 2019 09:20:04 +0200 jlahoda 8223443: Calling Trees.getScope early changes names of local/anonymous classes
Mon, 08 Jul 2019 16:20:40 -0700 mikael Merge
Mon, 08 Jul 2019 12:16:13 -0400 dcubed Merge
Mon, 08 Jul 2019 04:01:54 -0700 jcm 8221577: [Graal] Implement basic type consistency checks for Low level MH intrinsics
Mon, 08 Jul 2019 10:56:05 +0200 mdoerr 8226302: Test failures on IBM platforms (power and s/390) after JDK-8223837
Sun, 07 Jul 2019 18:27:38 -0700 never 8221514: [Graal] java/lang/String/CompactString/ tests fail with "GraalError: failed guarantee: no FrameState at DeoptimizingNode" in Graal -Xcomp mode
Sun, 07 Jul 2019 18:17:46 -0700 yzheng 8224254: compiler/graalunit/HotspotJdk9Test.java is timing out intermittently
Sun, 07 Jul 2019 18:10:18 -0700 kvn 8225064: [Graal] Application SEGV in G1ParScanThreadState::copy_to_survivor_space(G1HeapRegionAttr, oopDesc*, markOopDesc*)+0x48
Sun, 07 Jul 2019 10:52:30 -0700 avu 8226654: Some swing gtk regression tests fail with "java.lang.InternalError: Unable to load native GTK librarie
Sat, 06 Jul 2019 08:11:19 +0800 weijun 8227305: Krb5Util::getTicketFromSubjectAndTgs is useless
Mon, 08 Jul 2019 18:30:09 -0400 ecaspole Merge
Mon, 08 Jul 2019 17:57:33 -0400 ecaspole 8225626: JMH Test Support for JDK-8222074
Mon, 08 Jul 2019 17:24:21 -0400 kbarrett 8217170: gc/arguments/TestUseCompressedOopsErgo.java timed out
Mon, 08 Jul 2019 12:14:15 -0400 dcubed Merge
Mon, 08 Jul 2019 11:38:49 -0400 dcubed 8227117: normal interpreter table is not restored after single stepping with TLH
Mon, 08 Jul 2019 09:24:40 +0200 tschatzl 8224741: Optimize the scan area during the Scan Heap Roots phase
Fri, 05 Jul 2019 23:31:32 +0200 shade 8227327: Shenandoah: Faster and more parallel tests
Fri, 05 Jul 2019 11:01:31 -0700 mikael Merge
Fri, 05 Jul 2019 00:24:54 -0700 jcm 8226627: assert(t->singleton()) failed: must be a constant
Mon, 10 Jun 2019 13:04:12 +0200 stefank 8227175: ZGC: ZHeapIterator visits potentially dead objects
Tue, 02 Jul 2019 12:24:26 +0200 stefank 8227083: ZGC: C2: Generates on_weak barrier for WeakCompareAndSwap
Tue, 02 Jul 2019 12:10:18 +0200 stefank 8225770: ZGC: C2: Generates on_weak instead of on_strong barriers
Wed, 03 Jul 2019 23:34:20 +0000 dholmes 8227055: Minor edits to launcher help text
Thu, 04 Jul 2019 07:25:47 +0800 weijun 8226963: More clarification on possible sequencing error in GSSContext::unwrap
Thu, 04 Jul 2019 07:25:11 +0800 weijun 8227061: KDC.java test behaves incorrectly when AS-REQ contains a PAData not PA-ENC-TS-ENC
Fri, 05 Jul 2019 10:35:37 -0700 amenkov 8227124: "could not open pipe" error does not report error details
Fri, 05 Jul 2019 13:40:29 +0200 redestad 8225239: Refactor NetworkInterface lookups
Fri, 05 Jul 2019 12:55:54 +0300 vlivanov 8226409: Enable argument profiling for sun.misc.Unsafe.put*/get*
Fri, 05 Jul 2019 11:07:09 +0200 rkennke 8227039: Shenandoah: Aggressive heuristics for Traversal mode
Thu, 04 Jul 2019 20:29:56 +0200 rkennke 8222079: Don't use memset to initialize fields decode_env constructor in disassembler.cpp
Thu, 04 Jul 2019 13:26:41 -0400 kbarrett 8226793: Replace OopStorage dup_name with os::strdup
Thu, 04 Jul 2019 17:02:19 +0200 rkennke 8226823: Adjust BarrierSetC2 for C2 runtime calls
Thu, 04 Jul 2019 17:02:17 +0200 rkennke 8226822: GC interface for C1 runtime calls
Thu, 04 Jul 2019 16:51:24 +0200 jlahoda 8227010: Error recovery after local variable redeclaration can be improved
Thu, 04 Jul 2019 15:00:03 +0200 redestad 8224657: [TESTBUG] java/util/Locale/SoftKeys.java should be ignored but run
Thu, 04 Jul 2019 14:28:31 +0200 rkennke 8226757: Shenandoah: Make traversal and passive modes explicit
Mon, 01 Jul 2019 16:28:17 +0200 stuefe 8227032: MetaspaceUtils::print_report crashes when called before initialization
Thu, 04 Jul 2019 11:55:00 +0200 stuefe 8227252: [aix] Disable jdk/java/lang/reflect/exeCallerAccessTest
Wed, 03 Jul 2019 13:34:10 +0200 mbaesken 8227171: provide function names in native stack trace on aix with xlc16
Thu, 04 Jul 2019 09:12:21 +0200 thartmann 8227173: Minor cleanup of unused code in compile.hpp
Wed, 03 Jul 2019 16:29:20 -0700 darcy 8227202: clarify Class.isEnum() doc
Wed, 03 Jul 2019 15:47:39 -0700 mikael Merge
Wed, 03 Jul 2019 14:11:21 -0700 mikael Added tag jdk-13+28 for changeset 1e95931e7d8f
Wed, 03 Jul 2019 11:07:48 -0700 dnsimon 8226566: [JVMCI] java.* classes are no longer necessarily resolved by the boot class loader
Wed, 03 Jul 2019 14:37:19 -0700 bpb 8227080: (fs) Files.newInputStream(...).skip(n) is slow
Wed, 03 Jul 2019 14:18:15 -0700 mikael Added tag jdk-14+4 for changeset 19d0b382f086
Wed, 03 Jul 2019 15:46:48 -0400 tonyp 8223575: add subspace transitions to gc+metaspace=info log lines
Wed, 03 Jul 2019 16:30:19 +0000 joehw 8223291: Whitespace is added to CDATA tags when using OutputKeys.INDENT to format XML
Wed, 03 Jul 2019 17:52:56 +0200 rkennke 8227199: Shenandoah: Remove superfluous calls to can_do_traversal_gc()
Wed, 03 Jul 2019 07:56:41 -0700 mikael Merge
Thu, 13 Jun 2019 19:37:49 +0200 shade 8224881: Shenandoah: trashing "Collection Set, Pinned" region during Degenerated GC
Wed, 03 Jul 2019 11:34:46 +0200 mgronlun 8214542: JFR: Old Object Sample event slow on a deep heap in debug builds
Wed, 03 Jul 2019 11:43:01 +0800 weijun 8226719: Kerberos login to Windows 2000 failed with "Inappropriate type of checksum in message"jdk-13+28
Tue, 02 Jul 2019 18:24:47 -0400 kbarrett 8226366: Excessive ServiceThread wakeups for OopStorage cleanup
Tue, 02 Jul 2019 14:02:32 -0700 sspitsyn 8226596: Accessibility errors in jdwp-protocol.html
Tue, 02 Jul 2019 13:55:21 -0700 iignatyev 8227112: exclude compiler/intrinsics/sha/sanity tests from AOT runs
Tue, 02 Jul 2019 12:36:31 -0700 amenkov 8225679: reference to http://java.sun.com/products/JavaManagement/download.html
Tue, 02 Jul 2019 17:46:38 +0200 mgronlun 8227011: Starting a JFR recording in response to JVMTI VMInit and / or Java agent premain corrupts memory
Tue, 02 Jul 2019 14:31:43 +0200 mgronlun 8225706: JFR RootResolver resets CLD claims with no restore
Tue, 02 Jul 2019 11:33:05 +0200 eosterlund 8225642: ZGC: Crash due to bad oops being spilled to stack in load barriers
Tue, 02 Jul 2019 11:33:01 +0200 eosterlund 8219687: G1 asserts nmethod should not be unloaded during parallel code cache unloading
Tue, 02 Jul 2019 09:14:51 +0200 jlahoda 8226522: No compilation error reported when yield is used in incorrect context
Fri, 24 May 2019 04:18:18 -0700 rschmelter 8224673: Adjust permission for delayed starting of debugging
Tue, 25 Jun 2019 11:43:36 +0200 phedlin 8225475: Node budget asserts on x86_32/64
Fri, 28 Jun 2019 13:16:11 +0200 mbaesken 8226943: compile error in libfollowref003.cpp with XCode 10.2 on macosx
Wed, 03 Jul 2019 14:33:40 +0000 poonam 8227178: Backout of 8215523
Tue, 02 Jul 2019 13:45:08 +0200 mbaesken 8226238: Improve error output and fix elf issues in os::dll_loadjdk-14+4
Tue, 02 Jul 2019 12:24:28 +0200 stefank 8227085: ZGC: Add on_weak load barrier verification
Tue, 02 Jul 2019 12:24:26 +0200 stefank 8227083: ZGC: C2: Generates on_weak barrier for WeakCompareAndSwap
Tue, 02 Jul 2019 12:10:18 +0200 stefank 8225770: ZGC: C2: Generates on_weak instead of on_strong barriers
Tue, 02 Jul 2019 13:20:27 -0400 hseigel 8226956: Add invocation tests for Graal and C1
Tue, 02 Jul 2019 16:55:22 +0100 aph Merge
Tue, 02 Jul 2019 16:54:52 +0100 aph 8226525: HotSpot compile-time error for x86-32
Tue, 02 Jul 2019 11:07:40 +0530 jpai 8226976: SessionTimeOutTests uses == operator for String value check
Tue, 02 Jul 2019 08:32:33 -0700 bpb 8224480: (fc) java/nio/channels/FileChannel/MapTest.java fails intermittently
Tue, 02 Jul 2019 10:21:23 -0400 zgu 8227101: Shenandoah: Use ShenandoahSharedFlag for claimed flag in ShenandoahSerialRoot
Tue, 02 Jul 2019 13:25:51 +0100 prappo 8226602: Test convenience reactive primitives from java.net.http with RS TCK
Tue, 02 Jul 2019 10:28:20 +0200 stuefe 8227041: runtime/memory/RunUnitTestsConcurrently.java has a memory leak
Tue, 02 Jul 2019 10:25:00 +0200 stuefe 8227035: JVM::printFlags fails in native OOM situations
Mon, 01 Jul 2019 17:08:04 -0700 mikael Merge
Mon, 01 Jul 2019 11:40:34 -0700 sspitsyn 8226603: accessibility issues in specs/jvmti.html
Mon, 01 Jul 2019 10:49:58 +0200 neliasso 8226287: Make process_users_of_allocation handle gc barriers
Fri, 28 Jun 2019 21:41:04 -0700 iveresov 8226778: [JVMCI] Handle unpacking properly in Deoptimiziation::get_cached_box()
Mon, 01 Jul 2019 18:24:06 +0000 poonam 8215523: jstat reports incorrect values for OU for CMS GC
Mon, 01 Jul 2019 08:24:45 -0400 zgu 8226957: Shenandoah: Remove obsoleted ShenandoahStoreCheck option
Mon, 01 Jul 2019 12:16:58 +0200 redestad 8225344: Avoid VM_EnableBiasedLocking VM operation during bootstrap if BiasedLockingStartupDelay is 0
Mon, 01 Jul 2019 10:49:58 +0200 neliasso 8226287: Make process_users_of_allocation handle gc barriers
Mon, 01 Jul 2019 12:50:34 +0800 aoqi 8226967: Minimal VM: FALSE was not declared in this scope
Sat, 29 Jun 2019 05:26:55 +0200 jwilhelm Merge
Fri, 28 Jun 2019 16:06:44 -0700 sspitsyn 8226917: jvmti/scenarios/contention/TC04/tc04t001/TestDescription.java fails on jvmti->InterruptThread (JVMTI_ERROR_THREAD_NOT_ALIVE)
Fri, 28 Jun 2019 16:50:14 -0400 dlong 8226533: JVMCI: findUniqueConcreteMethod should handle statically bindable methods directly
Fri, 28 Jun 2019 20:46:25 +0100 clanger 8226869: Test java/util/Locale/LocaleProvidersRun.java should enable assertions
Fri, 28 Jun 2019 19:36:32 +0000 valeriep 8226651: Setting the mgfHash in CK_RSA_PKCS_PSS_PARAMS has no effect
Fri, 28 Jun 2019 08:48:17 -0700 naoto 8226876: Assertion in sun/util/locale/provider/CalendarDataUtility on Windows after JDK-8218960
Thu, 27 Jun 2019 10:39:27 +0200 jlahoda 8226510: No compilation error when switch expression has no result expressions
Fri, 28 Jun 2019 05:29:54 +0800 jjiang 8224650: Add tests to support X25519 and X448 in TLS
Fri, 28 Jun 2019 18:51:01 -0700 darcy 8226809: Circular reference in printed stack trace is not correctly indented & ambiguous
Fri, 28 Jun 2019 13:02:18 -0700 bpb 8226706: (se) Reduce the number of outer loop iterations on Windows in java/nio/channels/Selector/RacyDeregister.java
Fri, 28 Jun 2019 09:49:10 -0700 ccheung 8211723: AppCDS: referring to a jar file in any way other than exactly how it was done during dumping doesn't work
Fri, 28 Jun 2019 18:01:36 +0200 aoqi 8226878: zero crashes after JDK-8191278
Fri, 28 Jun 2019 15:58:10 +0100 dfuchs 8226514: Replace wildcard address with loopback or local host in tests - part 14
Fri, 28 Jun 2019 17:10:22 +0300 dpochepk 8223173: Implement fast class initialization checks on AARCH64
Fri, 28 Jun 2019 11:26:07 +0100 michaelm 8222968: ByteArrayPublisher is not thread-safe resulting in broken re-use of HttpRequests
Fri, 28 Jun 2019 09:12:49 +0200 thartmann 8226879: Memory leak in Type::hashcons
Thu, 27 Jun 2019 22:03:19 +0200 jwilhelm Merge
Thu, 27 Jun 2019 12:55:55 -0700 prr 8226783: GTK is not being returned as the System L&F on Gnome
Thu, 27 Jun 2019 00:51:04 -0700 rschmelter 8226608: Hide the onjcmd option from the help output
Thu, 27 Jun 2019 03:13:54 +0200 jwilhelm Added tag jdk-13+27 for changeset b7f68ddec66f
Wed, 26 Jun 2019 18:22:28 +0200 rehn 8225702: Safepoint counter can't be used for safepoint detection
Thu, 27 Jun 2019 11:40:18 -0400 coleenp 8225437: JvmtiExport::gc_epilogue is unnecessary
Thu, 27 Jun 2019 16:12:39 +0100 dfuchs 8226825: Replace wildcard address with loopback or local host in tests - part 19
Thu, 27 Jun 2019 18:00:54 +0800 aoqi 8226871: invalid use of incomplete type class MacroAssembler when building minimal after JDK-8191278
Thu, 27 Jun 2019 11:48:32 +0200 tschatzl 8213108: Improve work distribution during remembered set scan
Thu, 27 Jun 2019 03:33:44 +0200 jwilhelm 8225497: Update Graal
Thu, 27 Jun 2019 03:10:52 +0200 jwilhelm Added tag jdk-14+3 for changeset e64383344f14
Wed, 26 Jun 2019 17:06:43 -0700 igerasim 8224716: Javadoc of Int/Long/DoubleSummaryStatistics should mention possible overflow of count
Wed, 26 Jun 2019 22:16:00 +0200 jwilhelm Merge
Wed, 26 Jun 2019 11:25:51 -0400 bobv 8224764: Create jtreg test for JDK-8222252
Tue, 25 Jun 2019 10:50:59 +0100 smonteith 8226515: AArch64: float point register corruption in ZBarrierSetAssembler::load_atjdk-13+27
Wed, 26 Jun 2019 01:15:51 +0000 valeriep 8226607: Inconsistent info between pcsclite.md and MUSCLE headers
Tue, 25 Jun 2019 18:21:21 -0400 vromero 8226709: MethodTypeDesc::resolveConstantDesc needs access check per the specification
Tue, 25 Jun 2019 09:41:03 -0700 ccheung 8226462: [TESTBUG] runtime/appcds/sharedStrings/SysDictCrash.java failed with Cannot dump shared archive
Tue, 25 Jun 2019 16:34:08 +0100 aefimov 8226730: Missing `@` in code tags
Mon, 24 Jun 2019 22:38:17 -0400 dcubed 8226699: [BACKOUT] JDK-8221734 Deoptimize with handshakes
Wed, 26 Jun 2019 13:18:38 -0400 kbarrett 8225255: Make SATB qset lock-freejdk-14+3
Wed, 26 Jun 2019 09:06:32 -0400 hseigel 8224137: Analyze and port invocation tests to jtreg and co-locate to jdk repo
Wed, 26 Jun 2019 05:49:59 +0000 joehw 8224157: BCEL: update to version 6.3.1
Tue, 25 Jun 2019 18:46:51 -0700 darcy 8226785: MandatoryWarningHandler.java contains implementation of Objects.equals functionality
Tue, 25 Jun 2019 18:20:21 -0700 igerasim 8224849: Flag (?U:...) is allowed for non-capturing groups
Tue, 25 Jun 2019 17:27:31 -0700 igerasim 8226543: Reduce GC pressure during message digest calculations in password-based encryption
Tue, 25 Jun 2019 21:33:24 +0000 valeriep 8226607: Inconsistent info between pcsclite.md and MUSCLE headers
Tue, 25 Jun 2019 21:24:37 +0200 bsrbnd 8225644: C1 dumps incorrect class name in ClassCastException message
Mon, 24 Jun 2019 11:37:56 -0700 jcm 8191278: MappedByteBuffer bulk access memory failures are not handled gracefully
Thu, 20 Jun 2019 14:09:22 +0100 sgroeger 8226468: [aix] loadquery failed error message displayed
Tue, 25 Jun 2019 14:36:31 +0200 jwilhelm Merge
Mon, 24 Jun 2019 18:51:54 -0400 dlong 8225369: [AOT] vm/classfmt/cpl/cplres001/cplres00101m004/cplres00101m004.html fails
Mon, 24 Jun 2019 13:40:23 -0700 jjg 8226628: The copyright footer should be enclosed in <footer>
Mon, 24 Jun 2019 11:52:01 -0400 bobv 8224506: [TESTBUG] TestDockerMemoryMetrics.java fails with exitValue = 137
Mon, 24 Jun 2019 11:49:59 -0400 bobv 8224502: [TESTBUG] JDK docker test TestSystemMetrics.java fails with access issues and OOM
Mon, 24 Jun 2019 10:11:17 -0400 mullan 8180005: Provide specific links in KeyManagerFactory and TrustManagerFactory to the Standard Algorithm Names Specification
Sat, 22 Jun 2019 14:35:57 -0700 sspitsyn 8226595: jvmti/scenarios/contention/TC04/tc04t001/TestDescription.java still fails due to wrong number of MonitorContendedEntered events
Fri, 21 Jun 2019 18:20:49 -0700 sspitsyn 8224555: vmTestbase/nsk/jvmti/scenarios/contention/TC02/tc02t001/TestDescription.java failed
Fri, 21 Jun 2019 16:20:01 -0700 serb 8225146: Accessibility issues in javax/swing/plaf/nimbus/doc-files/properties.html
Mon, 24 Jun 2019 22:38:17 -0400 dcubed 8226699: [BACKOUT] JDK-8221734 Deoptimize with handshakes
Mon, 24 Jun 2019 16:51:23 -0400 coleenp 8214822: Move ConcurrentHashTable VALUE parameter to CONFIG
Mon, 24 Jun 2019 14:13:49 -0400 zgu 8226310: Shenandoah: Concurrent evacuation of CLDG
Mon, 24 Jun 2019 11:46:46 -0400 zgu 8226311: Shenandoah: Concurrent evacuation of OopStorage backed weak roots
Mon, 24 Jun 2019 15:19:11 +0100 michaelm 8226683: Remove review suggestion from fix to 8219804
Mon, 24 Jun 2019 15:10:44 +0100 michaelm 8219804: java/net/MulticastSocket/Promiscuous.java fails intermittently due to NumberFormatException
Mon, 24 Jun 2019 09:51:45 -0400 zgu 8226586: Shenandoah: No need to pre-evacuate roots for degenerated GC
Sat, 22 Jun 2019 02:03:41 +0200 jwilhelm Merge
Fri, 21 Jun 2019 12:09:07 -0700 jjg 8226593: Fix HTML in com/sun/jdi/doc-files/signature.html
Fri, 21 Jun 2019 11:41:29 -0700 jjg 8226592: Fix HTML in table for jdk.zipfs module-info
Fri, 21 Jun 2019 10:38:53 -0700 erikj 8226269: Race in SetupProcessMarkdown
Fri, 21 Jun 2019 23:44:58 +0800 weijun 8225257: sun/security/tools/keytool/PSS.java timed out
Fri, 21 Jun 2019 09:53:12 -0400 coleenp 8226394: [TESTBUG] vmTestbase/metaspace/flags/maxMetaspaceSize/TestDescription.java fails with java.lang.NoClassDefFoundError
Fri, 21 Jun 2019 15:16:03 +0100 adinn 8226203: MappedByteBuffer.force method may have no effect on implementation specific map modes
Fri, 21 Jun 2019 06:33:55 -0700 erikj 8226538: find-files.gmk gets corrupted if tab completion is used before running make first
Thu, 20 Jun 2019 23:12:12 -0700 sspitsyn 8223736: jvmti/scenarios/contention/TC04/tc04t001/TestDescription.java fails due to wrong number of MonitorContendedEntered events
Fri, 21 Jun 2019 16:21:13 -0700 kvn 8225810: Update JVMCI
Fri, 21 Jun 2019 13:04:14 -0700 kvn 8185139: [Graal] Tests which set too restrictive security manager fail with Graal
Fri, 21 Jun 2019 08:38:26 -0400 mullan 8226307: Curve names should be case-insensitive
Fri, 21 Jun 2019 12:23:46 +0200 hannesw 8225802: Remove unused CSS classes from HTML doclet
Fri, 21 Jun 2019 08:07:18 +0000 coffeys 8133489: Better messaging for PKIX path validation matching
Fri, 21 Jun 2019 04:16:18 +0200 jwilhelm Merge
Thu, 20 Jun 2019 18:47:44 -0700 dtitov 8220175: serviceability/dcmd/framework/VMVersionTest.java fails with a timeout
Thu, 20 Jun 2019 14:24:13 -0700 jjg 8226412: Fix command-line help text for javac -target
Thu, 20 Jun 2019 11:42:33 -0700 epavlova 8225684: [AOT] vmTestbase/vm/oom/production/AlwaysOOMProduction tests fail with AOTed java.base
Thu, 20 Jun 2019 10:32:25 -0700 kvn 8223794: applications/kitchensink/Kitchensink.java crash bad oop with Graal
Thu, 20 Jun 2019 07:56:28 -0700 erikj 8226404: bootcycle build uses wrong CDS archive
Wed, 19 Jun 2019 21:49:33 -0700 xuelei 8225766: Curve in certificate should not affect signature scheme when using TLSv1.3
Thu, 20 Jun 2019 04:08:29 +0200 jwilhelm Added tag jdk-13+26 for changeset 0692b67f5462
Thu, 20 Jun 2019 18:29:34 -0400 zgu 8225590: Shenandoah: Refactor ShenandoahClassLoaderDataRoots API
Thu, 20 Jun 2019 20:20:01 +0000 robm 8223727: com/sun/jndi/ldap/privconn/RunTest.java failed due to hang in LdapRequest.getReplyBer
Thu, 20 Jun 2019 16:15:10 -0400 lancea 8226518: Typo in the ConnectionBuilder javadoc examples
Thu, 20 Jun 2019 14:03:10 -0600 dlsmith 8226325: Support building of filtered spec bundles
Thu, 05 Sep 2019 18:47:59 +0000 mcimadamore Automatic merge with records-and-sealedpatterns-deconstruction
Thu, 05 Sep 2019 18:47:28 +0000 mcimadamore Automatic merge with records-and-sealedamber-demo-II
Thu, 05 Sep 2019 14:09:33 -0400 vromero more consolidation of sealed types testsrecords-and-sealed
Thu, 05 Sep 2019 17:35:41 +0200 jlahoda Partial updates for patterns using PatternHandle.patterns-deconstruction
Thu, 05 Sep 2019 15:58:50 +0200 jlahoda Merging patterns-deconstruction branch with the records-and-sealed branch.patterns-deconstruction
Wed, 04 Sep 2019 23:20:48 +0000 mcimadamore Automatic merge with records-and-sealedamber-demo-II
Wed, 04 Sep 2019 19:13:09 -0400 vromero consolidating sealed types testsrecords-and-sealed
Wed, 04 Sep 2019 22:40:38 +0000 mcimadamore Automatic merge with records-and-sealedamber-demo-II
Wed, 04 Sep 2019 18:34:55 -0400 briangoetz More records testsrecords-and-sealed
Wed, 04 Sep 2019 16:40:52 +0000 mcimadamore Automatic merge with records-and-sealedamber-demo-II
Wed, 04 Sep 2019 12:35:25 -0400 hseigel runtime: remove the final flag from sealed typesrecords-and-sealed
Thu, 29 Aug 2019 15:25:44 +0000 mcimadamore Automatic merge with records-and-sealedamber-demo-II
Thu, 29 Aug 2019 11:22:10 -0400 vromero adding a preview check for records and sealed typesrecords-and-sealed
Wed, 28 Aug 2019 01:36:58 +0000 mcimadamore Automatic merge with records-and-sealedamber-demo-II
Tue, 27 Aug 2019 21:09:18 -0400 vromero allow explicitly static classes inside inner classesrecords-and-sealed
Tue, 27 Aug 2019 22:15:45 +0000 mcimadamore Automatic merge with records-and-sealedamber-demo-II
Tue, 27 Aug 2019 18:10:25 -0400 vromero testing records in inner classesrecords-and-sealed
Tue, 27 Aug 2019 21:25:46 +0000 mcimadamore Automatic merge with records-and-sealedamber-demo-II
Tue, 27 Aug 2019 17:18:26 -0400 vromero allow static members in inner classesrecords-and-sealed
Tue, 27 Aug 2019 20:30:53 +0000 mcimadamore Automatic merge with records-and-sealedamber-demo-II
Tue, 27 Aug 2019 20:25:43 +0000 mcimadamore Automatic merge with records-and-sealedamber-demo-II
Tue, 27 Aug 2019 16:24:29 -0400 briangoetz More record test consolidationrecords-and-sealed
Tue, 27 Aug 2019 16:20:06 -0400 vromero relaxing an assertion on record components length at jvm::JVM_GetRecordComponentNamesrecords-and-sealed
Mon, 26 Aug 2019 20:40:45 +0000 mcimadamore Automatic merge with records-and-sealedamber-demo-II
Mon, 26 Aug 2019 16:38:09 -0400 vromero additional var args testsrecords-and-sealed
Mon, 26 Aug 2019 19:55:44 +0000 mcimadamore Automatic merge with records-and-sealedamber-demo-II
Mon, 26 Aug 2019 15:52:05 -0400 vromero activating ReflectionTest againrecords-and-sealed
Mon, 26 Aug 2019 15:51:18 -0400 hseigel new implementation of the record attribute in the runtime, first iterationrecords-and-sealed
Mon, 26 Aug 2019 13:11:35 -0400 vromero updating list of forbidden record component namesrecords-and-sealed
Sun, 25 Aug 2019 21:55:45 +0000 mcimadamore Automatic merge with records-and-sealedamber-demo-II
Sun, 25 Aug 2019 17:50:55 -0400 briangoetz Consolidate several tests into RecordMemberTestsrecords-and-sealed
Fri, 23 Aug 2019 18:20:42 +0000 mcimadamore Automatic merge with records-and-sealedamber-demo-II
Fri, 23 Aug 2019 14:11:14 -0400 vromero allow varargs in recordsrecords-and-sealed
Fri, 23 Aug 2019 18:05:39 +0000 mcimadamore Automatic merge with records-and-sealedamber-demo-II
Fri, 23 Aug 2019 14:02:23 -0400 briangoetz More test consolidationrecords-and-sealed
Thu, 22 Aug 2019 21:25:40 +0000 mcimadamore Automatic merge with records-and-sealedamber-demo-II
Thu, 22 Aug 2019 17:16:28 -0400 vromero bug fix: private records are not allowedrecords-and-sealed
Thu, 22 Aug 2019 16:41:11 -0400 vromero minor code simplificationrecords-and-sealed
Thu, 22 Aug 2019 19:10:41 +0000 mcimadamore Automatic merge with records-and-sealedamber-demo-II
Thu, 22 Aug 2019 14:42:54 -0400 vromero definition of the new annotation target RECORD_COMPONENT, new implementation of the record attributerecords-and-sealed
Thu, 22 Aug 2019 15:05:45 +0000 mcimadamore Automatic merge with records-and-sealedamber-demo-II
Thu, 22 Aug 2019 10:59:08 -0400 vromero delta applying: allow records to implement serialization methods, stop generating the readResolve method, until all the support for record serialization has been pushedrecords-and-sealed
Thu, 22 Aug 2019 14:21:50 +0000 mcimadamore Automatic merge with records-and-sealedamber-demo-II
Thu, 22 Aug 2019 09:41:03 -0400 vromero allow records to implement serialization methods, stop generating the readResolve methodrecords-and-sealed
Wed, 21 Aug 2019 11:35:54 +0000 mcimadamore Automatic merge with patternspatterns-deconstruction
Wed, 21 Aug 2019 13:28:16 +0200 jlahoda Improving fallthrough handling in switches with patterns.patterns
Tue, 20 Aug 2019 21:50:43 +0000 mcimadamore Automatic merge with records-and-sealedamber-demo-II
Tue, 20 Aug 2019 17:42:58 -0400 vromero dont allow type annotations with TYPE_PARAMETER target on record componentsrecords-and-sealed
Tue, 20 Aug 2019 21:25:43 +0000 mcimadamore Automatic merge with records-and-sealedamber-demo-II
Tue, 20 Aug 2019 17:20:53 -0400 vromero dont allow accessors or canonical constructor to declare checked exceptionsrecords-and-sealed
Tue, 20 Aug 2019 20:00:44 +0000 mcimadamore Automatic merge with records-and-sealedamber-demo-II
Tue, 20 Aug 2019 15:54:25 -0400 vromero ignore CheckReadResolveMethodTest for nowrecords-and-sealed
Tue, 20 Aug 2019 19:35:41 +0000 mcimadamore Automatic merge with records-and-sealedamber-demo-II
Tue, 20 Aug 2019 15:31:12 -0400 vromero assign unassigned components only for the compact record constructorrecords-and-sealed
Tue, 20 Aug 2019 18:40:40 +0000 mcimadamore Automatic merge with records-and-sealedamber-demo-II
Tue, 20 Aug 2019 14:33:57 -0400 vromero removing duplicated testsrecords-and-sealed
Tue, 20 Aug 2019 17:45:40 +0000 mcimadamore Automatic merge with records-and-sealedamber-demo-II
Tue, 20 Aug 2019 13:43:41 -0400 briangoetz Test cleanupsrecords-and-sealed
Tue, 20 Aug 2019 17:35:45 +0000 mcimadamore Automatic merge with records-and-sealedamber-demo-II
Tue, 20 Aug 2019 13:31:16 -0400 vromero reject serialization members if declared in a recordrecords-and-sealed
Tue, 20 Aug 2019 14:10:47 +0000 mcimadamore Automatic merge with patternspatterns-deconstruction
Tue, 20 Aug 2019 15:59:21 +0200 jlahoda Fixing a few tests.patterns
Tue, 20 Aug 2019 09:06:10 +0000 mcimadamore Automatic merge with patternspatterns-deconstruction
Tue, 20 Aug 2019 09:05:40 +0000 mcimadamore Automatic merge with patterns-stage-1amber-demo-II
Tue, 20 Aug 2019 10:59:45 +0200 jlahoda Merging recent changes to patterns-stage-1 into the patterns branch; reapplying the ability to merge pattern variables.patterns
Mon, 19 Aug 2019 16:49:28 +0200 jlahoda Disabling merging of pattern variables.patterns-stage-1
Mon, 19 Aug 2019 20:05:41 +0000 mcimadamore Automatic merge with records-and-sealedamber-demo-II
Mon, 19 Aug 2019 16:00:24 -0400 briangoetz More record compilation tests; add RECORD_COMPONENT ElementType enum.records-and-sealed
Fri, 16 Aug 2019 21:15:43 +0000 mcimadamore Automatic merge with records-and-sealedamber-demo-II
Fri, 16 Aug 2019 17:11:04 -0400 vromero fixing more bugs on records, more changes to RecordCompilationTestsrecords-and-sealed
Fri, 16 Aug 2019 18:35:43 +0000 mcimadamore Automatic merge with records-and-sealedamber-demo-II
Fri, 16 Aug 2019 14:31:37 -0400 vromero fixing test CheckingAttributeAtRuntimeTestrecords-and-sealed
Fri, 16 Aug 2019 16:05:45 +0000 mcimadamore Automatic merge with records-and-sealedamber-demo-II
Fri, 16 Aug 2019 11:57:15 -0400 hseigel additional permitted subtypes checksrecords-and-sealed
Fri, 16 Aug 2019 15:05:55 +0000 mcimadamore Automatic merge with records-and-sealedamber-demo-II
Fri, 16 Aug 2019 11:00:47 -0400 vromero moving previous negative tests to RecordCompilationTest, fixing reported bugsrecords-and-sealed
Thu, 15 Aug 2019 23:05:47 +0000 mcimadamore Automatic merge with records-and-sealedamber-demo-II
Thu, 15 Aug 2019 19:02:11 -0400 vromero adding test RecordCompilationTestsrecords-and-sealed
Thu, 15 Aug 2019 21:50:45 +0000 mcimadamore Automatic merge with records-and-sealedamber-demo-II
Thu, 15 Aug 2019 17:45:52 -0400 vromero make records inherit from j.l.Record and check that no class can inherit from j.l.Recordrecords-and-sealed
Thu, 15 Aug 2019 18:05:41 +0000 mcimadamore Automatic merge with records-and-sealedamber-demo-II
Thu, 15 Aug 2019 14:01:09 -0400 vromero rewording java.lang.Record specrecords-and-sealed
Thu, 15 Aug 2019 17:55:56 +0000 mcimadamore Automatic merge with records-and-sealedamber-demo-II
Thu, 15 Aug 2019 13:48:44 -0400 briangoetz adding class java.lang.Recordrecords-and-sealed
Wed, 14 Aug 2019 22:25:42 +0000 mcimadamore Automatic merge with records-and-sealedamber-demo-II
Wed, 14 Aug 2019 18:14:28 -0400 vromero dont accept record component names like: toString, etcrecords-and-sealed
Sat, 10 Aug 2019 00:49:40 +0000 mcimadamore Automatic merge with records-and-sealedamber-demo-II
Fri, 09 Aug 2019 17:13:59 -0700 jjg update javadoc behavior for undocumented permitted subtypesrecords-and-sealed
Fri, 09 Aug 2019 23:35:44 +0000 mcimadamore Automatic merge with records-and-sealedamber-demo-II
Fri, 09 Aug 2019 16:26:46 -0700 jjg add javadoc test for empty recordsrecords-and-sealed
Thu, 08 Aug 2019 23:40:43 +0000 mcimadamore Automatic merge with records-and-sealedamber-demo-II
Thu, 08 Aug 2019 16:32:18 -0700 jjg more javadoc testsrecords-and-sealed
Thu, 08 Aug 2019 22:40:45 +0000 mcimadamore Automatic merge with records-and-sealedamber-demo-II
Thu, 08 Aug 2019 15:29:26 -0700 jjg fix legal headers on testsrecords-and-sealed
Thu, 08 Aug 2019 22:30:44 +0000 mcimadamore Automatic merge with records-and-sealedamber-demo-II
Thu, 08 Aug 2019 15:22:34 -0700 jjg Remove assumption that all RECORD items are MANDATEDrecords-and-sealed
Thu, 08 Aug 2019 04:52:29 +0000 mcimadamore Automatic merge with records-and-sealedamber-demo-II
Wed, 07 Aug 2019 17:30:40 -0700 jjg initial support for generated doc comments for recordsrecords-and-sealed
Wed, 07 Aug 2019 23:45:45 +0000 mcimadamore Automatic merge with records-and-sealedamber-demo-II
Wed, 07 Aug 2019 16:34:00 -0700 jjg reverse 'definition of the new annotation target RECORD_COMPONENT, new implementation of the record attribute'records-and-sealed
Mon, 05 Aug 2019 16:00:38 +0000 mcimadamore Automatic merge with records-and-sealedamber-demo-II
Mon, 05 Aug 2019 12:56:08 -0400 vromero definition of the new annotation target RECORD_COMPONENT, new implementation of the record attributerecords-and-sealed
Mon, 05 Aug 2019 12:15:25 +0200 jlahoda Merging branch patterns into branch patterns-deconstruction.patterns-deconstruction
Mon, 05 Aug 2019 11:53:33 +0200 jlahoda Merging branch patterns-stage-1 into branch patterns.patterns
Sat, 03 Aug 2019 00:49:50 +0000 mcimadamore Automatic merge with records-and-sealedamber-demo-II
Fri, 02 Aug 2019 16:57:06 -0700 jjg basic javadoc support for record pseudo-keywordrecords-and-sealed
Fri, 02 Aug 2019 18:30:37 +0000 mcimadamore Automatic merge with records-and-sealedamber-demo-II
Fri, 02 Aug 2019 11:21:38 -0700 jjg initial (basic) support for permitted subtypesrecords-and-sealed
Fri, 02 Aug 2019 08:55:42 +0000 mcimadamore Automatic merge with patterns-stage-1amber-demo-II
Fri, 02 Aug 2019 10:50:17 +0200 jlahoda Removing unnecessary code.patterns-stage-1
Fri, 02 Aug 2019 10:47:02 +0200 jlahoda Handling of type annotation in type test patterns.patterns-stage-1
Wed, 31 Jul 2019 21:05:39 +0000 mcimadamore Automatic merge with records-and-sealedamber-demo-II
Wed, 31 Jul 2019 13:54:15 -0700 jjg javadoc support for selaed/non-sealed modifiersrecords-and-sealed
Wed, 31 Jul 2019 20:50:40 +0000 mcimadamore Automatic merge with records-and-sealedamber-demo-II
Wed, 31 Jul 2019 13:43:11 -0700 jjg remove unused propertiesrecords-and-sealed
Wed, 31 Jul 2019 13:41:41 -0700 jjg implement ClassTree.getPermitsClause and scannersrecords-and-sealed
Wed, 31 Jul 2019 20:45:40 +0000 mcimadamore Automatic merge with records-and-sealedamber-demo-II
Wed, 31 Jul 2019 13:39:22 -0700 jjg improve failure diagnosisrecords-and-sealed
Wed, 31 Jul 2019 13:35:42 -0700 jjg implement JavacElements.isSealedrecords-and-sealed
Mon, 29 Jul 2019 22:10:49 +0000 mcimadamore Automatic merge with records-and-sealedamber-demo-II
Mon, 29 Jul 2019 18:02:50 -0400 vromero make JVM_GetPermittedSubtypes return an array of Stringsrecords-and-sealed
Tue, 23 Jul 2019 22:45:54 +0000 mcimadamore Automatic merge with records-and-sealedamber-demo-II
Tue, 23 Jul 2019 18:36:43 -0400 hseigel module checking for sealed types, disallow changing PermittedSubtypes attr, adding testsrecords-and-sealed
Thu, 18 Jul 2019 21:05:42 +0000 mcimadamore Automatic merge with records-and-sealedamber-demo-II
Thu, 18 Jul 2019 16:57:15 -0400 vromero additional type annotation testrecords-and-sealed
Wed, 17 Jul 2019 18:50:40 +0000 mcimadamore Automatic merge with records-and-sealedamber-demo-II
Wed, 17 Jul 2019 13:21:19 -0400 vromero adding support for type annotations on recordsrecords-and-sealed
Wed, 17 Jul 2019 14:30:41 +0000 mcimadamore Automatic merge with records-and-sealedamber-demo-II
Wed, 17 Jul 2019 10:27:54 -0400 vromero fixing regression test ListModuleDepsrecords-and-sealed
Tue, 16 Jul 2019 18:05:41 +0000 mcimadamore Automatic merge with records-and-sealedamber-demo-II
Tue, 16 Jul 2019 14:01:12 -0400 vromero do enter additional mandated membersrecords-and-sealed
Mon, 15 Jul 2019 19:40:40 +0000 mcimadamore Automatic merge with records-and-sealedamber-demo-II
Mon, 15 Jul 2019 15:21:19 -0400 vromero fixing failing regression testsrecords-and-sealed
Mon, 15 Jul 2019 13:34:21 -0400 vromero manual merge with patterns-stage-1amber-demo-II
Mon, 15 Jul 2019 16:02:04 +0200 jlahoda Merging patterns-stage-1 into patterns.patterns-deconstruction
Mon, 15 Jul 2019 15:53:06 +0200 jlahoda Post-merge fixes.patterns
Mon, 15 Jul 2019 12:50:29 +0000 mcimadamore Automatic merge with patterns-stage-1patterns