log

age author description
Thu, 19 Dec 2013 10:31:59 +0000 dl 8026155: Enhance ForkJoin pool
Wed, 18 Dec 2013 16:46:15 -0800 xuelei 7093640: Enable client-side TLS 1.2 by default
Tue, 17 Dec 2013 23:33:51 -0800 mfang 8026741: jdk8 l10n resource file translation update 5
Tue, 17 Dec 2013 23:03:54 +0000 vinnie 8029788: Certificate validation - java.lang.ClassCastException
Tue, 17 Dec 2013 14:13:26 -0800 mfang 7090826: Newly added codes need to be localized into pt_BR in LocaleNames
Tue, 17 Dec 2013 09:36:59 -0800 mduigou 8029795: LinkedHashMap.getOrDefault() doesn't update access order.
Fri, 13 Dec 2013 18:08:20 -0800 smarks 8027536: rmic: add deprecation warning message when generating JRMP static stubs/skeletons
Fri, 13 Dec 2013 13:35:35 -0800 mduigou 8030016: HashMap.computeIfAbsent generates spurious access event
Fri, 13 Dec 2013 13:34:55 -0800 mduigou 8029055: Map.merge implementations should refuse null value param
Thu, 12 Dec 2013 19:17:34 -0800 lana Merge
Wed, 11 Dec 2013 21:22:49 -0800 mfang 8026115: [zh_CN] inproper translation in output of jarsigner command
Wed, 11 Dec 2013 15:27:06 -0800 michaelm 8029696: Broken doc links to package-summary.html#NonInterference in java.util.stream
Wed, 11 Dec 2013 15:26:47 -0800 michaelm 8029944: Primitive Stream reduce method documentation pseudo code misidentifies apply method
Wed, 11 Dec 2013 16:52:41 -0500 rriggs 8029551: Add value-type notice to java.time classes
Mon, 09 Dec 2013 15:01:24 -0800 mfang 8025974: l10n for policytool
Mon, 09 Dec 2013 13:05:09 +0000 michaelm 8029354: URLPermission.<init> throws llegalArgumentException: Invalid characters in hostname
Fri, 06 Dec 2013 11:36:04 -0800 juh 8007967: Infinite loop can happen in sun.security.provider.certpath.SunCertPathBuilder.depthFirstSearchForward()
Fri, 06 Dec 2013 11:28:24 -0800 darcy 8023471: Add compatibility note to AnnotatedElement
Thu, 19 Dec 2013 10:24:41 -0800 lana Merge
Wed, 18 Dec 2013 11:09:31 +0000 azvegint 8029263: user's default browser can not launch after we click the button, and there is an IOException shown in the log text (java.io.IOException)
Fri, 13 Dec 2013 14:29:17 +0400 azvegint 8029923: Many Swing tests and SwingSet2 are failing under Solaris using GTK LaF - "Unable to load native GTK libraries"
Thu, 12 Dec 2013 20:04:31 -0800 lana Merge
Thu, 12 Dec 2013 16:30:22 +0400 serb 8001472: api/java_awt/Window/indexTGF_* tests fail because expected colors aren't equal
Wed, 11 Dec 2013 22:17:19 +0400 serb 8029045: Regression - Unsatisfied Link Error when the Java Access Bridge is started
Fri, 06 Dec 2013 17:47:16 +0400 pchelko 8029565: java.awt.dnd.InvalidDnDOperationException: data translation failed on file drop
Thu, 19 Dec 2013 10:23:14 -0800 lana Merge
Fri, 13 Dec 2013 11:49:26 +0400 vadim 8029628: Many graphic artifacts
Thu, 19 Dec 2013 17:24:04 -0800 katleman Added tag jdk8-b121 for changeset ce05e132b137
Tue, 17 Dec 2013 12:02:13 -0800 katleman Mergejdk8-b121
Fri, 13 Dec 2013 14:21:33 -0800 rgallard 8027709: JDK8 docs on -XX:CompileOnly option are incorrect
Thu, 12 Dec 2013 22:26:08 -0800 rgallard 8027844: Remove the JDK 1.1 compatibility part in jarsigner doc
Thu, 12 Dec 2013 05:21:24 -0800 katleman Added tag jdk8-b120 for changeset d31cd980e1da
Tue, 10 Dec 2013 15:20:46 -0800 rgallard 8029616: Update jdeps man page to include a new -jdkinternals optionjdk8-b120
Thu, 05 Dec 2013 10:33:57 -0800 lana Merge
Thu, 05 Dec 2013 16:19:06 +0000 robm 8029525: java/lang/ProcessBuilder/Basic.java fails intermittently
Thu, 05 Dec 2013 07:45:27 -0800 bpb 8029501: BigInteger division algorithm selection heuristic is incorrect
Thu, 05 Dec 2013 07:44:59 -0800 bpb 8029514: java/math/BigInteger/BigIntegerTest.java failing since thresholds adjusted in 8022181
Thu, 05 Dec 2013 18:04:12 +0400 yan 8029264: [doclint] more doclint and tidy cleanup
Thu, 05 Dec 2013 09:44:53 +0100 psandoz 8028564: Concurrent calls to CHM.put can fail to add the key/value to the map
Thu, 05 Dec 2013 09:25:31 +0100 erikj 8027963: Create unlimited policy jars.
Wed, 04 Dec 2013 17:37:25 -0800 ascarpino 8029550: javadoc since tag for recent Hashtable updates
Wed, 04 Dec 2013 13:35:58 -0800 mchung 8029552: Remove java/lang/management/MemoryMXBean/CollectionUsageThreshold.java from ProblemList.txt
Wed, 04 Dec 2013 10:59:17 -0800 ascarpino 8027218: TEST_BUG: sun/security/pkcs11/ec tests fail because of ever-changing key size restrictions
Wed, 04 Dec 2013 18:02:33 +0000 smarks 8029141: Add @FunctionalInterface annotation to Callable interface
Wed, 04 Dec 2013 09:32:26 -0800 mfang Merge
Wed, 04 Dec 2013 09:29:29 -0800 mfang 8027244: Need to translate new error message and usage information for jar tool
Wed, 04 Dec 2013 09:26:47 -0800 mchung 7067973: test/java/lang/management/MemoryMXBean/CollectionUsageThreshold.java hanging intermittently
Wed, 04 Dec 2013 17:03:13 +0000 coffeys 8029347: sun/rmi/runtime/Log/checkLogging/CheckLogging.java fails in nightly intermittently
Wed, 04 Dec 2013 08:12:11 -0800 henryjen 8029434: Spliterator of Stream returned by BufferedReader.lines() should have NONNULL characteristic
Wed, 04 Dec 2013 11:04:05 +0100 jfranck 8029117: (reflect) clarify javadoc for getMethod(...) and getMethods()
Wed, 04 Dec 2013 10:27:50 +0100 psandoz 8029164: Race condition in CompletableFuture.thenCompose with asynchronous task
Tue, 03 Dec 2013 17:06:23 +0100 sla 6461635: [TESTBUG] BasicTests.sh test fails intermittently
Tue, 03 Dec 2013 23:09:17 -0800 lana Merge
Tue, 03 Dec 2013 21:22:14 -0800 briangoetz 8028816: Add value-type notice to Optional* classes
Tue, 03 Dec 2013 18:19:52 -0800 smarks 8029489: StringJoiner spec for setEmptyValue() and length() is malformatted
Tue, 03 Dec 2013 17:44:31 -0800 sherman 8028397: Undo the lenient MIME BASE64 decoder support change (JDK-8025003) and remove methods de/encode(buf, buf)
Tue, 03 Dec 2013 17:25:28 -0800 valeriep Merge
Tue, 03 Dec 2013 17:23:58 -0800 valeriep 8029158: sun/security/pkcs11/Signature/TestDSAKeyLength.java does not compile (or run)
Wed, 04 Dec 2013 09:14:42 +0800 weijun 8028351: JWS doesn't get authenticated when using kerberos auth proxy
Wed, 04 Dec 2013 01:58:37 +0100 dfuchs 8029281: Synchronization issues in Logger and LogManager
Tue, 03 Dec 2013 15:52:16 -0800 smarks 8028757: CharSequence.subSequence improperly requires a "new" CharSequence be returned
Tue, 03 Dec 2013 14:36:45 -0800 tyan 7190106: java/rmi/reliability/benchmark fails intermittently because of use of fixed port
Tue, 03 Dec 2013 16:20:44 -0500 rriggs 8028019: AWT Doclint warning/error cleanup
Tue, 03 Dec 2013 12:25:32 -0800 bpb 8022181: Tune algorithm crossover thresholds in BigInteger
Tue, 03 Dec 2013 11:52:18 -0800 darcy 8029475: Fix more doclint issues in javax.security
Tue, 03 Dec 2013 11:37:25 -0800 henryjen 8029483: BufferedReader.lines() javadoc typo should be fixed
Tue, 03 Dec 2013 10:07:03 -0800 darcy 8029478: Fix more doclint issues in javax.script
Tue, 03 Dec 2013 17:29:19 +0000 michaelm 8029127: Redirected POST request throws IllegalStateException on HttpURLConnection.getInputStream
Tue, 03 Dec 2013 08:53:23 +0100 sjiang 8029063: test/com/sun/jmx/snmp/NoInfoLeakTest.java does not compile with OpenJDK builds
Mon, 02 Dec 2013 16:06:03 -0500 lancea 8029417: JDBC 4.2 javadoc updates
Mon, 02 Dec 2013 11:29:07 -0800 naoto 8028368: There is no description whether or not java.util.ResourceBundle is thread-safe
Mon, 02 Dec 2013 14:19:25 +0000 vinnie 8029369: Shell tests in sun/security/pkcs11/ do not compile PKCS11Test
Mon, 02 Dec 2013 14:01:23 +0000 msheppar 8025211: Intermittent test failure: java/net/DatagramSocket/PortUnreachable.java
Sun, 01 Dec 2013 23:35:28 -0800 darcy 8006572: DoubleStream.sum() & DoubleSummaryStats implementations that reduce numerical errors
Fri, 29 Nov 2013 09:29:25 +0000 tyan 8029348: ProblemList.txt updates (11/2013)
Thu, 28 Nov 2013 09:10:18 +0100 jbachorik 6987597: ManagementFactory.getGarbageCollectorMXBeans() returns empty list with CMS
Wed, 27 Nov 2013 15:25:36 -0800 juh 8021418: Intermittent: SSLSocketSSLEngineTemplate.java test fails with timeout
Thu, 05 Dec 2013 10:32:02 -0800 lana Merge
Wed, 04 Dec 2013 15:55:36 +0400 serb 8029382: [macosx] Need test for JDK-7161437
Wed, 04 Dec 2013 15:41:03 +0400 pchelko 8028484: [TEST_BUG][macosx] closed/java/awt/MouseInfo/JContainerMousePositionTest fails
Wed, 04 Dec 2013 12:29:18 +0400 alitvinov 8025775: JNI warnings in TryXShmAttach
Tue, 03 Dec 2013 15:10:37 -0800 lana Merge
Tue, 03 Dec 2013 19:33:05 +0400 pchelko 7124391: [TEST_BUG][macosx] MouseEvents are not dispatched when the mouse cursor leaves the component
Tue, 03 Dec 2013 15:31:07 +0400 pchelko 8029251: [TEST_BUG][macosx] Use safari browser, the ouput contain information that DataFlavor.allHtmlFlavor is not present in the system clipboard
Tue, 03 Dec 2013 15:18:52 +0400 yan 8023576: [TEST BUG] Compilation fails for java/awt/Choice/ChoiceMouseWheelTest/ChoiceMouseWheelTest.java
Fri, 29 Nov 2013 16:43:22 +0400 pchelko 7178682: [TEST_BUG][macosx] Mouse Pressed event can't be monitored for DisabledComponentsTest.html.
Fri, 29 Nov 2013 16:12:03 +0400 serb 8029010: [macosx] Need test for JDK-7124513
Fri, 29 Nov 2013 11:08:52 +0400 pchelko 7152982: [TEST_BUG][macosx] Extremely unstable mouse modifiers test
Thu, 05 Dec 2013 10:30:25 -0800 lana Merge
Tue, 03 Dec 2013 17:58:12 -0800 lana Merge
Tue, 03 Dec 2013 09:35:54 -0800 prr 8029204: Printing a GlyphVector on Windows ignores position of first glyph
Wed, 04 Dec 2013 23:11:27 -0800 katleman Added tag jdk8-b119 for changeset e4499a6529e8
Tue, 03 Dec 2013 12:37:30 -0800 amurillo 8029421: Add java/lang/reflect/Method/invoke/TestPrivateInterfaceMethodReflect.java to exclude listjdk8-b119
Tue, 03 Dec 2013 10:48:07 -0800 lana Merge
Wed, 27 Nov 2013 10:47:53 -0800 lana Merge
Wed, 27 Nov 2013 10:01:08 -0800 naoto 8028771: regression test java/util/Locale/LocaleProviders.sh failed
Wed, 27 Nov 2013 09:56:38 +0800 weijun 8029181: ts.sh generates invalid file after JDK-8027026
Tue, 26 Nov 2013 17:16:07 -0500 jrose 8016839: JSR292: AME instead of IAE when calling a method
Tue, 26 Nov 2013 14:49:55 +0900 peytoia 8029057: test/java/text/Bidi/Bug6665028.java can fail with OutOfMemoryError
Mon, 25 Nov 2013 16:53:30 -0800 joehw 8027973: javax/xml/jaxp/transform/jdk8004476/XSLTExFuncTest.java hangs (win)
Mon, 25 Nov 2013 11:56:53 -0800 valeriep 7200306: SunPKCS11 provider delays the check of DSA key size for SHA1withDSA to sign() instead of init()
Mon, 25 Nov 2013 09:40:25 -0800 lana Merge
Mon, 25 Nov 2013 09:55:34 +0100 psandoz 8028516: Java doc error in Int/Long/Double/Stream.peek
Fri, 22 Nov 2013 11:34:26 +0100 jfranck 8023278: Reflection API methods do not throw AnnotationFormatError in case of malformed Runtime[In]VisibleTypeAnnotations attribute
Fri, 22 Nov 2013 09:56:56 +0000 coffeys Merge
Thu, 21 Nov 2013 20:48:24 +0000 aefimov 8027370: Support tzdata2013h
Fri, 15 Nov 2013 15:06:04 +0400 aefimov 8027848: The ZoneInfoFile doesn't honor future GMT offset changes
Thu, 21 Nov 2013 16:02:16 -0800 smarks 7174936: several String methods claim to always create new String
Thu, 21 Nov 2013 14:23:41 -0800 dxu 8028628: java/nio/channels/FileChannel/Size.java failed once in the same binary run
Thu, 21 Nov 2013 14:16:49 -0800 dxu 7065902: (file) test/java/nio/file/Files/Misc.java fails on Solaris 11 when run as root
Thu, 21 Nov 2013 11:58:51 -0800 valeriep Merge
Tue, 19 Nov 2013 15:29:56 -0800 valeriep 8026943: SQE test jce/Global/Cipher/SameBuffer failed
Thu, 21 Nov 2013 16:06:05 +0000 martin 6703075: (process) java/lang/ProcessBuilder/Basic.java fails with fastdebug
Thu, 21 Nov 2013 13:42:54 +0000 tyan 8022212: Intermittent test failures in java/net
Thu, 21 Nov 2013 13:37:11 +0000 tyan 7036666: test/com/sun/net/httpserver/Test9a.java fails intermittently
Thu, 21 Nov 2013 12:57:08 +0000 sla 8028632: Update jdk/test/ProblemList.txt to reflect fix JDK-8024423
Thu, 21 Nov 2013 13:46:35 +0100 egahlin 6402201: ProcessAttachTest.sh needs better synchronization
Thu, 21 Nov 2013 11:36:39 +0000 msheppar 8028215: ORB.init fails with SecurityException if properties select the JDK default ORB
Wed, 20 Nov 2013 21:34:47 +0000 alanb 8028734: test/java/util/Locale/InternationalBAT.java changes does not restore the default TimeZone
Wed, 20 Nov 2013 10:00:54 -0800 mchung 8028647: Add instrumentation in GetSafepointSyncTime.java and remove it from ProblemList.txt
Wed, 20 Nov 2013 13:12:04 +0100 jfranck 8027413: Clarify javadoc for j.l.a.Target and j.l.a.ElementType
Wed, 20 Nov 2013 12:32:13 +0100 egahlin 7141544: TEST_BUG: com/sun/jdi/BreakpointWithFullGC.sh fails
Tue, 19 Nov 2013 15:05:30 -0800 smarks 8028638: java/rmi/activation/Activatable/checkRegisterInLog/CheckRegisterInLog.java fails
Tue, 19 Nov 2013 22:28:12 +0100 dfuchs 8005202: java/util/logging/CheckLockLocationTest.java fail on solars_10
Tue, 19 Nov 2013 13:22:50 -0800 dxu 8028631: Improve the test coverage to the pathname handling on unix-like platforms
Tue, 19 Nov 2013 20:10:58 +0100 dfuchs 8028185: XMLFormatter.format emits incorrect year
Tue, 19 Nov 2013 13:20:07 -0500 rriggs 8028141: test/sun/management/jmxremote/bootstrap/LocalManagementTest|CustomLauncherTest.java failing again
Tue, 19 Nov 2013 10:19:31 -0800 mchung 8028565: Remove java/lang/management/ThreadMXBean/ThreadStateTest.java from ProblemList.txt
Tue, 19 Nov 2013 22:05:45 +0400 kizune 8027900: pack200 option is broken due to the incorrect makefile definition for its driver
Tue, 19 Nov 2013 17:55:43 +0000 vinnie 8015571: OCSP validation fails if ocsp.responderCertSubjectName is set
Tue, 19 Nov 2013 17:49:57 +0000 michaelm 8028581: [TESTBUG] java/net/Socket/LingerTest.java failing
Tue, 19 Nov 2013 16:22:37 +0000 coffeys 8016728: TEST_BUG: test/java/rmi/transport/closeServerSocket/CloseServerSocket.java failing intermittently
Tue, 19 Nov 2013 15:36:59 +0000 robm 8022206: Intermittent test failures in java/lang/ProcessBuilder/Basic.java
Tue, 19 Nov 2013 15:42:59 +0000 vinnie Merge
Tue, 19 Nov 2013 15:39:58 +0000 vinnie 8028377: test/sun/security/provider/KeyStore/DKSTest.sh attempts to write to ${test.src}
Tue, 19 Nov 2013 15:31:33 +0000 bvaidya 8028094: TEST_BUG: java/lang/ProcessBuilder/Basic.java leaves "sleep 6666" processes behind
Tue, 19 Nov 2013 07:10:06 -0800 ksrini 8023978: [TEST_BUG] launcher tests must exclude platforms without server vm
Tue, 19 Nov 2013 15:09:48 +0000 alanb 8028589: Instrument tools/jar/JarEntryTime.java to make it easier to diagnose failures
Tue, 19 Nov 2013 14:47:48 +0000 coffeys 8028583: Add helper methods to test libraries
Tue, 19 Nov 2013 14:08:28 +0000 alanb 8028478: Re-visit JPRT testsets to make it easier to run subsets of the tests
Tue, 19 Nov 2013 13:46:51 +0000 tyan 7086879: java/net/InetAddress/CheckJNI.java hangs on Linux when IPv6 enabled
Tue, 19 Nov 2013 11:47:40 +0100 egahlin 8028505: Put sun/jvmstat/monitor/MonitoredVm/MonitorVmStartTerminate.sh on ProblemList.txt
Tue, 19 Nov 2013 14:14:14 +0800 weijun 8028479: runNameEquals still cannot precisely detect if a usable native krb5 is available
Thu, 14 Nov 2013 11:19:32 +0100 ihse 8027566: Remove the old build system
Mon, 18 Nov 2013 20:22:49 +0400 kizune 8028197: tools/launcher/DiacriticTest.java failed on MacOSX: Input length = 1
Mon, 18 Nov 2013 16:20:40 +0100 jbachorik 8028433: [TESTBUG] add -XX:+UsePerfData to some sun.management tests
Mon, 18 Nov 2013 15:25:15 +0100 jbachorik 8027163: sun/management/jmxremote/bootstrap/CustomLauncherTest.java should be updated for jdk8 removal of solaris-32bit support
Mon, 18 Nov 2013 17:00:23 +0400 yan 8028049: Tidy warnings cleanup for packages java.nio/java.io
Thu, 14 Nov 2013 12:35:34 +0100 sla 8023138: [TEST_BUG] java/lang/instrument/PremainClass/NoPremainAgent.sh fails intermittently
Wed, 27 Nov 2013 10:44:41 -0800 lana Merge
Wed, 27 Nov 2013 20:45:10 +0400 serb 8029024: [TEST_BUG] java/awt/Modal/ModalDialogOrderingTest/ModalDialogOrderingTest.java fails
Wed, 27 Nov 2013 11:41:55 +0400 pchelko 8011142: [TEST_BUG] 2 AppContext regression tests failed since 7u25b03 with NullPointerException
Tue, 26 Nov 2013 18:50:35 +0400 pchelko 8024161: [TEST_BUG] [macosx] java/awt/Menu/OpensWithNoGrab/OpensWithNoGrab.java failed "menu was opened by first click after opened Choice"
Tue, 26 Nov 2013 17:16:32 +0400 mcherkas 8028271: Wrong alt processing during switching between windows.
Tue, 26 Nov 2013 15:57:49 +0400 bagiras 7160604: Using non-opaque windows - popups are initially not painted correctly
Tue, 26 Nov 2013 13:30:44 +0400 malenkov 8028054: com.sun.beans.finder.MethodFinder has unsynchronized access to a static Map
Mon, 25 Nov 2013 13:24:38 -0800 lana Merge
Mon, 25 Nov 2013 14:05:19 +0400 bagiras 8028995: Write regression test for JDK-8016356
Fri, 22 Nov 2013 17:02:49 +0400 serb 8028512: [macosx] Crash in full screen api if incorrect display mode is used
Fri, 22 Nov 2013 15:48:22 +0400 serb 8027479: [macosx] Appletviewer is broken after 8014718
Fri, 22 Nov 2013 10:48:00 +0400 pchelko 8028485: [macosx] java/awt/Mouse/EnterExitEvents/FullscreenEnterEventTest.java fails
Tue, 19 Nov 2013 18:16:41 +0400 serb 8027913: drop target notifications are sent out of order during DnD
Mon, 18 Nov 2013 23:24:27 +0400 bagiras 8027628: JWindow jumps to (0, 0) after mouse clicked
Mon, 18 Nov 2013 19:22:29 +0400 pchelko 8027992: FileInputStream and BufferedInputStream should be closed in sun.applet.*
Fri, 15 Nov 2013 17:40:34 +0400 pchelko 7124253: [macosx] Flavor change notification not coming
Fri, 15 Nov 2013 14:05:49 +0400 alexsch 8025126: [macosx] Invalid calls to setValueAt() within JTable in Java 7 on Mac OS X
Wed, 27 Nov 2013 10:42:42 -0800 lana Merge
Wed, 27 Nov 2013 15:15:40 +0400 bae 8024767: [TEST] need test to cover JDK-7189452
Tue, 26 Nov 2013 10:24:59 -0800 jgodinez 8028584: sun.net.www.protocol.file.FileURLConnection cannot be cast to java.net.HttpURLConnection
Mon, 25 Nov 2013 12:29:54 -0800 lana Merge
Mon, 25 Nov 2013 09:38:32 -0800 ceisserer 8028722: Render: Drawing strings with exactly 254 glyphs causes hangs
Wed, 20 Nov 2013 12:23:55 +0400 yan 8025235: [javadoc] fix some errors in 2D
Tue, 19 Nov 2013 10:36:02 -0800 prr 8027541: ully transparent jframe becomes black.
Thu, 28 Nov 2013 08:24:05 -0800 cl Added tag jdk8-b118 for changeset 28ca338366ff
Mon, 25 Nov 2013 20:22:23 -0800 rgallard Mergejdk8-b118
Mon, 25 Nov 2013 20:19:02 -0800 rgallard 8029043: Update nroff files for JDK 8
Thu, 21 Nov 2013 12:01:45 -0800 ksrini 8028645: [infra] purge applet demos from the Solaris distros
Thu, 21 Nov 2013 09:23:03 -0800 cl Added tag jdk8-b117 for changeset fc4ac66aa657
Fri, 15 Nov 2013 07:14:23 -0800 lana Mergejdk8-b117
Thu, 14 Nov 2013 16:08:28 -0800 xuelei 8014266: regression test AsyncSSLSocketClose.java time out.
Thu, 14 Nov 2013 14:01:52 -0500 coleenp Merge
Thu, 14 Nov 2013 10:44:57 -0500 hseigel 8023041: The CDS classlist needs to be updated for JDK 8
Thu, 14 Nov 2013 19:31:31 +0100 sla 8027765: Make exit codes and stdout/stderr printing from jmap/jinfo/jstack/jps consistent
Thu, 14 Nov 2013 12:17:37 +0100 jfranck 8028055: (reflect) invoking Method/Constructor in anonymous classes breaks with -Dsun.reflect.noInflation=true
Thu, 14 Nov 2013 10:40:33 +0000 alanb 8028343: More ProblemList.txt updates (11/2013)
Wed, 13 Nov 2013 22:22:28 -0800 sherman 8028321: Fix for String.split() empty input sequence/JDK-6559590 triggers regression
Wed, 13 Nov 2013 15:48:21 -0500 emc 8026884: test for fix of JDK-8021398 does not have @bug tag
Wed, 13 Nov 2013 11:26:01 -0800 sherman 8027645: Pattern.split() with positive lookahead
Wed, 13 Nov 2013 11:06:57 -0800 darcy 8028300: Fix raw type lint warnings in java.util.concurrent
Wed, 13 Nov 2013 18:41:30 +0100 egahlin 6954510: TEST_BUG: Testcase failure com/sun/jdi/BreakpointWithFullGC.sh
Wed, 13 Nov 2013 16:52:18 +0000 alanb 8028270: Files.readSymbolicLink calls AccessController directly so security manager can't grant the permission
Wed, 13 Nov 2013 16:44:12 +0000 chegar 8022213: Intermittent test failures in java/net/URLClassLoader
Wed, 13 Nov 2013 07:49:42 -0800 mchung 8028234: Remove unused methods in sun.misc.JavaAWTAccess
Wed, 13 Nov 2013 11:46:05 +0100 ykantser 8015497: Take new fixes from hotspot/test/testlibrary to jdk/test/lib/testlibrary
Wed, 13 Nov 2013 15:21:53 +0100 egahlin 6959636: testcase failing on windows javax/management/loading/LibraryLoader/LibraryLoaderTest.java
Wed, 13 Nov 2013 13:12:16 +0100 jbachorik 8004126: TEST_BUG: com/sun/jdi/BadHandshakeTest.java fails intermittently
Wed, 13 Nov 2013 10:50:30 +0100 dfuchs 8026952: Test java/util/logging/LogManager/RootLogger/setLevel/TestRootLoggerLevel.java has wrong @bug id
Wed, 13 Nov 2013 01:14:23 -0800 xuelei 8023147: Test DisabledShortRSAKeys.java intermittent failed
Wed, 13 Nov 2013 07:43:24 +0000 alanb 8028239: test/sun/jvmstat/monitor/MonitoredVm/MonitorVmStartTerminate.sh with NoClassDefFoundError
Tue, 12 Nov 2013 14:03:28 -0500 rriggs 8028014: Doclint warning/error cleanup in javax.management
Tue, 12 Nov 2013 09:44:39 -0800 darcy 8028229: Fix more raw types lint warning in core libraries
Tue, 12 Nov 2013 17:37:45 +0000 alanb 8028208: (aio) Assertion in clearPendingIoMap when closing at around time file lock is acquired immediately (win)
Tue, 12 Nov 2013 18:12:47 +0100 egahlin 6849945: VM Periodic Task Thread CPU time = -1ns in HotspotThreadMBean.getInternalThreadCpuTimes()
Tue, 12 Nov 2013 17:40:26 +0100 egahlin 6543856: MonitorVmStartTerminate.sh fails intermittently
Tue, 12 Nov 2013 16:59:51 +0100 smarks 8028027: serialver should emit declaration with the 'private' modifier
Tue, 12 Nov 2013 14:52:42 +0100 egahlin 8027209: javax/management/monitor/ThreadPoolAccTest.java fails intermittently
Sat, 09 Nov 2013 04:21:28 +0400 vlivanov 8027823: catchException combinator fails with 9 argument target
Mon, 11 Nov 2013 16:14:07 -0800 rfield 8027803: test/sun/reflect/AnonymousNewInstance/ManyNewInstanceAnonTest.java fails
Mon, 11 Nov 2013 14:35:36 -0800 sherman 8026330: java.util.Base64 urlEncoder should omit padding
Fri, 08 Nov 2013 18:16:12 +0100 sla 8014506: Test of Jdp feature
Mon, 11 Nov 2013 14:22:22 -0500 lancea 8028149: Clean-up javac -Xlint warnings in com.sun.rowset and com.sun.rowset.internal
Mon, 11 Nov 2013 16:06:16 +0000 michaelm 8028060: test/java/net/URLPermission/nstest/lookup.sh failing (win)
Mon, 11 Nov 2013 10:33:02 +0000 chegar 8028102: All test targets, jdk/test/Makefile, fail on Windows
Mon, 11 Nov 2013 16:54:41 +0800 weijun 8027991: InputStream should be closed in sun.security.tools.jarsigner.Main
Mon, 11 Nov 2013 08:36:53 +0000 alanb 8028099: Many com/sun/management/OperatingSystemMXBean tests failing with CCE (win)
Sun, 10 Nov 2013 20:05:03 +0100 jbachorik 6523160: RuntimeMXBean.getUptime() returns negative values
Sat, 09 Nov 2013 14:30:03 -0500 rriggs 8028092: Lint cleanup of java.time.format
Sat, 09 Nov 2013 16:46:46 +0000 alanb 8028044: [TEST_BUG] Calendar shell tests do not pass TESTVMOPTS
Fri, 08 Nov 2013 17:36:14 -0800 lana Merge
Fri, 08 Nov 2013 17:50:24 -0500 rriggs 8028041: Serialized Form description of j.l.String is not consistent with the implementation
Fri, 08 Nov 2013 21:07:42 +0000 alanb 8028074: InetAddress.getByName fails with UHE "invalid IPv6 address" if host name starts with a-f
Fri, 08 Nov 2013 12:19:25 -0800 darcy 8028076: Correct raw type lint warnings in core reflection implementation classes
Fri, 08 Nov 2013 12:13:02 -0800 mchung 8025985: com.sun.management.OSMBeanFactory should not be public
Fri, 08 Nov 2013 18:54:29 +0000 tyan 8023462: TEST_BUG: test/com/sun/net/httpserver/bugs/B6433018.java fails on slow/single core machine
Fri, 08 Nov 2013 09:43:01 -0800 mchung 8028069: (ref) Finalizer.c not deleted in the changeset for JDK-8027351
Fri, 08 Nov 2013 15:15:48 +0000 chegar 8019834: InetAddress.getByName hangs for bad IPv6 literals
Fri, 08 Nov 2013 15:12:30 +0000 tyan 8022963: java/net/NetworkInterface/Equals.java fails equality for Windows Teredo Interface
Fri, 08 Nov 2013 07:53:57 -0800 mchung 8027351: (ref) Private finalize method invoked in preference to protected superclass method
Thu, 07 Nov 2013 16:55:39 +0100 ykantser 8027752: sun/tools/jstatd/TestJstatdExternalRegistry.java: java.lang.SecurityException: attempt to add a Permission to a readonly Permissions object
Fri, 08 Nov 2013 08:47:39 +0100 jbachorik 8007984: Null pointer dereference in jdk/linux-amd64/democlasses/demo/jvmti/heapTracker/src/java_crw_demo.c
Thu, 07 Nov 2013 22:30:06 -0800 yhuang 8027695: There should be a space before % sign in Swedish locale
Thu, 07 Nov 2013 20:56:44 -0500 rriggs 8024458: DataInput.readDouble refers to "readlong" instead of "readLong"
Thu, 07 Nov 2013 10:03:38 -0800 naoto 8027930: ResourceBundle test failures in fr locale
Thu, 07 Nov 2013 13:33:03 +0100 jfranck 8027796: Refactor Core Reflection for Type Annotations
Thu, 07 Nov 2013 10:22:11 +0000 michaelm 8027881: test/java/net/URLPermission/nstest/LookupTest.java failing intermittently, output insufficient
Thu, 07 Nov 2013 08:23:00 +0000 chegar 8027961: Inet[4|6]Address native initializing code should check field/MethodID values
Thu, 07 Nov 2013 08:04:36 +0000 chegar 8027822: ProblemList.txt Updates (11/2013)
Wed, 06 Nov 2013 11:31:49 -0800 ksrini 8027232: Update j.l.invoke code generating class files to use ASM enhancements for invocation of non-abstract methods on ifaces
Wed, 06 Nov 2013 11:22:15 -0800 ksrini 8027227: [asm] generate CONSTANT_InterfaceMethodref for invoke{special/static) of non-abstract methods on ifaces
Wed, 06 Nov 2013 13:25:24 -0800 dxu 8025698: (fs) Typo in exception thrown by encode() in UnixPath.java