log

age author description
Thu, 18 Aug 2016 10:47:09 -0400 coleenp 8037138: x86: problem with JVMTI breakpoint
Thu, 18 Aug 2016 11:11:40 +0000 dsamersoff Merge
Thu, 18 Aug 2016 14:07:00 +0300 dsamersoff 8157236: attach on ARMv7 fails with com.sun.tools.attach.AttachNotSupportedException: Unable to open socket file
Thu, 18 Aug 2016 12:10:18 +0300 dsamersoff 8151345: compiler/codecache/jmx/PeakUsageTest.java is failing on jdk9/dev for JPRT -testset hotspot
Tue, 30 Aug 2016 17:48:27 -0700 mchung 8160851: Remove old launcher module-related options
Thu, 01 Sep 2016 23:20:10 +0000 lana Added tag jdk-9+134 for changeset b8b694c6b4d2
Thu, 25 Aug 2016 22:36:30 +0000 lana Mergejdk-9+134
Fri, 19 Aug 2016 17:19:47 +0200 jwilhelm 8164124: [BACKOUT] G1 does not implement millis_since_last_gc which is needed by RMI GC
Thu, 25 Aug 2016 21:18:44 +0000 lana Added tag jdk-9+133 for changeset a25e0fb60332
Fri, 19 Aug 2016 11:22:14 -0700 amurillo Mergejdk-9+133
Tue, 16 Aug 2016 09:56:18 -0400 hseigel 8030221: Checking for anonymous class should check for NULL as well as potential nesting
Mon, 15 Aug 2016 13:14:08 -0700 cjplummer 8133740: NMT for Linux/x86/x64 and bsd/x64 slowdebug builds includes NativeCallStack::NativeCallStack() frame in backtrace
Mon, 15 Aug 2016 13:13:48 -0700 cjplummer 8133747: NMT includes an extra stack frame due to assumption NMT is making on tail calls being used
Mon, 15 Aug 2016 13:06:50 -0700 cjplummer 8133749: os::current_frame() is not returning the proper frame on ARM and solaris-x64
Mon, 15 Aug 2016 16:15:16 +0200 erikj 8069540: Remove universal binaries support from hotspot build
Tue, 09 Aug 2016 21:57:29 +0900 ysuenaga 8163185: jhsdb jstack cannot work with normal mode
Fri, 12 Aug 2016 14:12:55 -0700 amurillo Merge
Fri, 12 Aug 2016 08:46:17 -0700 fparain 8146697: VM crashes in test Test7005594
Fri, 12 Aug 2016 00:19:44 -0400 dholmes 8159461: bigapps/Kitchensink/stressExitCode hits assert: Must be VMThread or JavaThread
Thu, 11 Aug 2016 16:22:08 -0700 iveresov Merge
Tue, 09 Aug 2016 16:47:47 +0300 dpochepk 8160299: Test8015436 doesn't check which method was executed
Tue, 09 Aug 2016 14:17:28 +0300 dpochepk 8163366: compiler/codecache/jmx/ThresholdNotificationsTest.java doesn't set -XX:+UnlockDiagnosticVMOptions while using WB
Tue, 09 Aug 2016 14:16:44 +0300 dpochepk 8160083: compiler.codecache.jmx.InitialAndMaxUsageTest can not be used w/ disabled SegmentedCodeCache
Mon, 08 Aug 2016 17:06:21 +0200 dnsimon 8163105: SIGSEGV: constantPoolHandle::constantPoolHandle(ConstantPool*)
Mon, 08 Aug 2016 11:30:46 +0300 dpochepk 8163243: [TESTBUG] compiler/codecache/jmx/UsageThresholdIncreasedTest.java failed with: Failed to find sun/hotspot/WhiteBox.class
Sat, 06 Aug 2016 11:52:37 -0700 iveresov 8163313: assert(comp != __null) failed: compiler not available
Fri, 05 Aug 2016 13:37:53 -0700 iveresov Merge
Fri, 05 Aug 2016 16:23:44 +0300 dpochepk 8157498: compiler/codecache/jmx/InitialAndMaxUsageTest.java times out on 32-bit platforms
Fri, 05 Aug 2016 16:22:30 +0300 dpochepk 8161279: Various JMX-tests timed out
Thu, 04 Aug 2016 22:42:05 -0400 mdoerr 8162369: PPC64: Wrong ucontext used after SIGTRAP while in HTM critical section
Thu, 04 Aug 2016 10:34:34 +0200 thartmann 8136818: Test compiler/arraycopy/TestEliminatedArrayCopyDeopt.java fails with "m1 failed"
Thu, 04 Aug 2016 08:58:22 +0200 thartmann 8162881: Effect of -XX:CICompilerCount depends on ordering of other flags
Wed, 03 Aug 2016 15:52:38 +0000 never Merge
Tue, 02 Aug 2016 17:12:16 -0700 never 8162477: [JVMCI] assert(wf.check_method_context(ctxk, m)) failed: proper context
Tue, 02 Aug 2016 19:46:29 -0700 kvn 8163018: Slow compiler tests in JPRT
Thu, 11 Aug 2016 21:35:09 +0200 dcubed Merge
Thu, 11 Aug 2016 16:13:05 +0000 lfoltan Merge
Thu, 11 Aug 2016 11:41:11 -0400 lfoltan 8162553: Crash in class unloading due to null CLD having a zero _keep_alive value
Thu, 11 Aug 2016 17:47:25 +0300 dsamersoff 8163143: illegal bci error with interpreted frames in SA due to mirror being stored in interpreted frames
Wed, 10 Aug 2016 21:02:14 -0400 ysuenaga 8163580: Cannot get Monitor Cache Dump in HSDB
Wed, 10 Aug 2016 09:24:42 +0200 rehn 8161026: GPL header missing comma in year
Thu, 18 Aug 2016 21:33:36 +0000 lana Merge
Tue, 16 Aug 2016 08:08:00 -0700 amurillo Merge
Thu, 11 Aug 2016 12:27:20 -0700 dcubed 8163879: quarantine serviceability/sa/sadebugd/SADebugDTest.java since it hangs intermittently
Fri, 12 Aug 2016 13:58:14 -0700 amurillo Merge
Mon, 08 Aug 2016 15:53:02 +0000 dsamersoff Merge
Mon, 08 Aug 2016 21:59:12 +0900 ysuenaga 8163272: jhsdb jinfo cannot show system properties
Mon, 08 Aug 2016 17:15:46 +0300 dsamersoff 8163269: Testcase missed in push for JDK-8160817
Fri, 05 Aug 2016 09:58:09 -0700 amurillo Merge
Thu, 04 Aug 2016 16:11:49 -0700 cjplummer 8162670: make of jtreg_tests fails if no tests are run, causing jprt test runs to also fail
Thu, 04 Aug 2016 23:17:33 +0200 mockner Merge
Thu, 04 Aug 2016 12:55:28 -0400 mockner 8145543: JPRT jobs see intermittent failures in compiler/floatingpoint/ModNaN.java
Thu, 04 Aug 2016 19:50:23 +0000 coleenp Merge
Thu, 04 Aug 2016 10:11:35 -0700 gthornbr 8162999: Build give extraneous find warnings
Thu, 04 Aug 2016 20:28:12 +0200 mockner Merge
Thu, 04 Aug 2016 18:34:40 +0200 mockner Merge
Thu, 04 Aug 2016 12:24:10 -0400 mockner 8159917: Space character is missing in ClassLoaderData::print_value_on
Thu, 04 Aug 2016 14:04:14 +0300 lmesnik 8162852: Mark stress compiler and gc tests with stress keyword
Wed, 03 Aug 2016 15:55:40 -0700 iveresov Merge
Tue, 02 Aug 2016 11:06:25 -0700 dlong 8029441: assert(!((nmethod*)_cb)->is_deopt_pc(_pc)) failed: invariant broken
Mon, 01 Aug 2016 22:34:23 -0700 kvn Merge
Sat, 30 Jul 2016 04:05:28 -0700 roland 8161652: Crash with assert(ft == _type) failed in PhiNode::Value()
Wed, 03 Aug 2016 13:56:27 -0700 cjplummer 8161030: GPL header missing comma after year
Wed, 03 Aug 2016 09:40:21 -0400 coleenp 8159284: bigapps/Jetty - assert(jfa->last_Java_sp() > sp()) failed with JFR in use
Tue, 02 Aug 2016 20:55:27 -0700 dcubed Merge
Tue, 02 Aug 2016 13:48:07 -0700 gthornbr 8161696: [TESTBUG] runtime/StackGuardPages/testme.sh uses invalid argument -Xss328k
Wed, 03 Aug 2016 02:10:23 +0000 jprovino Merge
Tue, 02 Aug 2016 16:39:33 -0400 jprovino 8071770: G1 does not implement millis_since_last_gc which is needed by RMI GC
Thu, 18 Aug 2016 21:01:21 +0000 lana Added tag jdk-9+132 for changeset 713951c08aa2
Fri, 12 Aug 2016 08:59:20 -0700 mhaupt 8163533: jdk.vm.ci.hotspot.test.MethodHandleAccessProviderTest fails on jdk9/devjdk-9+132
Thu, 11 Aug 2016 17:02:27 +0000 lana Merge
Wed, 10 Aug 2016 15:48:04 -0700 hseigel 8136930: Simplify use of module-system options by custom launchers
Thu, 11 Aug 2016 15:47:07 +0000 lana Added tag jdk-9+131 for changeset 943bf73b49c3
Fri, 05 Aug 2016 09:50:25 -0700 amurillo Mergejdk-9+131
Tue, 02 Aug 2016 16:24:04 -0400 dholmes 7008747: Header files with conditional behaviour can not be precompiled
Tue, 02 Aug 2016 15:22:41 +0300 mchernov 8161604: TestNewSizeFlags fails with RuntimeException: max new size != MaxNewSize value
Mon, 01 Aug 2016 20:47:51 -0700 kvn Merge
Fri, 29 Jul 2016 17:41:14 +0300 tpivovarova 8161138: testlibrary_tests/ctw/* failed with "Failed. Unexpected exit from test [exit code: 0]"
Mon, 01 Aug 2016 20:41:15 -0400 clanger 8162869: Small fixes for AIX perf memory and attach listener
Mon, 01 Aug 2016 16:28:23 -0400 coleenp 8161445: [BACKOUT] MemberNameTable doesn't purge stale entries
Mon, 01 Aug 2016 15:38:58 +0300 dsamersoff 8160817: Add jsadebugd functionality to jhsdb
Mon, 01 Aug 2016 10:51:22 +0300 dsamersoff 8158050: Remove SA-JDI
Fri, 29 Jul 2016 16:50:45 -0700 amurillo Merge
Fri, 29 Jul 2016 16:11:55 -0700 amurillo Merge
Fri, 29 Jul 2016 20:23:24 +0000 jmasa Merge
Wed, 08 Jun 2016 14:11:51 -0700 jmasa 8159073: : Error handling incomplete when creating GC threads lazily
Fri, 29 Jul 2016 11:38:07 -0700 dcubed 8161601: Solaris: __USE_LEGACY_PROTOTYPES__ is redundant and should be removed
Fri, 29 Jul 2016 08:17:43 +0000 rbackman Merge
Fri, 29 Jul 2016 09:23:05 +0200 rbackman Merge
Thu, 28 Jul 2016 16:09:31 +0300 dpochepk 8162603: Unrecognized VM option 'UseCountedLoopSafepoints'
Thu, 28 Jul 2016 08:19:35 +0000 zmajo Merge
Wed, 27 Jul 2016 12:33:33 +0200 roland 8162384: Performance regression: bimorphic inlining may be bypassed by type speculation
Wed, 27 Jul 2016 10:56:01 -0700 dlong 8160742: Node::operator new invokes undefined behavior
Wed, 20 Jul 2016 12:34:11 +0200 goetz 8161907: adlc: Fix crash in cisc_spill_match if _rChild == NULL
Mon, 25 Jul 2016 14:31:42 -0700 roland 8161147: jvm crashes when -XX:+UseCountedLoopSafepoints is enabled
Thu, 23 Jun 2016 17:58:59 +0000 aph 8157306: Random infrequent null pointer exceptions in javac
Mon, 25 Jul 2016 21:02:51 +0300 dpochepk 8162376: TestSHA512Intrinsics.java failed with Unexpected count of intrinsic _sha5_implCompress is expected
Fri, 22 Jul 2016 12:47:08 -1000 twisti 8162427: fix indent in CompileTask::print_tty
Mon, 18 Jul 2016 20:45:51 +0200 roland 8161651: Logic in ConnectionGraph::split_unique_types() wrongly assumes node always have memory input
Fri, 22 Jul 2016 17:52:03 +0000 dnsimon Merge
Wed, 20 Jul 2016 22:18:13 +0000 dnsimon 8161265: [JVMCI] EnableJVMCI should only be required when its not implied by other flags
Fri, 22 Jul 2016 17:05:08 +0100 aph 8161190: AArch64: Fix overflow in immediate cmp instruction
Wed, 20 Jul 2016 19:35:08 +0300 dpochepk 8071652: -XX:CompileOnly does not behave as documented
Wed, 20 Jul 2016 19:33:22 +0300 dpochepk 8161695: compiler/jsr292/MHInlineTest.java can't be run on client-only platforms
Wed, 20 Jul 2016 19:31:34 +0300 dpochepk 8158756: [Testbug] serviceability/dcmd/compiler/CompilerQueueTest.java fails with TieredStopAtLevel=1
Wed, 20 Jul 2016 19:29:10 +0300 dpochepk 8161508: JVMCI: MaterializeVirtualObjectTest fails w/ "CASE: invalidate=true: has no virtual object before materialization
Tue, 19 Jul 2016 18:17:40 -0700 never 8161603: [JVMCI] HotSpotVMConfig.baseVtableLength is incorrectly computed
Tue, 19 Jul 2016 18:59:11 +0000 dnsimon 8161274: [JVMCI] compiler/jvmci/events/JvmciNotifyInstallEventTest.java fails with NoClassDefFound
Tue, 19 Jul 2016 18:11:03 +0000 never 8161292: [JVMCI] missing test files from 8159368
Tue, 19 Jul 2016 13:15:46 +0200 rbackman Merge
Thu, 23 Jun 2016 22:33:46 +0200 goetz 8160245: C1: Clean up platform #defines in c1_LIR.hpp.
Thu, 14 Jul 2016 20:11:55 +0300 dpochepk 8157861: [TESTBUG] compiler/jvmci/compilerToVM/ReprofileTest.java failed with RuntimeException
Thu, 14 Jul 2016 20:10:16 +0300 dpochepk 8157984: [TESTBUG] Several compiler tests fails when are executed with -XX:TieredStopAtLevel=1
Thu, 14 Jul 2016 14:44:53 +0000 tpivovarova Merge
Wed, 13 Jul 2016 18:03:15 +0300 tpivovarova 8151280: update hotspot tests to use vm.compMode instead of their own logic
Thu, 14 Jul 2016 15:18:15 +0100 aph Merge
Wed, 13 Jul 2016 15:19:34 +0100 aph 8159467: AArch64: Enable compact strings
Fri, 08 Jul 2016 17:11:37 +0100 aph 8161072: AArch64: jtreg compiler/uncommontrap/TestDeoptOOM failure
Thu, 14 Jul 2016 08:33:08 +0200 mhaupt 8161068: jdk.vm.ci.hotspot.test.MethodHandleAccessProviderTest fails
Wed, 13 Jul 2016 19:08:07 +0300 ppunegov 8160761: [TESTBUG] Several compiler tests fail with product bits
Mon, 04 Jul 2016 16:28:27 +0200 goetz 8056950: Compiled code (64-bit) on SPARC should sign extend INT parameters passed on registers to runtime or native methods.
Tue, 12 Jul 2016 20:42:46 +0000 sanzinger 8159368: [JVMCI] SPARCHotSpotRegisterConfig.callingConvention gives incorrect calling convention for native calls containing fp args
Tue, 12 Jul 2016 18:24:48 +0300 tpivovarova 8132919: Put compiler tests in packages
Tue, 12 Jul 2016 08:42:46 +0000 zmajo Merge
Tue, 12 Jul 2016 10:16:36 +0200 zmajo 8098573: Compiler accesses to shared archive fail if archive is remapped
Tue, 12 Jul 2016 08:57:00 +0200 thartmann 8160898: assert while replaying ciReplay file created using TieredStopAtLevel=1
Mon, 11 Jul 2016 19:15:21 +0000 dnsimon 8160730: [JVMCI] compiler selection should work without -Djvmci.Compiler
Mon, 11 Jul 2016 13:14:19 +0200 rbackman Merge
Fri, 08 Jul 2016 21:26:02 +0300 iignatyev 8160657: Compiler HotSpot tests should use the "run driver" directive where applicable
Fri, 08 Jul 2016 20:14:18 +0300 dpochepk 8160276: Jittester: bytecode tests generation hangs in ClassWriter infinite loop
Fri, 08 Jul 2016 17:02:10 +0100 aph 8160969: aarch64: CDS is broken after 8079507
Thu, 07 Jul 2016 15:39:12 +0100 aph Merge
Thu, 07 Jul 2016 15:07:13 +0100 aph 8141633: Implement VarHandles/Unsafe intrinsics on AArch64
Thu, 07 Jul 2016 13:53:52 +0300 tpivovarova 8160773: error: package jdk.internal.jimage does not exist
Wed, 06 Jul 2016 15:05:28 +0300 vlivanov 8160360: Mismatched field loads are folded in LoadNode::Value
Tue, 05 Jul 2016 17:57:20 -0700 dnsimon 8159888: [JVMCI] the client VM build is broken when INCLUDE_JVMCI is defined
Tue, 05 Jul 2016 07:57:09 +0200 thartmann 8159129: TestStringIntrinsicRangeChecks fails w/ No exception thrown for compressByte/inflateByte
Mon, 04 Jul 2016 09:14:02 +0200 thartmann 8160651: StubRoutines::_dtan does not restore callee save register rbx
Sat, 02 Jul 2016 00:27:19 +0000 dnsimon 8160647: [JVMCI] need to be able to copy internal arrays from LocalVariableTable and LineNumberTable
Thu, 30 Jun 2016 05:05:52 -0700 rraghavan 8153194: PreserveFPRegistersTest.java runs out of memory in the nightlies.
Tue, 24 May 2016 01:13:57 -0700 enevill 8156943: aarch64: string compare does not support CompactStrings
Thu, 30 Jun 2016 08:24:51 +0200 thartmann 8160425: Vectorization with signalling NaN returns wrong result
Wed, 29 Jun 2016 18:04:04 +0300 ppunegov 8160471: compiler/rangechecks/TestRangeCheckEliminationDisabled.java fails after JDK-8150900
Wed, 29 Jun 2016 11:38:58 +0000 tpivovarova Merge
Wed, 29 Jun 2016 14:32:13 +0300 tpivovarova 8153515: [ctw] CompileTheWorld testlibrary should trigger compilation of <clinit> and <init>
Wed, 29 Jun 2016 11:24:13 +0000 enevill 8160534: aarch64: fails to build after 8157834
Tue, 28 Jun 2016 20:08:43 +0000 never Merge
Tue, 28 Jun 2016 17:22:56 +0000 never 8160121: [JVMCI] JvmciNotifyBootstrapFinishedEventTest.java failed NoClassDefFoundError: jdk/vm/ci/runtime/JVMCI
Tue, 28 Jun 2016 19:58:15 +0300 tpivovarova 8143081: [ctw] Test CompileTheWorld.java needs to be updated for Jigsaw
Mon, 27 Jun 2016 17:23:15 +0300 dpochepk 8132318: -XX:TraceJumps is broken on Sparc
Mon, 27 Jun 2016 10:10:11 +0200 thartmann 8159016: Over-unrolled loop is partially removed
Fri, 24 Jun 2016 15:30:50 -0700 kvn Merge
Fri, 24 Jun 2016 19:06:00 +0000 iveresov Merge
Fri, 24 Jun 2016 11:22:08 -0700 iveresov 8157249: [JVMCI] remove ConstantReflectionProvider.isEmbeddable method
Fri, 24 Jun 2016 17:12:50 +0000 ppunegov Merge
Fri, 24 Jun 2016 19:06:15 +0300 ppunegov 8160085: @library' must appear before first `@run'
Fri, 24 Jun 2016 17:11:17 +0000 rschatz Merge
Fri, 24 Jun 2016 15:45:47 +0000 rschatz 8160177: [JVMCI] race condition in HotSpotMemoryAccessProviderImpl.verifyReadRawObject
Thu, 16 Jun 2016 06:42:08 -0400 enevill 8159063: aarch64: optimise unaligned array copy long
Wed, 22 Jun 2016 17:05:40 +0200 simonis 8159620: -XX:-UseOnStackReplacement does not work together with -XX:+TieredCompilation on ppc64 and sparc
Fri, 29 Jul 2016 08:36:13 +0200 thartmann 8162540: Crash in C2 escape analysis with assert: "node should be registered"
Thu, 28 Jul 2016 09:57:49 -0400 lfoltan 8160487: JVM should validate a module by checking for an instance of java.lang.reflect.Module
Wed, 27 Jul 2016 18:43:52 +0300 mchernov 8159606: gc/g1/TestShrinkAuxiliaryData* tests fail because GC triggered before VM initialization completed
Wed, 27 Jul 2016 21:16:38 +0400 dfazunen 8161990: Un-quarantine TestParallelHeapSizeFlags.java and TestSmallHeap.java.
Wed, 27 Jul 2016 13:33:52 +0000 acorn Merge
Wed, 27 Jul 2016 08:31:48 -0400 acorn 8162340: Better class stream parsing
Tue, 26 Jul 2016 23:52:25 -0400 dholmes 8140723: Remove source code conditionalized on JAVASE_EMBEDDED
Tue, 26 Jul 2016 17:25:58 -0400 jiangli 8156959: compiler/codecache/jmx/UsageThresholdExceededSeveralTimesTest.java fails with exit 134.
Tue, 26 Jul 2016 10:29:27 -0400 lfoltan 8154239: -Xbootclasspath/a breaks exploded build
Tue, 26 Jul 2016 11:04:20 +0200 tschatzl 8161993: G1 crashes if active_processor_count changes during startup
Tue, 26 Jul 2016 11:04:20 +0200 tschatzl 8147910: Cache initial active_processor_count
Wed, 13 Jul 2016 12:23:05 +0200 goetz 8161258: Simplify including platform files.
Mon, 25 Jul 2016 18:52:59 +0000 amurillo Merge
Mon, 25 Jul 2016 15:30:23 +0000 amurillo Merge
Fri, 22 Jul 2016 19:04:38 +0000 amurillo Merge
Fri, 22 Jul 2016 10:35:46 -0700 amurillo Merge
Fri, 22 Jul 2016 10:14:23 -0700 amurillo Merge
Mon, 25 Jul 2016 17:35:25 +0200 ddmitriev Merge
Fri, 22 Jul 2016 16:55:55 +0300 akulyakh 8153978: New test to verify the modules info as returned by the JVMTI
Mon, 25 Jul 2016 09:40:31 -0400 mockner 8038332: The trace event vm/class/load is not always being sent
Fri, 22 Jul 2016 10:15:42 -0700 bchristi 8161028: GPL header missing comma after year
Thu, 21 Jul 2016 14:55:54 +0200 ehelin 8159464: DumpHeap.java hits assert in G1 code
Fri, 22 Jul 2016 02:36:39 -0700 sspitsyn 8145627: sun.jvm.hotspot.oops.InstanceKlass::getSize() returns the incorrect size and has no test
Fri, 22 Jul 2016 04:05:04 +0000 amurillo Merge
Thu, 21 Jul 2016 20:09:19 -0700 amurillo Merge
Thu, 21 Jul 2016 19:50:41 -0700 amurillo Merge
Thu, 21 Jul 2016 19:29:33 -0700 ccheung 8161539: 8159666 breaks minimal VM
Thu, 21 Jul 2016 16:45:56 +0000 dfazunen Merge
Thu, 21 Jul 2016 17:12:35 +0400 dfazunen 8161552: Test issue: VM init failed: GC triggered before VM initialization completed. Try increasing NewSize, current value 768K.
Thu, 21 Jul 2016 16:29:21 +0200 psandoz 8161947: runtime/Unsafe/GetUnsafe.java is failing on jdk9/dev
Thu, 21 Jul 2016 14:06:22 +0200 mgerdin 8161915: Linking gtestLauncher may end up linking with non-gtest libjvm
Wed, 20 Jul 2016 14:47:53 +0300 bmoloden 8160119: Utils.tryFindJvmPid sometimes find incorrect pid
Tue, 19 Jul 2016 22:14:22 +0200 jiangli Merge
Tue, 19 Jul 2016 20:39:23 +0200 jiangli Merge
Tue, 19 Jul 2016 20:07:06 +0200 jiangli Merge
Tue, 19 Jul 2016 13:52:14 -0400 jiangli 8141341: CDS should be disabled if JvmtiExport::should_post_class_file_load_hook() is true.
Tue, 19 Jul 2016 19:05:06 +0000 jmasa Merge
Wed, 06 Jul 2016 13:23:10 -0700 jmasa 8155263: DisableStartThread should not be applied to GC worker threads
Tue, 19 Jul 2016 17:26:51 +0000 gziemski Merge
Tue, 19 Jul 2016 11:00:45 -0500 gziemski 8138760: [JVMCI] VM warning: Performance bug: SystemDictionary lookup_count=21831450 lookup_length=1275207287 average=58.411479 load=5.572844
Tue, 19 Jul 2016 18:15:46 +0300 mchernov 8160827: gc/stress/TestStressG1Humongous.java fails with OOME
Tue, 19 Jul 2016 09:30:30 +0200 tschatzl 8157459: G1 IHOP JFR event attribute with incorrect content type
Tue, 19 Jul 2016 10:31:41 +0200 tschatzl 8034842: Parallelize the Free CSet phase in G1
Mon, 18 Jul 2016 14:20:30 -0700 dcubed 8161173: quarantine compiler/arraycopy/TestEliminatedArrayCopyDeopt.java
Mon, 18 Jul 2016 14:30:39 +0200 mgerdin 8161027: GPL header missing comma after year
Sat, 16 Jul 2016 23:10:00 +0300 igerasim 8160892: Race at the VM exit causes "WaitForMultipleObjects timed out"
Fri, 15 Jul 2016 17:05:10 -0700 dcubed Merge
Fri, 15 Jul 2016 10:46:08 -0700 gthornbr 8144278: [TESTBUG] hotspot/runtime/StackGuardPages/testme.sh should use native library build support
Fri, 15 Jul 2016 10:31:50 -0700 gthornbr 8144279: [TESTBUG] hotspot/runtime/jsig/Test8017498.sh should use native library build support
Fri, 15 Jul 2016 10:25:16 -0700 gthornbr 8081770: [TESTBUG] regression Test7107135 needs to remove dependence on locally installed gcc
Fri, 15 Jul 2016 18:09:33 +0000 dcubed Merge
Fri, 15 Jul 2016 09:36:28 -0700 dcubed 8160997: Solaris: deprecated <pwd.h> and <gid.h> interfaces should be replaced
Fri, 15 Jul 2016 09:10:36 -0700 amurillo Merge
Fri, 15 Jul 2016 12:40:47 +0000 psandoz Merge
Fri, 15 Jul 2016 12:36:18 +0200 psandoz 8151163: All Buffer implementations should leverage Unsafe unaligned accessors
Fri, 15 Jul 2016 13:33:44 +0200 tschatzl 8160897: Concurrent mark mark stack memory allocation leaks memory
Tue, 12 Jul 2016 15:06:18 +0300 mchernov 8158508: gc/logging/TestUnifiedLoggingSwitchStress.java timeout
Wed, 13 Jul 2016 18:26:51 -0700 ccheung 8159901: missing newline char in the exception messages in diagnosticArgument.cpp
Thu, 07 Jul 2016 18:40:53 +0100 andrew 8156980: Hotspot build doesn't have -std=gnu++98 gcc option
Wed, 13 Jul 2016 10:51:19 +0300 dsamersoff 8134434: JVM_DoPrivileged() fires assert(_exception_caught == false) failed: _exception_caught is out of phase
Tue, 21 Jun 2016 19:37:30 +0200 jwilhelm 8024137: Flags should be set using the proper macro
Tue, 21 Jun 2016 19:35:39 +0200 jwilhelm 8048093: Explicitly setting := vs = in the -XX:+PrintFlagsFinal output
Thu, 04 Aug 2016 15:52:14 -0700 darcy 8163231: A couple of runtime tests failing for the -testset hotspot snapshot job
Thu, 04 Aug 2016 17:32:52 +0000 amurillo Added tag jdk-9+130 for changeset 7d54c7056328
Thu, 28 Jul 2016 16:08:14 +0000 amurillo Added tag jdk-9+129 for changeset e96b34b76d86jdk-9+130
Thu, 21 Jul 2016 21:42:16 +0000 vlivanov Mergejdk-9+129
Thu, 21 Jul 2016 20:18:11 +0300 vlivanov 8155781: C2: opaque unsafe access triggers an assert
Thu, 21 Jul 2016 17:14:02 +0000 amurillo Merge
Wed, 20 Jul 2016 10:55:32 -0700 dcubed 8161949: quarantine runtime/Unsafe/GetUnsafe.java to allow sync with JDK9-dev
Wed, 11 May 2016 12:03:46 -0400 hseigel 8155981: Bolster bytecode verification
Wed, 20 Apr 2016 16:39:37 -0400 jiangli 8153312: Constrain AppCDS behavior
Wed, 06 Apr 2016 21:53:44 -0700 iklam 8150752: Share Class Data
Wed, 06 Apr 2016 07:55:32 -0400 hseigel 8152479: Coded byte streams
Tue, 19 Jul 2016 11:02:28 +0200 zmajo Merge
Tue, 19 Jul 2016 10:14:34 +0200 zmajo 8161660: Quarantine TestParallelHeapSizeFlags.java and TestSmallHeap.java
Mon, 18 Jul 2016 15:53:56 +0200 zmajo 8161581: Quarantine compiler/jvmci/jdk.vm.ci.runtime.test/src/jdk/vm/ci/runtime/test/TestResolvedJavaType.java
Fri, 15 Jul 2016 09:05:33 -0700 amurillo Merge
Wed, 06 Jul 2016 20:58:08 +0900 ysuenaga 8153074: UL: Show output option in VM.log jcmd
Sat, 09 Jul 2016 19:20:38 -0700 sspitsyn 8159145: Add JVMTI function GetNamedModule
Fri, 08 Jul 2016 12:17:10 -0700 amurillo Merge
Thu, 19 May 2016 13:59:50 -0700 jmasa 8157240: GC task trace logging is incomprehensible
Tue, 21 Jun 2016 14:00:18 +0200 stefank 8159893: StringTable cleaning log line lacks the GC ID prefix
Thu, 07 Jul 2016 14:58:17 -0700 dcubed 8068592: Remove unused code in objectMonitor.hpp
Thu, 07 Jul 2016 15:40:36 -0400 kbarrett 8160350: cannot truss jdk9 [ solaris ]
Wed, 06 Jul 2016 12:01:07 +0000 zmajo Merge
Wed, 06 Jul 2016 11:16:36 +0200 zmajo 8160527: Check for final instance field updates can be omitted
Wed, 06 Jul 2016 11:22:55 +0200 tschatzl 8159978: Use an array to store the collection set regions instead of linking through regions
Tue, 05 Jul 2016 21:24:24 +0000 dcubed Merge
Tue, 05 Jul 2016 14:00:21 -0700 dcubed 8160739: quarantine tests failing due to -XX:TieredStopAtLevel=1
Tue, 05 Jul 2016 15:34:06 -0400 drwhite 8158946: btree009 fails with assert(s > 0) failed: Bad size calculated
Tue, 05 Jul 2016 20:09:21 +0200 kbarrett Merge
Mon, 04 Jul 2016 12:43:01 +0900 ysuenaga 8160353: narrowing conversion error is occurred with GCC 6
Mon, 13 Jun 2016 14:10:09 -0700 jmasa 8024945: Remove check on minimum size of MetaspaceSize
Tue, 28 Jun 2016 00:24:10 +0900 ysuenaga 8160361: SEGV occurred at JNIHandleBlock::oops_do(OopClosure*)
Mon, 04 Jul 2016 11:27:11 +0200 pliden 8159974: G1 String deduplication logging not aligned with the rest of G1
Sat, 02 Jul 2016 00:26:51 +0000 amurillo Merge
Fri, 01 Jul 2016 16:55:44 -0700 amurillo Merge
Thu, 21 Jul 2016 16:42:57 +0000 amurillo Added tag jdk-9+128 for changeset 22bf6db9767b
Thu, 14 Jul 2016 16:21:57 +0000 amurillo Mergejdk-9+128
Tue, 12 Jul 2016 10:03:30 -0700 amurillo Merge
Fri, 08 Jul 2016 12:12:54 -0700 amurillo Merge
Fri, 01 Jul 2016 23:11:45 +0000 poonam Merge
Fri, 01 Jul 2016 12:51:29 -0700 poonam 8064814: Print more helpful error message when getting OOM due to low Java Heap base when running with CompressedOops
Thu, 30 Jun 2016 19:16:14 -0400 kbarrett 8160356: invalid suffix on literal warning is occurred with GCC 6
Fri, 01 Jul 2016 13:39:36 +0200 ctornqvi Merge
Fri, 01 Jul 2016 07:21:33 -0400 ctornqvi 8160484: Implement Hotspot Runtime tier 2
Fri, 01 Jul 2016 11:55:25 +0200 erikj 8158629: bash >(...) construct still causes race conditions
Wed, 29 Jun 2016 16:11:50 +0200 mlarsson 8159695: Arguments::atojulong() fails to detect overflows
Thu, 30 Jun 2016 00:19:48 +0000 coleenp Merge
Wed, 29 Jun 2016 20:16:05 -0400 coleenp 8160551: assert(c == Bytecodes::_putfield) failed: must be putfield
Wed, 29 Jun 2016 18:40:28 +0300 kzhaldyb 8132711: Add tests which check that Humongous objects behave as expected after Mixed GC
Wed, 29 Jun 2016 17:01:55 +0300 kzhaldyb 8132715: Add tests which check that no allocations allowed in any of humongous regions
Tue, 28 Jun 2016 10:11:01 -0400 lfoltan 8159262: Walking PackageEntry Export and ModuleEntry Reads Must Occur Only When Neccessary And Wait Until ClassLoader's Aliveness Determined
Tue, 28 Jun 2016 10:37:52 +0200 pliden 8159890: SIGSEGV with UseStringDeduplication and UseSharedSpaces/RequireSharedSpaces
Tue, 12 Jul 2016 10:39:46 +0200 mhaupt 8161032: GPL header incorrect - address wrong - not swapped in licensee bundles
Thu, 14 Jul 2016 15:47:44 +0000 amurillo Added tag jdk-9+127 for changeset 352357128f60
Tue, 12 Jul 2016 21:14:52 +0000 amurillo Mergejdk-9+127
Fri, 08 Jul 2016 20:11:22 +0300 dsamersoff 8161074: Quarantine jdk/vm/ci/hotspot/test/MethodHandleAccessProviderTest.java in JDK9-dev
Thu, 07 Jul 2016 18:35:44 +0000 amurillo Merge
Thu, 07 Jul 2016 19:00:43 +0000 amurillo Merge
Fri, 01 Jul 2016 16:50:34 -0700 amurillo Merge
Mon, 27 Jun 2016 09:35:18 +0200 pliden 8158871: Long response times with G1 and StringDeduplication
Sun, 26 Jun 2016 20:00:45 -0700 iklam 8148813: Windows os::check_heap needs more information
Fri, 24 Jun 2016 15:09:00 -0700 kvn Merge
Thu, 23 Jun 2016 10:22:36 -0700 never 8160197: [JVMCI] AllocatableValue.toString overrides are missing reference information
Thu, 23 Jun 2016 15:41:33 +0000 dpochepk Merge
Thu, 23 Jun 2016 17:40:20 +0300 dpochepk 8159730: compiler/jvmci/compilerToVM/IsMatureTest failed with "Multiple times invoked method should have method data (assert failed: 0 != 0)"
Thu, 23 Jun 2016 17:39:49 +0300 dpochepk 8159803: Jittester: FileAlreadyExists exception during tests generation
Thu, 23 Jun 2016 17:39:06 +0300 dpochepk 8158650: [jittester] when generating tests with default parameters, generation hangs after 98 test
Thu, 23 Jun 2016 17:38:29 +0200 mdoerr 8159976: PPC64: Add missing intrinsics for sub-word atomics
Thu, 23 Jun 2016 05:13:55 +0000 dnsimon 8159613: [Findbugs] various warnings reported for JVMCI sources
Wed, 22 Jun 2016 23:31:33 +0000 never Merge
Wed, 22 Jun 2016 22:39:32 +0000 never 8158850: [JVMCI] be more precise when enforcing OopMapValue encoding limitations
Thu, 23 Jun 2016 00:37:25 +0200 iignatyev Merge
Wed, 22 Jun 2016 20:06:39 +0300 lmesnik 8158581: ciReplay can not be run w/ JFR enabled
Wed, 22 Jun 2016 00:29:32 +0300 iignatyev 8132920: use package in compiler testlibraries
Wed, 22 Jun 2016 21:24:07 +0300 iignatyev 8160025: compiler/testlibrary/uncommontrap/Verifier doesn't close FileReader
Wed, 22 Jun 2016 21:13:52 +0000 never 8159856: [JVMCI] InterpreterFrameSizeTest.java failed compilation
Wed, 22 Jun 2016 13:29:09 +0300 shade 8156803: Turn StressLCM/StressGCM flags to diagnostic
Tue, 21 Jun 2016 13:15:56 -0400 adinn 8160006: Fix AArch64 after changes made by 8151661
Tue, 21 Jun 2016 13:14:33 -0400 adinn 8151661: Performance regression on Solaris-SPARC in 9-b103
Mon, 20 Jun 2016 13:06:33 +0200 psandoz 8158039: VarHandle float/double field/array access should support CAS/set/add atomics
Mon, 20 Jun 2016 08:11:22 -0400 cvarming 8159720: Failure of C2 compilation with tiered prevents some C1 compilations.
Wed, 15 Jun 2016 09:46:15 +0200 rbackman 8139379: Tests fail with assert(nm->insts_contains(original_pc)) failed: original PC must be in nmethod
Mon, 20 Jun 2016 09:32:44 +0200 thartmann 8159715: Fix for 8072422 is incorrect
Thu, 16 Jun 2016 01:43:11 +0300 iignatyev 8159149: Several compiler tests fail with minimal VM
Wed, 15 Jun 2016 22:58:04 +0300 iignatyev 8158754: compilercontrol tests: RandomCommandsTest.java and RandomValidCommandsTest.java - fail in PIT
Mon, 13 Jun 2016 17:36:57 -0700 never 8159010: [JVMCI] crashes with class redefinition
Fri, 17 Jun 2016 16:50:49 +0000 gdub 8159236: [JVMCI] Window-saved SPARC registers should not be considered callee-save
Fri, 17 Jun 2016 11:31:24 +0200 simonis 8158260: PPC64: unaligned Unsafe.getInt can lead to the generation of illegal instructions
Thu, 16 Jun 2016 16:41:50 +0000 rschatz 8159167: [JVMCI] fix HotSpotVMConfig startup performance
Wed, 01 Jun 2016 09:13:10 +0300 iignatyev 8149043: Fix code indentation in test/compiler/stable tests
Wed, 15 Jun 2016 14:27:58 +0200 zmajo 8157181: Compilers accept modification of final fields outside initializer methods
Wed, 15 Jun 2016 13:47:17 +0200 mdoerr 8158232: PPC64: improve byte, int and long array copy stubs by using VSX instructions
Wed, 15 Jun 2016 11:21:36 +0300 shade 8157726: VarHandles/Unsafe should support sub-word atomic ops
Wed, 15 Jun 2016 07:58:56 +0200 thartmann 8159244: Partially initialized string object created by C2's string concat optimization may escape
Tue, 14 Jun 2016 18:07:41 -0700 dlong 8158360: C1: SEGV in generated code
Tue, 14 Jun 2016 15:10:05 -0700 dlong 8159282: quarantine compiler/jvmci/compilerToVM/ReprofileTest.java
Fri, 24 Jun 2016 16:21:57 +0000 dfazunen Merge
Fri, 24 Jun 2016 19:52:31 +0400 dfazunen 8160088: update hotspot tests depending on GC to use @requires vm.gc.X
Fri, 24 Jun 2016 12:08:32 +0300 ddmitriev 8160102: Typo in message for NULL memory size arguments in diagnosticArgument.cpp
Thu, 23 Jun 2016 17:11:18 -0700 amurillo Merge
Thu, 23 Jun 2016 16:46:41 -0400 kbarrett 8157758: JDK9 does not compile on Linux with GCC 6.1 because left-shifting a negative number has undefined behavior
Thu, 23 Jun 2016 16:27:34 +0000 aph 8160189: Fix for 8159335 breaks AArch64
Wed, 22 Jun 2016 14:03:01 +0200 ehelin 8155099: Remove duplicate comments from G1Policy
Wed, 22 Jun 2016 10:49:23 +0200 tschatzl Merge
Wed, 22 Jun 2016 10:34:01 +0200 tschatzl 8152438: Threads may do significant work out of the non-shared overflow buffer
Tue, 21 Jun 2016 15:02:45 +0200 ehelin 8159370: Add FlagGuard for easier modification of flags for unit tests
Tue, 21 Jun 2016 19:29:39 -0400 ysuenaga 8153743: AllocateHeap() and ReallocateHeap() should use ALWAYSINLINE macro
Tue, 21 Jun 2016 19:25:41 -0400 mdoerr 8155949: Support relaxed semantics in cmpxchg
Tue, 21 Jun 2016 18:37:04 +0400 dfazunen 8151283: Implement setting jtreg @requires property vm.isG1Supported.
Tue, 21 Jun 2016 12:09:36 +0200 redestad 8159590: Remove deprecated methods from jdk.internal.misc.VM
Tue, 21 Jun 2016 09:19:53 +0200 ysuenaga 8155730: HeapInfoDCmd should get Heap_lock
Mon, 20 Jun 2016 22:02:20 -0700 iklam 8159666: Better CDS support for Event-based tracing
Mon, 20 Jun 2016 17:38:14 +0000 coleenp Merge
Mon, 20 Jun 2016 12:28:14 -0400 coleenp 8159470: Error message for ICCE for MethodHandle constant pool not helpful
Mon, 20 Jun 2016 07:45:03 -0400 gtriantafill 8157592: StackTraceLogging fails with stack overflow on 32-bit Windows
Mon, 13 Jun 2016 13:52:38 +0200 ehelin 8159366: Header guards missing for unittest.hpp
Mon, 13 Jun 2016 13:54:46 +0200 ehelin 8159365: assert is not defined for unit tests
Mon, 13 Jun 2016 13:48:37 +0200 ehelin 8159364: Gtest unit tests does not support PCH
Mon, 13 Jun 2016 11:22:23 +0200 ehelin 8159340: Add extension to CompileGtest.gmk
Mon, 20 Jun 2016 00:07:51 -0400 ysuenaga 8156181: UL: File size limit on 32 bit Linux
Sun, 19 Jun 2016 20:14:37 -0400 coleenp Merge
Mon, 13 Jun 2016 09:28:25 +0200 goetz 8159335: Fix problems with stack overflow handling.
Thu, 07 Jul 2016 18:21:22 +0000 amurillo Added tag jdk-9+126 for changeset adc8c84b7cf8
Fri, 01 Jul 2016 11:29:55 +0200 clanger 8160565: AIX port: cleanup of libo4 wrapper stubjdk-9+126
Thu, 30 Jun 2016 22:38:45 +0000 amurillo Merge
Thu, 23 Jun 2016 17:07:27 -0700 amurillo Merge
Fri, 17 Jun 2016 19:04:09 +0000 dfazunen Merge
Fri, 17 Jun 2016 18:45:09 +0300 mchernov 8158412: [TESTBUG] TestIHOPErgo and TestStressG1Humongous should not be executed when JFR is enabled
Fri, 17 Jun 2016 15:06:47 +0000 rprotacio Merge
Fri, 17 Jun 2016 10:46:55 -0400 rprotacio 8153394: Add Unified Logging to make it easy to trace time taken in initPhase2
Fri, 17 Jun 2016 13:07:27 +0300 lmesnik 8157831: JVMCI tests should not be executed on linux-arm32
Thu, 16 Jun 2016 13:34:32 -0400 lfoltan 8156871: Possible concurrency issue with JVM_AddModuleExports
Wed, 15 Jun 2016 09:48:24 -0400 coleenp 8152271: MemberNameTable doesn't purge stale entries
Wed, 15 Jun 2016 12:44:20 +0200 pliden Merge
Wed, 15 Jun 2016 10:46:20 +0200 pliden 8159350: G1 String deduplication logging malformed
Wed, 15 Jun 2016 09:54:12 +0200 rehn 8154106: UL Xlog:help regd'g 'rt' tag
Wed, 15 Jun 2016 09:43:42 +0200 rehn 8149778: serviceability/tmtools/jstat/GcCapacityTest.java causes JVM to hang during GC
Tue, 14 Jun 2016 19:30:19 +0000 hseigel Merge
Tue, 14 Jun 2016 14:31:36 -0400 gtriantafill 8159328: [TESTBUG] ProblematicFrameTest.java throws an exception (due to trying to access Unsafe) but still passes
Tue, 14 Jun 2016 14:35:34 -0400 gtriantafill 8159255: [TESTBUG] XpatchJavaBase.java compilation failure
Tue, 14 Jun 2016 19:38:44 +0200 kzhaldyb Merge
Tue, 14 Jun 2016 19:15:27 +0300 kzhaldyb 8132713: Add tests which check that Humongous objects behave as expected after finishing ConcMark Cycle
Thu, 09 Jun 2016 15:17:18 +0200 goetz 8159156: [TESTBUG] ReserveMemory test is not useful on Aix.
Wed, 08 Jun 2016 13:24:36 +0200 ehelin 8159045: Remove const from methods returning size_t in threadLocalAllocBuffer.hpp
Mon, 13 Jun 2016 13:47:21 -0400 mockner 8157490: JCK test vm/jni/DefineClass/dfcl001/dfcl00101m1/dfcl00101m1 crashes when run with -Xlog:classload=info
Mon, 13 Jun 2016 14:00:26 +0000 coleenp Merge
Mon, 13 Jun 2016 09:02:47 -0400 coleenp 8158237: JVMTI hides critical debug information for memory leak tracing
Mon, 13 Jun 2016 11:48:11 +0200 mgronlun 8158033: Notify_tracing() misplaced for intended purpose
Mon, 13 Jun 2016 10:10:35 +0200 rehn 8072440: serviceability/dcmd/ tests timeout
Thu, 19 May 2016 14:53:18 -0700 jmasa 8157373: Active workers should not be reset in AbstractWorkGang initialize()
Sat, 11 Jun 2016 00:12:28 +0000 jmasa Merge
Fri, 10 Jun 2016 09:22:09 -0700 jmasa 8026752: Cancel MetaspaceGC request for a CMS concurrent collection after GC
Fri, 10 Jun 2016 15:19:32 -0700 amurillo Merge
Fri, 10 Jun 2016 20:28:46 +0200 kvn Merge
Fri, 10 Jun 2016 10:13:30 -0700 kvn Merge
Fri, 10 Jun 2016 02:43:53 +0000 dnsimon 8158351: [JVMCI] NoClassDefFoundError: jdk/vm/ci/runtime/JVMCI
Tue, 07 Jun 2016 10:17:28 +0000 enevill 8158913: aarch64: SEGV running Spark terasort
Tue, 07 Jun 2016 17:16:51 -0700 dnsimon 8158985: [JVMCI] access to HotSpotJVMCIRuntime.vmEventListeners must be thread safe
Tue, 07 Jun 2016 18:20:44 +0200 thartmann 8158228: C1 incorrectly folds mismatched loads from stable arrays
Tue, 07 Jun 2016 09:11:32 +0000 thartmann Merge
Mon, 06 Jun 2016 23:24:46 -0700 jcm 8146416: java.lang.OutOfMemoryError triggers: assert(current_bci == 0) failed: bci isn't zero for do_not_unlock_if_synchronized
Mon, 06 Jun 2016 16:31:03 -0700 dnsimon 8156587: [JVMCI] remove Unsafe.getJavaMirror and Unsafe.getKlassPointer
Mon, 06 Jun 2016 12:56:40 -0700 kvn Merge
Thu, 02 Jun 2016 17:52:42 +0000 dnsimon 8158000: [JVMCI] remove unused ParseClosure class
Thu, 02 Jun 2016 14:54:35 +0000 thartmann Merge
Thu, 02 Jun 2016 13:19:05 +0200 thartmann 8158214: Crash with "assert(VM_Version::supports_sse4_1()) failed" if UseSSE < 4 is set
Thu, 02 Jun 2016 21:12:46 +0800 fyang 8149418: AArch64: replace tst+br with tbz instruction when tst's constant operand is 2 power
Thu, 02 Jun 2016 08:46:52 +0200 thartmann 8156760: VM crashes if -XX:-ReduceInitialCardMarks is set
Wed, 01 Jun 2016 16:36:44 +0200 thartmann 8157842: indexOfChar intrinsic is not emitted on x86
Wed, 01 Jun 2016 14:22:18 +0200 thartmann 8155046: Parse::Block construction using undefined behavior
Tue, 31 May 2016 20:43:12 +0000 rschatz 8157428: [JVMCI] remove MemoryAccessProvider.readUnsafeConstant from API
Tue, 31 May 2016 17:51:42 +0000 never Merge
Tue, 31 May 2016 17:08:18 +0000 never 8157292: [JVMCI] add missing test files from 8156034
Tue, 31 May 2016 16:30:18 +0300 iignatyev 8153994: Compiler tests should be correctly marked with @module
Tue, 31 May 2016 16:29:45 +0300 iignatyev 8158184: remove shell from compiler/c2/7070134/Stemmer.java
Tue, 31 May 2016 16:29:45 +0300 iignatyev 8158185: jdk/test/lib/FileInstaller throws NPE if dst is in current directory
Tue, 31 May 2016 16:29:45 +0300 iignatyev 8158182: remove shell script from compiler/c2/6894807/IsInstanceTest.java
Tue, 31 May 2016 15:12:09 +0300 iignatyev 8073159: improve Test6857159.java
Tue, 31 May 2016 13:58:28 +0000 dpochepk Merge
Tue, 31 May 2016 15:48:47 +0300 dpochepk 8158065: [Jittester]: tests generation has tests generators hardcoded, blocking alternative tests generation
Tue, 31 May 2016 15:10:10 +0300 vlivanov Merge
Mon, 30 May 2016 15:04:03 +0300 vlivanov Merge
Fri, 27 May 2016 17:01:27 +0300 vlivanov Merge
Mon, 30 May 2016 23:33:00 +0300 iignatyev 8152376: [TESTBUG] compiler/floatingpoint/Test15FloatJNIArgs should use run main/othervm/native
Mon, 30 May 2016 23:32:59 +0300 iignatyev 8154123: remove commented action from jdk/vm/ci/runtime/test/ConstantTest.java
Mon, 23 May 2016 10:35:51 -0300 mdoerr 8154156: PPC64: improve array copy stubs by using vector instructions
Fri, 27 May 2016 17:12:10 +0300 iignatyev 8157821: [JITtester] OptionResolver and LiteralFactory use deprecated c-tors
Fri, 27 May 2016 17:12:09 +0300 iignatyev 8156469: [JITtester] Difference in generated golden output when run with Jigsaw build
Fri, 27 May 2016 20:38:38 +0800 fyang 8157906: aarch64: some more integer rotate instructions are never emitted
Fri, 27 May 2016 01:02:16 +0800 fyang 8156731: aarch64: java/util/Arrays/Correct.java fails due to _generic_arraycopy stub routine
Wed, 25 May 2016 09:28:20 -0700 jmasa 8157620: Guarantee in run_task(task, num_workers) fails
Fri, 10 Jun 2016 14:06:36 +0200 stefank 8159237: PreservedMarks verification code fails
Wed, 08 Jun 2016 16:07:49 +0200 goetz 8159056: [aix] Compressed class space not allocated in lower regions
Thu, 09 Jun 2016 16:52:32 +0300 lmesnik 8156032: Clean up parallel GC specific code from vm/gc/shared/preservedMarks.cpp
Wed, 08 Jun 2016 16:26:11 +0200 sjohanss 8157243: JMap heap test fail when used with external heap
Thu, 09 Jun 2016 13:24:44 +0200 sjohanss 8146530: [testbug] some tests fail because the compiler is using Java heap memory
Thu, 09 Jun 2016 00:53:07 +0200 jiangli Merge
Wed, 08 Jun 2016 18:47:05 -0400 jiangli 8158681: ClassLoader::classloader_type() is called from code not included under #if INCLUDE_CDS.
Wed, 08 Jun 2016 12:50:23 -0700 ccheung 8159019: ResourceMark in ClassLoader::open_versioned_entry() is being used incorrectly
Wed, 08 Jun 2016 18:09:04 +0200 mockner Merge
Tue, 07 Jun 2016 16:08:25 +0200 goetz 8158929: [TESTBUG] CommitOverlappingRegions.java can not deal with pages > 32K
Wed, 08 Jun 2016 16:29:12 +0200 sjohanss 8149085: IntegrationTest1.java fails intermittently due to use of semi-initialized TLAB
Wed, 08 Jun 2016 11:15:49 +0200 stefank 8155638: Resource allocated BitMaps are often cleared twice
Tue, 07 Jun 2016 15:34:22 -0400 coleenp 8158297: Lack of proper checking of non-well formed elements in CONSTANT_Utf8_info's structure
Tue, 07 Jun 2016 18:17:41 +0000 rprotacio Merge
Tue, 07 Jun 2016 11:39:47 -0400 rprotacio 8153858: Clean up needed when obtaining the package name from a fully qualified class name
Tue, 07 Jun 2016 19:05:37 +0200 erikj Merge
Tue, 07 Jun 2016 18:26:10 +0200 simonis 8158938: AIX: some more new hotspot build fixes
Tue, 07 Jun 2016 12:55:29 +0300 lmesnik 8154209: Remove client VM from default JIB profile on windows-x86 and linux-x86
Tue, 07 Jun 2016 00:57:23 +0000 ccheung Merge
Tue, 07 Jun 2016 00:06:17 +0000 ccheung Merge
Mon, 06 Jun 2016 12:51:53 -0700 ccheung 8153876: Replace 4K stack allocations with Resource allocations
Tue, 07 Jun 2016 01:58:33 +0200 mgronlun Merge
Mon, 06 Jun 2016 20:48:56 +0200 mgronlun 8149803: Adjust lock rankings for some Event-based tracing locks
Mon, 06 Jun 2016 22:34:57 +0300 shade 8075030: JvmtiEnv::GetObjectSize reports incorrect java.lang.Class instance size
Thu, 30 Jun 2016 22:10:08 +0000 amurillo Added tag jdk-9+125 for changeset bb640b49741a
Thu, 23 Jun 2016 21:12:55 +0000 lana Mergejdk-9+125
Tue, 24 May 2016 16:02:45 +0530 csahu 8150900: Implement diagnostic_pd
Thu, 23 Jun 2016 20:35:13 +0000 lana Added tag jdk-9+124 for changeset 479631362b49
Thu, 16 Jun 2016 20:57:05 +0000 lana Mergejdk-9+124
Fri, 10 Jun 2016 15:13:37 -0700 amurillo Merge
Fri, 03 Jun 2016 17:45:03 -0400 jiangli 8157189: 'iload_w' in shared class is not interpreted correctly.
Fri, 03 Jun 2016 13:26:43 -0500 gziemski 8155936: Boolean value should be set 1/0 or true/false via VM.set_flag jcmd
Fri, 03 Jun 2016 16:19:53 +0000 rprotacio Merge
Fri, 03 Jun 2016 11:53:55 -0400 rprotacio 8152404: Stabilize PackageEntry::package_exports_do
Fri, 03 Jun 2016 08:33:28 -0400 coleenp 8158397: Crash: assert(save_resolved_method == resolved_method()) failed: does this change?
Fri, 03 Jun 2016 04:34:08 +0000 dholmes Merge
Thu, 02 Jun 2016 23:37:09 -0400 dholmes 8154750: Add missing OrderAccess operations to ClassLoaderData lock-free data structures
Fri, 03 Jun 2016 05:38:08 +0200 mockner Merge
Thu, 02 Jun 2016 12:07:55 -0400 mockner 8138705: Kitchen sink stress test fails
Fri, 03 Jun 2016 01:31:01 +0000 amurillo Merge
Thu, 02 Jun 2016 15:07:51 -0700 amurillo Merge
Thu, 02 Jun 2016 23:57:07 +0000 coleenp Merge
Fri, 13 May 2016 15:22:48 +0200 goetz 8156923: [ppc] Implement "JEP 270: Reserved Stack Areas for Critical Sections".
Tue, 31 May 2016 20:31:08 +0300 mchernov 8157954: [TESTBUG] G1 tests fail with defined MaxGCPauseMillis
Thu, 02 Jun 2016 09:44:41 +0200 sjohanss 8152239: hotspot/test/gc/TestSmallHeap.java failed in jdk9
Thu, 16 Jun 2016 19:07:26 +0000 lana Added tag jdk-9+123 for changeset 75f81e1fecfb
Thu, 09 Jun 2016 17:28:36 +0000 lana Added tag jdk-9+122 for changeset af6b4ad908e7jdk-9+123
Mon, 06 Jun 2016 09:58:03 -0700 amurillo Mergejdk-9+122
Thu, 02 Jun 2016 14:58:50 -0700 amurillo Merge
Fri, 13 May 2016 15:20:06 +0200 goetz 8156922: [ppc] Implement template interpreter stack overflow checks as on x86/sparc.
Wed, 01 Jun 2016 11:14:58 -0400 hseigel 8156156: Add module specific NMT MemoryType
Wed, 01 Jun 2016 07:44:43 -0400 hseigel 8158060: BasicLayerTest causes fatal error: Thread holding lock at safepoint that vm can block on: Module_lock
Tue, 31 May 2016 15:21:56 -0400 ctornqvi 8158106: native/GTestWrapper.java gets SIGABR
Tue, 31 May 2016 17:09:45 +0200 rehn Merge
Tue, 31 May 2016 12:40:42 +0200 rehn 8158150: LogConfiguration::describe output can get truncated
Fri, 27 May 2016 12:57:38 +0200 sjohanss 8157153: TestStressRSetCoarsening fails with OOM
Mon, 30 May 2016 19:56:27 +0400 dfazunen 8154096: Extend WhiteBox API with methods which retrieve from VM information about available GC
Fri, 27 May 2016 17:48:56 +0300 mchernov 8157452: [TESTBUG] PLAB tests don't handle unexpected GC
Fri, 27 May 2016 19:43:58 +0000 asmotrak Merge
Fri, 27 May 2016 09:25:49 -0700 asmotrak 8152207: Perform array bound checks while getting a length of bytecode instructions
Fri, 27 May 2016 17:56:49 +0000 dsamersoff Merge
Fri, 27 May 2016 19:31:17 +0300 dsamersoff 8152950: BasicLauncherTest.java fails due to type error
Fri, 27 May 2016 16:39:49 +0000 coleenp Merge
Fri, 27 May 2016 14:57:11 +0000 coleenp Merge
Fri, 27 May 2016 10:52:39 -0400 coleenp 8145148: InterfaceMethod CP entry pointing to a class should cause ICCE
Fri, 27 May 2016 14:49:05 +0000 vlivanov Merge
Fri, 27 May 2016 16:56:23 +0300 vlivanov Merge