log

age author description
Mon, 02 Jun 2014 19:08:18 +0200 ctornqvi 8044364: runtime/RedefineFinalizer test fails on windows
Mon, 02 Jun 2014 09:30:08 -0700 rdurbin 8038132: jprt bundles have libjsig.dylib in different place on OSX
Mon, 02 Jun 2014 11:20:14 +0200 ykantser 8043915: Tests get ClassNotFoundException: com.oracle.java.testlibrary.StreamPumper
Sun, 01 Jun 2014 11:56:15 -0400 coleenp Merge
Fri, 30 May 2014 19:13:07 +0200 sla 8044398: Attach code should propagate errors in Diagnostic Commands as errors
Fri, 30 May 2014 07:20:51 -0700 dcubed 8036823: Stack trace sometimes shows 'locked' instead of 'waiting to lock'
Thu, 29 May 2014 08:58:51 -0400 lfoltan 8041623: Solaris Studio 12.4 C++ 5.13, CHECK_UNHANDLED_OOPS use of class oop's copy constructor definitions causing error level diagnostic.
Wed, 28 May 2014 22:59:29 +0200 ctornqvi 8043786: [TESTBUG] runtime/CommandLine/TestHexArguments.java test fails in nightly
Wed, 28 May 2014 15:03:36 +0000 dsamersoff Merge
Wed, 28 May 2014 07:36:32 -0700 dsamersoff 6904403: assert(f == k->has_finalizer(),"inconsistent has_finalizer") with debug VM
Wed, 28 May 2014 06:26:05 -0700 poonam 8043086: Hotspot is expected to report OOM which is occurred String.intern(), but crashes in JDK8u5
Tue, 27 May 2014 21:58:23 -0700 minqi 8043896: Error reporting for insufficient shared region size is incorrect
Fri, 13 Jun 2014 11:21:19 -0700 katleman Added tag jdk9-b18 for changeset 871fd1285484
Thu, 12 Jun 2014 18:42:33 +0000 tbell Mergejdk9-b18
Thu, 12 Jun 2014 18:09:29 +0000 tbell 8046474: Source changes needed to build JDK 9 with new platforms and compilers on Solaris and Linux
Thu, 12 Jun 2014 10:32:21 -0700 katleman Added tag jdk9-b17 for changeset 14b656df31c2
Thu, 05 Jun 2014 19:39:08 -0700 lana Mergejdk9-b17
Fri, 30 May 2014 13:46:02 -0700 amurillo Merge
Fri, 30 May 2014 10:07:19 -0700 twisti Merge
Fri, 30 May 2014 09:49:53 -0700 twisti Merge
Thu, 29 May 2014 09:41:07 +0000 vlivanov 8034935: JSR 292 support for PopFrame has a fragile coupling with DirectMethodHandle
Wed, 28 May 2014 07:59:23 -1000 iveresov 8044090: C1: Old value instead of new one is passed to post-barrier in UnsafeGetAndSetObject
Wed, 28 May 2014 14:42:00 +0400 iignatyev 8043899: compiler/5091921/Test7005594.java fails if specified -Xmx is less than 1600m
Tue, 27 May 2014 16:05:29 -0700 mikael 8043206: Fix signed vs. unsigned comparison warning in copy_sparc.hpp
Mon, 26 May 2014 19:05:01 +0400 iignatyev 8038924: Test bit-instructions fails with unexpected exit value on sparc
Mon, 26 May 2014 14:27:01 +0200 roland 8043638: Multiple compilation attempts break LogCompulation, lead to confusing PrintInlining output
Mon, 26 May 2014 10:48:58 +0200 roland 8042557: compiler/uncommontrap/TestSpecTrapClassUnloading.java fails with: GC triggered before VM initialization completed
Sat, 24 May 2014 00:04:21 +0400 iignatyev 8032970: Add stack size check methods to WhiteBox API
Fri, 23 May 2014 09:22:01 -0700 twisti Merge
Wed, 21 May 2014 11:25:25 +0200 neliasso 8031475: Missing oopmap in patching stubs
Thu, 29 May 2014 13:01:54 -0700 jmasa Merge
Mon, 26 May 2014 19:21:01 +0400 iignatyev 8040250: The test test/gc/parallelScavenge/TestDynShrinkHeap.java fails with OOME
Mon, 26 May 2014 09:31:43 +0200 tschatzl 8043723: max_heap_for_compressed_oops() declared with size_t, but defined with uintx
Tue, 27 May 2014 08:44:23 -0700 minqi 8038422: CDS test failed: assert((size % os::vm_allocation_granularity()) == 0) failed when limiting SharedMiscDataSize
Fri, 23 May 2014 21:34:49 +0000 coleenp Merge
Fri, 23 May 2014 16:54:01 -0400 coleenp 8043925: Fix typo in verifier.cpp
Fri, 23 May 2014 16:43:47 -0400 coleenp Merge
Thu, 22 May 2014 13:22:09 -0700 dsamersoff 8042155: [TESTBUG] Tests for stack guard pages have to be cleaned up
Thu, 22 May 2014 11:36:23 -0400 lfoltan 8043301: Duplicate definitions in vm/runtime/sharedRuntimeTrans.cpp versus math.h in VS2013
Thu, 22 May 2014 09:12:29 +0200 allwin 8027230: Overflow in java.lang.instrument.Instrumentation.getObjectSize() method
Wed, 21 May 2014 14:36:18 -0400 coleenp 8042727: nsk/jdb/unwatch/unwatch001 crash in InstanceKlass::methods_do(void (*)(Method*))
Wed, 04 Jun 2014 20:20:09 -0700 katleman Added tag jdk9-b16 for changeset b14e7c0b7d3e
Thu, 29 May 2014 22:32:04 -0700 katleman Added tag jdk9-b15 for changeset 170f6d733d7ajdk9-b16
Fri, 23 May 2014 10:28:09 -0700 jcoomes Mergejdk9-b15
Thu, 22 May 2014 16:26:05 -0700 twisti Merge
Wed, 21 May 2014 12:16:41 -0700 kvn 8043274: Test compiler/7184394/TestAESMain.java gets NPE on solaris
Thu, 08 May 2014 15:37:17 +0200 goetz 8042737: Introduce umbrella header prefetch.inline.hpp
Tue, 20 May 2014 09:35:05 +0200 adlertz 6883953: java -client -XX:ValueMapInitialSize=0 crashes
Mon, 19 May 2014 13:49:25 -0700 bharadwaj Merge
Mon, 19 May 2014 20:28:35 +0000 bharadwaj 6563994: assert(wf.check_method_context(ctxk, m), "proper context") failed
Mon, 19 May 2014 23:52:23 +0400 iignatyev 8032498: compiler/ciReplay tests fail with StatusError: failed to clean up files after test...
Fri, 16 May 2014 14:38:42 -0700 twisti Merge
Fri, 16 May 2014 14:35:37 -0700 twisti Merge
Fri, 16 May 2014 12:06:36 -0700 kvn Merge
Fri, 16 May 2014 12:05:14 -0700 kvn 8042786: Proper fix for 8032566
Mon, 27 Jan 2014 10:20:51 -0800 kvn 8032566: Crash in JIT when running Scala compiler (and compiling Scala std lib)
Thu, 15 May 2014 10:37:52 -0700 iveresov 8043180: SIGSEGV in Events::log_deopt_message
Thu, 15 May 2014 09:09:28 +0200 roland 8026694: New type profiling points break compilation replay
Thu, 22 May 2014 06:39:47 -0700 jmasa Merge
Wed, 21 May 2014 16:11:04 +0200 ehelin 8043639: Backout JDK-8034852: Shrinking of Metaspace high-water-mark causes incorrect OutOfMemoryErrors or back-to-back GCs
Tue, 20 May 2014 18:25:14 +0400 iignatyev 8039489: Refactor test framework for dynamic VM options
Tue, 20 May 2014 10:04:03 -0700 jcoomes 8042255: make gc src file exclusion more automatic
Tue, 20 May 2014 10:24:30 +0200 pliden 8039042: G1: Phantom zeros in cardtable
Mon, 19 May 2014 08:09:35 -0700 jmasa Merge
Wed, 14 May 2014 14:32:23 +0200 pliden 8040804: G1: Concurrent mark stuck in loop calling os::elapsedVTime()
Wed, 14 May 2014 13:32:44 +0200 pliden 8040803: G1: Concurrent mark hangs when mark stack overflows
Sun, 11 May 2014 16:35:43 -0700 jmasa 8038928: gc/g1/TestGCLogMessages.java fail with "[Evacuation Failure'
Fri, 09 May 2014 19:47:41 -0700 jmasa Merge
Fri, 09 May 2014 09:59:39 +0200 ehelin 8034852: Shrinking of Metaspace high-water-mark causes incorrect OutOfMemoryErrors or back-to-back GCs
Thu, 08 May 2014 10:29:17 +0200 brutisso 8042474: Clean up duplicated code in RSHashTable
Wed, 21 May 2014 19:08:08 +0000 coleenp Merge
Tue, 20 May 2014 20:35:39 +0200 sla 8043314: Fix for JDK-8041934 causes assert(is_interpreted_frame()) failed: interpreted frame expected
Sat, 17 May 2014 19:34:38 -0400 coleenp Merge
Sat, 17 May 2014 01:59:43 -0700 sspitsyn 8043264: hsdis library not picked up correctly on expected paths
Fri, 16 May 2014 15:05:44 -0700 sspitsyn 8042796: jvmtiRedefineClasses.cpp: guarantee(false) failed: OLD and/or OBSOLETE method(s) found
Thu, 15 May 2014 20:16:14 -0700 minqi 8042885: java does not take hexadecimal number as vm option
Thu, 15 May 2014 18:23:26 -0400 coleenp 8038212: Method::is_valid_method() check has performance regression impact for stackwalking
Thu, 15 May 2014 17:38:50 -0400 coleenp 8025580: Temporary flags: UseNewReflection and ReflectionWrapResolutionErrors
Thu, 15 May 2014 10:44:20 -0700 rdurbin 8028749: java -version crashes with 'fatal error: heap walk aborted with error 1'
Thu, 15 May 2014 09:25:27 -0400 lfoltan 8041918: BootstrapMethods attribute cannot be empty.
Wed, 14 May 2014 20:44:33 +0200 sla 8041934: com/sun/jdi/RepStep.java fails in RT_Baseline on all platforms with assert(_cur_stack_depth == count_frames()) failed: cur_stack_depth out of sync
Wed, 14 May 2014 22:54:45 -0400 drchase 8043164: Format warning in traceStream.hpp
Wed, 14 May 2014 18:18:58 +0200 ctornqvi 8042595: [TESTBUG] runtime/7110720/Test7110720.sh rarely fails with message "explicit compiler command file not read"
Wed, 14 May 2014 10:38:40 -0400 mseledtsov 8041938: [TESTBUG] runtime/SharedArchiveFile/CdsWriteError.java failed in RT_Baseline with 'Unable to create shared archive file' missing from stdout/stderr
Wed, 21 May 2014 10:54:59 -0700 rasbold 8043354: 8043354: Make is_return_allocated() respect allocated objects than can method-escape
Thu, 22 May 2014 14:38:34 -0700 lana Merge
Fri, 16 May 2014 02:13:12 -0700 amurillo Merge
Thu, 15 May 2014 11:35:26 -0700 twisti Merge
Wed, 14 May 2014 14:28:09 -0700 iveresov 8043063: Code aging should allocate MethodCounters when flushing a method
Wed, 14 May 2014 12:09:13 -0400 simonis 8043029: Change 8037816 breaks HS build with older GCC versions which don't support diagnostic pragmas
Tue, 11 Mar 2014 15:06:34 +0400 vlivanov 8023461: Thread holding lock at safepoint that vm can block on: MethodCompileQueue_lock
Tue, 13 May 2014 11:32:10 -0700 iveresov 8032463: VirtualDispatch test timeout with DeoptimizeALot
Tue, 13 May 2014 11:25:17 +0200 anoll 8021770: BackEdgeThreshold option is no longer used and should be removed
Mon, 12 May 2014 17:01:57 -0700 twisti Merge
Fri, 09 May 2014 09:12:39 +0200 anoll 8029343: CodeCache::allocate increments '_number_of_blobs' even if allocation fails.
Thu, 08 May 2014 15:16:49 -0700 twisti Merge
Thu, 08 May 2014 12:49:21 +0200 anoll 8042431: compiler/7200264/TestIntVect.java fails with: Test Failed: AddVI 0 < 4
Mon, 12 May 2014 20:25:53 -0400 dholmes Merge
Mon, 12 May 2014 20:20:19 -0400 dholmes 8032551: Remove UsePPCLWSYNC from globals.hpp
Mon, 12 May 2014 18:45:09 +0000 ctornqvi Merge
Mon, 12 May 2014 06:17:05 -0700 mikael 8042804: Support invoking Hotspot tests from top level
Mon, 12 May 2014 13:12:30 -0400 hseigel 8040292: Annotation attributes must not appear more than once
Mon, 12 May 2014 15:50:20 +0000 lfoltan Merge
Mon, 12 May 2014 09:59:56 -0400 simonis 8039805: Fix the signature of the global new/delete operators in allocation.cpp.
Mon, 12 May 2014 09:47:57 -0400 coleenp Merge
Fri, 09 May 2014 17:06:52 +0200 ctornqvi 8042726: [TESTBUG] TEST.groups file was not updated after runtime/6925573/SortMethodsTest.java removal
Fri, 09 May 2014 17:06:17 +0200 ctornqvi 8042471: Unable to build JDK 9 Hotspot within VS2010
Wed, 07 May 2014 14:16:45 -0500 gziemski 8038654: Separate SymbolTable and StringTable code
Wed, 07 May 2014 06:03:31 -0700 zgu 8041415: remove port.{cpp,hpp} files
Fri, 09 May 2014 16:50:54 -0400 drchase 8037816: Fix for 8036122 breaks build with Xcode5/clang
Thu, 22 May 2014 12:53:50 -0700 katleman Added tag jdk9-b14 for changeset bd333491bb6c
Thu, 15 May 2014 10:40:38 -0700 lana Mergejdk9-b14
Fri, 09 May 2014 08:34:22 -0700 amurillo Merge
Thu, 08 May 2014 18:22:22 -0700 jmasa Merge
Wed, 19 Mar 2014 17:04:28 +0100 ehelin 8034094: SA agent can't compile when jni_x86.h is used
Tue, 06 May 2014 09:41:04 +0200 tschatzl 8026784: Error message in AdaptiveFreeList<Chunk>::verify_stats is wrong
Fri, 02 May 2014 21:10:31 +0000 jwilhelm Merge
Tue, 29 Apr 2014 22:57:19 +0200 jwilhelm 8027643: Merge GenCollectorPolicy and TwoGenerationCollectorPolicy
Thu, 08 May 2014 15:08:45 -0700 twisti Merge
Tue, 29 Apr 2014 15:17:27 +0200 goetz 8042195: Introduce umbrella header orderAccess.inline.hpp.
Wed, 07 May 2014 22:06:42 +0200 anoll 8042570: Excessive number of tests timing out on nightly testing due to fix for 8040798
Fri, 02 May 2014 14:53:06 +0200 goetz 8042309: Some bugfixes for the ppc64 port.
Tue, 06 May 2014 13:08:28 +0200 anoll 8042443: Fix C++-Interpreter after "8036956: remove EnableInvokeDynamic flag"
Tue, 06 May 2014 08:01:14 +0000 anoll Merge
Tue, 06 May 2014 09:52:38 +0200 anoll 8042428: CompileQueue::free_all() code is incorrect
Tue, 06 May 2014 09:17:57 +0200 anoll 8036851: volatile double accesses are not explicitly atomic in C2
Mon, 05 May 2014 15:10:43 +0200 anoll 8042052: assert(t != NULL) failed: must set before get
Fri, 02 May 2014 19:10:24 -0700 twisti Merge
Fri, 02 May 2014 16:44:54 -0700 kvn 8039298: assert(base == NULL || t_adr->isa_rawptr() || !phase->type(base)->higher_equal(TypePtr::NULL_PTR))
Fri, 02 May 2014 09:30:17 +0000 iignatyev Merge
Fri, 02 May 2014 13:20:42 +0400 iignatyev 8042214: add @ignore tag to all excluded jtreg tests in test/compiler
Thu, 01 May 2014 21:30:54 -0700 anoll Merge
Fri, 02 May 2014 06:24:39 +0200 anoll 8041992: Fix of JDK-8034775 neglects to account for non-JIT VMs
Wed, 07 May 2014 18:19:31 -0400 coleenp Merge
Tue, 06 May 2014 09:56:55 -0400 lfoltan 8041620: Solaris Studio 12.4 C++ 5.13 change in behavior for placing friend declarations within surrounding scope.
Tue, 06 May 2014 08:59:57 -0400 lfoltan 8041627: Solaris Studio 12.4 C++ 5.13 compilation error due to lack of "surplus" prototype for binaryTreeDictionary.cpp.
Mon, 05 May 2014 19:53:00 -0400 coleenp 8023697: failed class resolution reports different class name in detail message for the first and subsequent times
Mon, 05 May 2014 20:17:19 +0200 sla 8031126: java/lang/management/ThreadMXBean/ThreadUserTime.java fails intermittently
Fri, 02 May 2014 11:06:26 -0700 dcubed Merge
Thu, 01 May 2014 05:52:28 -0700 zgu 6885993: Named Thread: introduce print() and print_on(outputStream* st) methods
Fri, 02 May 2014 19:00:04 -0700 twisti Merge
Thu, 01 May 2014 17:57:29 -0700 kvn 8042281: compiler/7184394/TestAESMain.java fails with: javax.crypto.IllegalBlockSizeException: Input length not multiple of 16 bytes
Wed, 30 Apr 2014 14:14:01 -0700 kvn 8035936: SIGBUS in StubRoutines::aesencryptBlock, solaris-sparc
Tue, 29 Apr 2014 22:05:10 -0700 mikael 8042059: Various fixes to linux/sparc
Tue, 29 Apr 2014 22:04:09 -0700 mikael 8022070: Compilation error in stubGenerator_sparc.cpp with some compilers
Tue, 29 Apr 2014 12:20:53 -0700 kvn 8041957: -XX:UseAVX=0 cause assert(UseAVX) failed
Tue, 29 Apr 2014 10:29:56 -0700 kvn 8041959: Skip replay parsing errors with ReplayIgnoreInitErrors
Tue, 29 Apr 2014 07:14:46 +0000 anoll Merge
Tue, 29 Apr 2014 08:08:44 +0200 anoll 8036956: remove EnableInvokeDynamic flag
Tue, 29 Apr 2014 07:59:22 +0200 anoll 8040798: compiler/startup/SmallCodeCacheStartup.java timed out in RT_Baseline
Mon, 28 Apr 2014 16:05:12 -0700 morris 8040919: Uninitialised memory in hotspot/src/share/vm/compiler/oopMap.cpp
Mon, 28 Apr 2014 15:09:39 -0400 drchase 8039407: Regression test needed for JDK-8015396
Mon, 28 Apr 2014 14:34:12 +0200 anoll 8041771: C1: remove unused IR::_locals_size
Mon, 28 Apr 2014 03:44:35 -0700 anoll Merge
Mon, 28 Apr 2014 12:39:12 +0200 anoll 8040085: dtrace/jsdt tests crash on solaris. found an unadvertised bad scavengable oop in the code cache
Fri, 25 Apr 2014 14:29:47 -0400 bharadwaj Merge
Fri, 25 Apr 2014 12:48:34 +0200 adlertz 8029302: Performance regression in Math.pow intrinsic
Fri, 25 Apr 2014 09:22:16 +0200 roland 8041481: JVM crashes with collect_args_for_profiling
Thu, 24 Apr 2014 10:32:49 +0000 iignatyev Merge
Thu, 24 Apr 2014 14:02:48 +0400 iignatyev 8041497: Compilation of compiler/rtm/cli/TestUseRTMDeoptOption* tests failed
Thu, 24 Apr 2014 11:05:07 +0200 roland 8039960: Unexpected exit from test compiler/profiling/spectrapredefineclass/Launcher.java
Thu, 24 Apr 2014 09:47:34 +0200 anoll 8041468: Field nmethod::_lock_count should be declared volatile
Thu, 15 May 2014 10:25:40 -0700 katleman Added tag jdk9-b13 for changeset 456ad9c99133
Thu, 08 May 2014 15:26:57 -0700 lana Mergejdk9-b13
Fri, 02 May 2014 09:52:17 -0700 amurillo Merge
Wed, 30 Apr 2014 14:43:00 -0700 jmasa Merge
Tue, 29 Apr 2014 09:33:20 +0200 brutisso 7132678: G1: verify that the marking bitmaps have no marks for objects over TAMS
Mon, 28 Apr 2014 09:31:25 +0000 sla Merge
Mon, 28 Apr 2014 09:27:47 +0200 sla 8041980: (hotspot) sun/jvmstat/monitor/MonitoredVm/CR6672135.java failing on all platforms
Sun, 27 Apr 2014 18:57:56 +0200 allwin Merge
Fri, 25 Apr 2014 10:08:04 +0200 mgronlun 8041723: Event Based tracing ids to be reassigned for CDS klasses
Fri, 25 Apr 2014 07:40:33 +0200 sla 8040140: System.nanoTime() is slow and non-monotonic on OS X
Thu, 24 Apr 2014 14:06:40 -0700 amurillo 8030011: Update Hotspot version string output
Thu, 03 Apr 2014 14:54:42 +0200 mgerdin 6664815: Eliminate redundant memcpy operation in jni_GetStringUTFRegion
Thu, 24 Apr 2014 00:46:17 +0200 ctornqvi 8033405: metaspace/stressHierarchy/stressHierarchy005 hangs in atexit handler
Thu, 08 May 2014 01:05:13 -0700 katleman Added tag jdk9-b12 for changeset 1c383bb39e28
Thu, 01 May 2014 14:20:19 -0700 lana Mergejdk9-b12
Fri, 25 Apr 2014 09:59:44 -0700 amurillo Merge
Fri, 25 Apr 2014 15:50:13 +0200 ehelin Merge
Wed, 23 Apr 2014 12:37:36 +0200 brutisso 8038265: CMS: enable time based triggering of concurrent cycles
Wed, 23 Apr 2014 10:12:34 +0200 ehelin Merge
Tue, 22 Apr 2014 11:10:12 +0200 tschatzl 8040792: G1: Memory usage calculation uses sizeof(this) instead of sizeof(classname)
Thu, 17 Apr 2014 18:47:15 +0200 pliden 8040245: G1: VM hangs during shutdown
Thu, 17 Apr 2014 15:57:02 +0200 brutisso 8040722: G1: Clean up usages of heap_region_containing
Wed, 16 Apr 2014 16:47:02 +0200 tschatzl 8040002: Clean up code and code duplication in re-diryting cards for verification
Wed, 16 Apr 2014 16:46:58 +0200 tschatzl 8019342: G1: High "Other" time most likely due to card redirtying
Wed, 16 Apr 2014 11:05:37 +0200 tschatzl 8028710: G1 does not retire allocation buffers after reference processing work
Wed, 16 Apr 2014 10:56:17 +0200 tschatzl 8039596: Remove HeapRegionRemSet::clear_incoming_entry
Wed, 16 Apr 2014 10:55:58 +0200 tschatzl 8037344: Use the "next" field to iterate over fine remembered instead of using the hash table
Wed, 16 Apr 2014 10:55:26 +0200 tschatzl 8027553: Change the in_cset_fast_test functionality to use the G1BiasedArray abstraction
Wed, 16 Apr 2014 10:14:50 +0200 tschatzl 8038930: G1CodeRootSet::test fails with assert(_num_chunks_handed_out == 0) failed: No elements must have been handed out yet
Tue, 15 Apr 2014 20:46:23 +0200 stefank 8039957: Replace the last few %p usages with PTR_FORMAT in the GC code
Tue, 15 Apr 2014 18:09:53 +0200 jwilhelm 8037925: CMM Testing: an allocated humongous object at the end of the heap should not prevents shrinking the heap
Mon, 14 Apr 2014 10:08:10 +0200 ehelin Merge
Fri, 11 Apr 2014 18:28:39 +0200 jwilhelm 8037924: CMM Testing: Check Min/MaxHeapFreeRatio flags allows to shrink the heap when using ParallelGC
Fri, 11 Apr 2014 12:29:24 +0200 pliden 8039147: Cleanup SuspendibleThreadSet
Fri, 11 Apr 2014 11:00:12 +0200 pliden 8037112: gc/g1/TestHumongousAllocInitialMark.java caused SIGSEGV
Wed, 09 Apr 2014 13:54:32 +0200 stefank 8039743: Use correct format specifier to print size_t values and pointers in the GC code
Thu, 24 Apr 2014 17:20:29 -0400 bharadwaj Merge
Tue, 22 Apr 2014 17:45:56 -0700 kvn 8041351: Crash in src/share/vm/opto/loopnode.cpp:3215 - assert(!had_error) failed: bad dominance
Fri, 18 Apr 2014 14:30:58 -0400 bharadwaj Merge
Fri, 18 Apr 2014 14:25:21 +0200 roland 8039975: SIGSEGV in MethodData::next_data(ProfileData*)
Fri, 18 Apr 2014 10:55:41 -0700 dcubed Merge
Fri, 18 Apr 2014 08:51:34 -0400 hseigel 8040018: Remove bad assert in ClassFileParser.cpp
Fri, 18 Apr 2014 00:19:24 +0200 ctornqvi 8040887: [TESTBUG] Remove test/runtime/6925573/SortMethodsTest.java
Thu, 17 Apr 2014 00:03:58 +0200 ctornqvi 6959423: [TESTBUG] runtime/6925573/SortMethodsTest.java times out
Thu, 01 May 2014 12:50:03 -0700 katleman Added tag jdk9-b11 for changeset 783309c3a1a6
Thu, 24 Apr 2014 16:03:50 -0700 lana Mergejdk9-b11
Fri, 18 Apr 2014 10:30:13 -0700 amurillo Merge
Thu, 17 Apr 2014 13:50:26 -0400 bharadwaj Merge
Thu, 17 Apr 2014 18:54:09 +0400 iignatyev 8039260: c.o.j.t.ProcessTools::createJavaProcessBuilder(boolean, String... ) must also take TestJavaOptions
Wed, 16 Apr 2014 14:49:03 -0700 kvn 8038048: assert(null_obj->escape_state() == PointsToNode::NoEscape,etc) runThese -full
Tue, 15 Apr 2014 14:34:48 -0700 kvn 8039050: Crash in C2 compiler at Node::rematerialize
Tue, 15 Apr 2014 02:27:34 -0700 roland Merge
Tue, 01 Apr 2014 09:36:49 +0200 roland 8032410: compiler/uncommontrap/TestStackBangRbp.java times out on Solaris-Sparc V9
Tue, 15 Apr 2014 12:21:24 +0400 iignatyev 8040001: CLI test on RTMRetryCount option was missed from fix for 8039496
Mon, 14 Apr 2014 09:04:36 +0000 anoll Merge
Mon, 14 Apr 2014 10:57:07 +0200 anoll 8039425: Code cleanup: PhaseIterGVN::optimize()
Sun, 13 Apr 2014 23:39:22 -0700 anoll Merge
Mon, 14 Apr 2014 08:24:28 +0200 anoll 8029436: CICompilerCount is not updated when the number of compiler threads is adjusted to the number of CPUs
Fri, 11 Apr 2014 15:08:40 -0400 bharadwaj Merge
Fri, 11 Apr 2014 18:46:35 +0400 iignatyev 8038418: New tests development for type profiling and speculation
Fri, 11 Apr 2014 13:52:51 +0200 anoll 8039498: Add iterators to GrowableArray
Fri, 11 Apr 2014 11:33:00 +0200 anoll 8034216: assert(false) failed: infinite loop in PhaseIterGVN::optimize
Thu, 10 Apr 2014 23:15:13 -0700 iveresov 8038297: Avoid placing CTI immediately following cbcond instruction on T4
Fri, 11 Apr 2014 00:35:28 +0400 iignatyev 8039496: Add sanity tests on RTM-related command line options
Fri, 11 Apr 2014 00:35:23 +0400 iignatyev 8037860: Add tests to cover Intel RTM instructions support
Fri, 11 Apr 2014 00:35:11 +0400 iignatyev 8039499: Add all common classes used by tests on RTM support to testlibrary
Fri, 11 Apr 2014 00:34:56 +0400 iignatyev 8039497: Testlibrary should be updated to provide information about all VM types as well as access to Unsafe
Fri, 11 Apr 2014 00:34:51 +0400 iignatyev 8038953: Add sanity tests for BMI1 and LZCNT instructions
Thu, 10 Apr 2014 11:38:12 +0200 roland 8005079: fix LogCompilation for incremental inlining
Thu, 10 Apr 2014 09:26:24 +0200 anoll 8036898: assert(t != NULL) failed: must set before get
Tue, 15 Apr 2014 19:03:51 +0200 ctornqvi 8035173: [TESTBUG] runtime/threads/CancellableThreadTest fails with OOM on windows-i586
Mon, 14 Apr 2014 14:27:45 -0400 lfoltan 8033150: invokestatic: IncompatibleClassChangeError trying to invoke static method from a parent in presence of conflicting defaults.
Mon, 14 Apr 2014 10:13:03 -0400 lfoltan 8038076: constraint on multianewarray instruction is not checked since class version 50.
Mon, 14 Apr 2014 11:23:06 +0200 dsimms 8039947: Dtrace return probe name for jni_SetStaticBooleanField named incorrectly
Mon, 14 Apr 2014 10:43:04 +0200 allwin Merge
Fri, 11 Apr 2014 20:02:37 +0000 coleenp 8039904: dtrace/hotspot/Monitors/Monitors001 fails with "assert(s > 0) failed: Bad size calculated"
Thu, 10 Apr 2014 21:36:56 -0400 dholmes 8039891: Remove ppcsflt builds from JPRT
Wed, 09 Apr 2014 15:01:24 +0000 dsamersoff Merge
Wed, 09 Apr 2014 07:08:08 -0700 dsamersoff 8029139: [TESTBUG] runtime/InitialThreadOverflow/testme.sh fails with exit code 127
Wed, 09 Apr 2014 06:09:43 -0700 dsamersoff 8037279: runtime/6929067/Test6929067.sh crashes on 32bit linux
Thu, 24 Apr 2014 12:21:02 -0700 katleman Added tag jdk9-b10 for changeset ebc44d040cd1
Thu, 17 Apr 2014 15:22:41 -0700 lana Mergejdk9-b10
Tue, 15 Apr 2014 15:37:36 -0700 amurillo Merge
Fri, 11 Apr 2014 11:39:04 -0700 amurillo Merge
Fri, 11 Apr 2014 13:04:59 +0200 allwin Merge
Tue, 08 Apr 2014 13:58:38 -0400 coleenp 8028497: SIGSEGV at ClassLoaderData::oops_do(OopClosure*, KlassClosure*, bool)
Tue, 08 Apr 2014 11:50:01 +0200 mgronlun 8039348: -XX:+TraceDeoptimization -XX:+Verbose -Xcomp can crash VM
Tue, 08 Apr 2014 08:14:14 +0200 sla 8038296: sun/tools/jinfo/Basic.sh: java.io.IOException: Command failed in target VM
Sat, 05 Apr 2014 20:59:37 +0000 dsamersoff Merge
Sat, 05 Apr 2014 05:55:05 -0700 dsamersoff Merge
Sat, 05 Apr 2014 21:33:11 +0200 mgronlun 8038624: interpretedVFrame::expressions() must respect InterpreterOopMap for liveness
Thu, 03 Apr 2014 06:39:26 -0400 fparain Merge
Thu, 03 Apr 2014 09:28:28 +0000 fparain 8038473: Remove support for old T1 libthread
Wed, 02 Apr 2014 18:40:52 +0200 kevinw 8033696: "assert(thread != NULL) failed: just checking" due to Thread::current() and JNI pthread interaction
Wed, 02 Apr 2014 16:08:59 +0100 kevinw 8026334: hs_err improvement: Print elapsed time in a humanly readable format
Wed, 02 Apr 2014 14:15:39 +0200 ctornqvi 8028733: [TESTBUG] Remove test exclusion for runtime/6626217/Test6626217.sh
Tue, 01 Apr 2014 22:39:09 +0200 ctornqvi 7049895: [TESTBUG] vmerrors.sh should suppress windows .mdmp files
Fri, 11 Apr 2014 10:31:25 +0200 ehelin Merge
Tue, 08 Apr 2014 13:50:58 +0200 ehelin Merge
Fri, 04 Apr 2014 09:46:10 +0200 stefank 8039244: Don't use UINT32_FORMAT and INT32_FORMAT when printing uints and ints in the GC code
Thu, 03 Apr 2014 16:20:16 +0200 jwilhelm 8039089: List verification enabled in product builds
Thu, 03 Apr 2014 11:21:33 -0700 kevinw Merge
Thu, 03 Apr 2014 17:49:31 +0400 vkempik 8016302: Change type of the number of GC workers to unsigned int (2)
Mon, 31 Mar 2014 17:09:38 +0200 ehelin 8038934: Remove prefix allocated_ from methods and variables in Metaspace
Wed, 26 Mar 2014 14:15:02 +0100 ehelin 8035667: EventMetaspaceSummary doesn't report committed Metaspace memory
Thu, 03 Apr 2014 10:39:27 +0200 pliden 8038461: Test gc/g1/TestStringDeduplicationMemoryUsage.java fails with unexpected memory usage
Wed, 19 Mar 2014 17:08:03 +0100 sjohanss 8029186: regression-hotspot nightly failure: assert(FLAG_IS_DEFAULT(MaxNewSize) || MaxNewSize < MaxHeapSize) failed
Thu, 10 Apr 2014 19:47:17 -0400 bharadwaj Merge
Wed, 09 Apr 2014 19:45:59 +0000 iignatyev Merge
Wed, 09 Apr 2014 22:37:37 +0400 iignatyev 8039597: WhiteBox :: clean type profiling data
Wed, 09 Apr 2014 11:18:02 -0700 kvn 8038939: Some options related to RTM locking optimization works inconsistently
Wed, 09 Apr 2014 09:17:43 +0200 roland 8007988: PrintInlining output is inconsistent with incremental inlining
Tue, 08 Apr 2014 09:51:25 +0200 roland 8038636: speculative traps break when classes are redefined
Thu, 03 Apr 2014 12:37:53 +0200 goetz 8039146: Fix 64-bit store to int JNIHandleBlock::_top
Fri, 04 Apr 2014 15:12:58 -0400 bharadwaj Merge
Fri, 04 Apr 2014 10:22:35 +0200 anoll 8024769: Remove unused code in sharedRuntime.cpp
Fri, 10 Jan 2014 15:58:40 +0100 dsimms 8029858: Enhance array copies
Thu, 20 Feb 2014 13:11:23 -0500 hseigel 8034926: Attribute classes properly
Thu, 17 Apr 2014 10:13:41 -0700 katleman Added tag jdk9-b09 for changeset 05e8f5242c26
Tue, 15 Apr 2014 12:13:17 -0700 katleman Added tag jdk9-b08 for changeset 4dedef5e51edjdk9-b09
Fri, 11 Apr 2014 11:23:30 -0700 amurillo Mergejdk9-b08
Fri, 04 Apr 2014 10:04:44 -0700 amurillo Merge
Fri, 04 Apr 2014 10:24:48 +0200 ehelin Merge
Wed, 02 Apr 2014 14:17:34 +0200 mgerdin 8037959: BitMap::resize frees old map before copying memory if !in_resource_area
Mon, 31 Mar 2014 14:02:40 +0200 ehelin 8033251: Use DWARF debug symbols for Linux 32-bit as default
Wed, 02 Apr 2014 09:17:38 +0200 goetz 8038498: Fix includes and C inlining after 8035330
Tue, 01 Apr 2014 15:37:15 +0200 ehelin Merge
Tue, 01 Apr 2014 07:46:51 +0200 brutisso 8038829: G1: More useful information in a few assert messages
Thu, 13 Feb 2014 10:05:03 +0100 sjohanss 8028498: runtime/SharedArchiveFile/CdsDifferentObjectAlignment.java asserts in RT_Baseline
Fri, 28 Mar 2014 14:15:03 +0100 stefank 8038630: Remove ExtendedOopClosure::prefetch_style()
Fri, 28 Mar 2014 14:03:11 +0100 stefank 8038628: Remove unused Closure::abort()
Wed, 12 Mar 2014 15:25:35 +0100 mgerdin 8038405: Clean up some virtual fucntions in Space class hierarchy
Wed, 12 Mar 2014 17:13:48 +0100 mgerdin 8038412: Move object_iterate_careful down from Space to ContigousSpace and CFLSpace
Wed, 12 Mar 2014 15:22:45 +0100 mgerdin 8038404: Move object_iterate_mem from Space to CMS since it is only ever used by CMS
Thu, 03 Apr 2014 17:05:19 -0400 bharadwaj Merge
Wed, 02 Apr 2014 13:37:45 -0700 kvn Merge
Wed, 02 Apr 2014 11:24:44 -0700 kvn 8036767: PPC64: Support for little endian execution model
Wed, 02 Apr 2014 12:27:57 -0700 iveresov Merge
Wed, 02 Apr 2014 11:24:51 -0700 iveresov 8039043: Implicit null check is in the wrong place in C1 -UseCompressedOops
Wed, 02 Apr 2014 10:16:46 +0200 goetz 8039045: PPC64: need include in adl generated files after 8001532
Tue, 01 Apr 2014 09:05:20 -0700 morris 8001532: C2 node files refactoring
Mon, 31 Mar 2014 13:08:03 -0700 kvn 8038633: crash in VM_Version::get_processor_features() on startup
Mon, 31 Mar 2014 10:35:06 +0200 roland 8037970: make PrintMethodData a diagnostic options
Mon, 31 Mar 2014 09:08:53 +0200 roland 8031755: Type speculation should be used to optimize explicit null checks
Sat, 29 Mar 2014 14:54:48 +0400 iignatyev 8038393: [TESTBUG] ciReplay/* tests fail after 8034775
Tue, 01 Apr 2014 15:45:36 +0200 mgronlun 8037295: Add size_t versions of Atomic::add, dec, and inc
Tue, 01 Apr 2014 03:59:01 -0700 goetz 8038201: Clean up misleading usage of malloc() in init_system_properties_values()
Mon, 31 Mar 2014 23:49:00 -0400 dholmes 8016039: jvm.lib is missing from export list unless building server
Mon, 31 Mar 2014 08:23:02 -0700 dsamersoff 7189721: nightly tests failed on JDI attaching
Sun, 30 Mar 2014 03:29:48 -0700 dsamersoff Merge
Tue, 11 Mar 2014 15:22:44 +0100 asiebenborn 8036666: VMTI GetObjectMonitorUsage does not return correct recursion count
Fri, 28 Mar 2014 21:04:37 -0700 minqi 7090324: gclog rotation via external tool
Thu, 27 Mar 2014 22:36:08 +0100 ctornqvi 8007890: [TESTBUG] JcmdWithNMTDisabled.java fails when invoked with NMT explicitly turned on
Wed, 26 Mar 2014 21:47:45 -0400 coleenp 8031820: NPG: Fix remaining references to metadata as oops in comments
Tue, 25 Mar 2014 09:26:18 -0400 mseledtsov 8032222: [TESTBUG] runtime/SharedArchiveFile/CdsWriteError.java fails on Mac OS with java.lang.RuntimeException
Wed, 09 Apr 2014 09:20:30 -0700 lana Merge
Tue, 01 Apr 2014 17:27:19 -0700 lana Merge
Fri, 28 Mar 2014 09:15:41 -0700 amurillo Merge
Fri, 28 Mar 2014 10:41:20 +0100 ehelin Merge
Wed, 26 Mar 2014 16:33:13 +0100 ehelin 8027924: gc/metaspace/CompressedClassSpaceSizeInJmapHeap.java fails with warning
Thu, 06 Mar 2014 09:08:18 +0100 mgerdin 8038399: Remove dead oop_iterate MemRegion variants from SharedHeap, Generation and Space classes
Wed, 19 Mar 2014 14:35:38 +0100 ehelin 8033580: Old debug information in IMPORT_JDK is not removed
Wed, 26 Mar 2014 12:49:34 +0100 tamao 6521376: MaxTenuringThreshold and AlwayTenure/NeverTenure consistency
Wed, 26 Mar 2014 10:54:52 +0100 mgerdin 8037958: ConcurrentMark::cleanup leaks BitMaps if VerifyDuringGC is enabled
Mon, 24 Mar 2014 11:25:32 +0100 ehelin Merge
Thu, 20 Mar 2014 15:03:18 +0100 stefank 8037952: Remove code duplication in Metaspace::deallocate
Thu, 27 Mar 2014 08:03:57 -0700 neliasso Merge
Thu, 27 Mar 2014 17:29:41 +0400 iignatyev 8038193: Add command line option tests for BMI options
Thu, 27 Mar 2014 14:15:42 +0100 neliasso Merge
Thu, 27 Mar 2014 11:17:26 +0400 iignatyev 8038240: new WB API to get nmethod
Tue, 25 Mar 2014 12:54:21 -0700 goetz 8037821: Account for trampoline stubs when estimating code buffer sizes
Mon, 24 Mar 2014 23:13:46 -0700 iveresov 8038222: Assembler::bsrl fails on assert when -UseCountLeadingZerosInstruction is used on CPU with LZCNT support
Mon, 24 Mar 2014 17:44:27 -0700 kvn 8038286: nm->set_rtm_state() should be called after (nm != NULL) check
Mon, 24 Mar 2014 08:43:10 -0700 poonam 6653795: C2 intrinsic for Unsafe.getAddress performs pointer sign extension on 32-bit systems
Fri, 21 Mar 2014 18:03:11 -0700 kvn 8038181: Can't build product VM without precompiled header
Sat, 22 Mar 2014 00:26:48 +0400 iignatyev 8035857: Add tests to verify correctness of operations with BMI1 and LZCNT instructions
Thu, 20 Mar 2014 11:03:06 +0100 goetz 8037915: PPC64/AIX: Several smaller fixes
Thu, 20 Mar 2014 17:49:27 -0700 kvn 8031320: Use Intel RTM instructions for locks
Wed, 19 Mar 2014 11:37:58 -0700 twisti 8031203: remove SafepointPollOffset
Tue, 18 Mar 2014 14:22:42 +0100 neliasso Merge
Mon, 17 Mar 2014 11:33:21 -0400 bharadwaj 8036576: jtreg failed on Test6792161 timed out
Fri, 14 Mar 2014 17:28:58 -0700 kvn 8037226: compiler/7196199/Test7196199.java fails on 32-bit linux with MaxVectorSize > 16
Thu, 13 Mar 2014 14:55:34 -0700 iveresov 8037140: C1: Incorrect argument type used for SharedRuntime::OSR_migration_end in LIRGenerator::do_Goto
Thu, 13 Mar 2014 14:55:10 -0700 iveresov 8037149: C1: getThreadTemp should return a T_LONG register on 64bit
Thu, 27 Mar 2014 03:14:45 -0700 dsamersoff Merge
Mon, 24 Mar 2014 11:51:40 -0700 amurillo 8038262: Workaround for ccache in vm.make is missing for aix
Mon, 24 Mar 2014 10:48:44 -0700 ccheung 8033566: [parfait] warning from b128 for hotspot/src/share/vm/runtime/frame.cpp: JNI primitive type mismatch
Sun, 23 Mar 2014 08:31:44 -0700 dsamersoff Merge
Thu, 20 Mar 2014 14:25:22 -0700 ccheung 8034034: [parfait] JNI exc. pending in hotspot/agent/src/os/bsd/MacosxDebuggerLocal.m
Thu, 20 Mar 2014 14:28:25 +0100 mgronlun 8037340: Linux semaphores to use CLOCK_REALTIME
Tue, 25 Mar 2014 17:33:16 -0400 jiangli Merge
Fri, 07 Feb 2014 14:47:04 -0500 bpittore Merge
Wed, 08 Jan 2014 20:23:16 -0500 bpittore 8027914: Client JVM silently exit with fail exit code when running in compact(1,2) with options -Dcom.sun.management and -XX:+ManagementServer
Tue, 25 Mar 2014 14:52:03 -0700 lana Merge
Fri, 21 Mar 2014 09:11:56 +0100 ehelin Merge
Thu, 20 Mar 2014 15:53:17 +0100 ehelin 8037962: metaspaceTracer.cpp misses a symbol
Tue, 18 Mar 2014 19:07:22 +0100 pliden 8029075: String deduplication in G1
Fri, 28 Feb 2014 15:27:09 +0100 jwilhelm 8036025: Sort the freelist in order to shrink the heap
Tue, 18 Mar 2014 09:03:28 +0100 ehelin 8036703: Add trace event with statistics for the metaspace chunk free lists
Tue, 18 Mar 2014 08:00:21 +0100 ehelin 8036701: Add trace event when a metaspace throws out of memory error
Tue, 18 Mar 2014 07:00:06 +0100 ehelin 8036699: Add trace event when a metaspace allocation fails
Tue, 18 Mar 2014 06:15:45 +0100 brutisso 8037495: Remove platform specific specification of SurvivorRatio for BSD
Mon, 17 Mar 2014 16:29:13 +0100 jwilhelm 8037510: CMM Testing: Check Min/MaxHeapFreeRatio flags allows to shrink the heap when using ParallelGC
Mon, 17 Mar 2014 20:59:19 +0100 ehelin 8036698: Add trace event for updates to metaspace gc threshold
Mon, 17 Mar 2014 17:31:46 +0100 ehelin 8036696: Add metaspace gc threshold to metaspace summary trace event
Mon, 17 Mar 2014 15:18:45 +0100 pliden 8036673: G1: Abort weak reference processing if mark stack overflows
Mon, 17 Mar 2014 15:18:38 +0100 pliden 8036672: G1: alloc_purpose in copy_to_survivor_space() used incorrectly
Mon, 17 Mar 2014 15:12:33 +0100 ehelin Merge
Mon, 17 Mar 2014 14:54:12 +0100 ehelin Merge
Mon, 17 Mar 2014 13:42:16 +0100 brutisso 8037407: G1: Remove heapRegionSets.cpp
Mon, 17 Mar 2014 13:07:55 +0100 tschatzl 8036860: Pad and cache-align the BiasedMappedArray
Mon, 17 Mar 2014 10:07:51 +0100 tschatzl 8035330: Remove G1ParScanPartialArrayClosure and G1ParScanHeapEvacClosure
Mon, 17 Mar 2014 10:13:55 +0100 tschatzl 8034868: Extract G1 From Card Cache into separate class
Mon, 17 Mar 2014 10:13:42 +0100 tschatzl 8035654: Add times for evacuation failure handling in "Other" time
Mon, 17 Mar 2014 10:13:27 +0100 tschatzl 8035398: Add card redirty time in "Other" time in G1
Mon, 17 Mar 2014 10:13:18 +0100 tschatzl 8027295: Free CSet takes ~50% of young pause time
Mon, 17 Mar 2014 10:12:47 +0100 tschatzl 8035815: Cache-align and pad the from card cache
Mon, 17 Mar 2014 10:12:21 +0100 tschatzl 8035406: Improve data structure for Code Cache remembered sets
Fri, 14 Mar 2014 10:15:46 +0100 brutisso 8034079: G1: Refactor the HeapRegionSet hierarchy
Wed, 19 Mar 2014 07:08:11 -0700 dcubed Merge
Tue, 18 Mar 2014 13:45:27 -0400 coleenp 8036630: Null ProtectionDomain in JVM can cause NPE because principals field is not initialized to an empty array
Mon, 17 Mar 2014 19:29:29 -0700 sspitsyn 6976636: JVM/TI test ex03t001 fails assertion
Mon, 17 Mar 2014 13:39:17 -0400 zgu 8025550: valgrind: Conditional jump depends on uninitialised value in Arena::set_size_in_bytes()
Sat, 15 Mar 2014 04:03:42 -0700 dsamersoff Merge
Fri, 14 Mar 2014 14:17:11 -0700 minqi 6536943: Bogus -Xcheck:jni warning for SIG_INT action for SIGINT in JVM started from non-interactive shell
Fri, 14 Mar 2014 12:02:54 +0000 fparain 8036128: Remove deprecated VM flag UseVMInterruptibleIO
Mon, 10 Mar 2014 14:50:20 -0400 mseledtsov 8026154: [TESTBUG] runtime/CDSCompressedKPtrs/XShareAuto.java failed due to exception
Tue, 18 Mar 2014 14:07:38 -0700 amurillo 8033926: Update hotspot/make/jprt.properties to use jdk 9 instead of jdk 8
Wed, 02 Apr 2014 21:59:51 -0700 katleman Added tag jdk9-b07 for changeset 52f7edf2589d
Thu, 27 Mar 2014 11:38:17 -0700 katleman Added tag jdk9-b06 for changeset 52377a30a3f8jdk9-b07
Tue, 25 Mar 2014 12:32:07 -0700 lana Mergejdk9-b06
Tue, 18 Mar 2014 17:49:11 -0700 lana Merge
Fri, 14 Mar 2014 10:31:11 -0700 amurillo Merge
Fri, 14 Mar 2014 13:27:18 +0100 ehelin Merge
Fri, 14 Mar 2014 09:18:39 +0100 ehelin Merge
Wed, 12 Mar 2014 13:02:47 +0100 ehelin Merge
Wed, 05 Mar 2014 07:34:35 -0800 jmasa 7098155: Resize young gen at full collections for UseParallelGC
Tue, 11 Mar 2014 15:14:46 +0100 ehelin Merge
Fri, 21 Feb 2014 09:48:52 +0100 sjohanss 8035057: NewSize ergonomics wrong when setting small or unaligned size on command line
Fri, 31 Jan 2014 13:38:01 +0100 jwilhelm 8023899: Typo in TraceCPUTime message
Fri, 14 Mar 2014 09:26:27 +0100 neliasso Merge
Mon, 10 Mar 2014 12:58:02 +0100 goetz 8036976: PPC64: implement the template interpreter
Wed, 12 Mar 2014 11:24:26 -0700 iveresov 8031321: Support Intel bit manipulation instructions
Tue, 11 Mar 2014 14:54:47 -0700 twisti 8037043: put Method flag bits in predictable positions
Tue, 11 Mar 2014 10:59:26 -0700 drchase Merge
Tue, 11 Mar 2014 13:38:32 -0400 drchase 8028037: [parfait] warnings from b114 for hotspot.src.share.vm
Tue, 11 Mar 2014 11:26:14 -0400 neliasso Merge
Mon, 10 Mar 2014 11:09:02 -0700 iveresov 8025644: java/util/stream/test/org/openjdk/tests/java/util/stream/ToArrayOpTest.java fails with TestData$OfRef): failure java.lang.AssertionError: expected [true] but found [false]
Fri, 07 Mar 2014 07:42:40 +0100 anoll 8029799: vm/mlvm/anonloader/stress/oome prints warning: CodeHeap: # of free blocks > 10000
Thu, 06 Mar 2014 14:35:26 +0100 simonis 8036777: AIX: Adapt implementation after '6546236: Thread interrupt() of Thread.sleep() can be lost on Solaris.'
Thu, 06 Mar 2014 11:12:45 -0800 kvn Merge
Thu, 06 Mar 2014 10:55:28 -0800 goetz 8035647: PPC64: Support for elf v2 abi.
Thu, 06 Mar 2014 09:53:14 -0800 vlivanov 8036667: "assert(adr->is_AddP() && adr->in(AddPNode::Offset)->is_Con()) failed: offset is a constant" with FoldStableValues on
Thu, 06 Mar 2014 02:37:44 -0800 roland Merge
Thu, 06 Mar 2014 11:11:04 +0100 roland 8032633: Enable type speculation by default
Thu, 06 Mar 2014 12:47:45 +0400 iignatyev 8027124: [TESTBUG] NonTieredLevelsTest: java.lang.RuntimeException: private TestCase$Helper(java.lang.Object) must be osr_compiled
Thu, 06 Mar 2014 12:46:04 +0400 iignatyev 8027257: [TESTBUG] compiler/ciReplay/TestVM.sh : Error: Could not find or load main class negative_test
Thu, 06 Mar 2014 12:45:59 +0400 iignatyev 8028482: [TESTBUG] tests that use JMX should be in need_compact3 test group
Wed, 05 Mar 2014 16:21:22 -0800 kvn 8035983: Fix "Native frames:" in crash report (hs_err file)
Wed, 05 Mar 2014 15:14:25 +0100 roland 8036146: make CPP interpreter build again
Wed, 05 Mar 2014 02:41:57 -0800 roland Merge
Wed, 05 Mar 2014 09:29:12 +0100 roland 8035841: assert(dp_src->tag() == dp_dst->tag()) failed: should be same tags 1 != 0 at ciMethodData.cpp:90
Wed, 05 Mar 2014 01:26:52 -0800 anoll Merge
Wed, 05 Mar 2014 10:20:30 +0100 anoll 8036091: compiler/membars/DekkerTest.java fails with -XX:CICompilerCount=1
Tue, 04 Mar 2014 21:15:33 -0800 anoll Merge
Wed, 05 Mar 2014 06:08:19 +0100 anoll 8036092: [TESTBUG] compiler/uncommontrap/TestSpecTrapClassUnloading.java fails with: Unrecognized VM option 'UseTypeSpeculation'
Tue, 04 Mar 2014 18:52:06 -0800 neugens 8036619: Shark: add LLVM 3.4 support
Tue, 04 Mar 2014 17:14:00 +0100 simonis 8036614: AIX: fix adjust-mflags.sh to build with GNU Make 4.0 (adapt 8028407 for AIX)
Tue, 04 Mar 2014 02:33:10 -0800 vlivanov 8036100: Default method returns true for a while, and then returns false
Tue, 04 Mar 2014 02:23:16 -0800 vlivanov 8025842: Convert warning("Thread holding lock at safepoint that vm can block on") to fatal(...)
Tue, 04 Mar 2014 02:20:41 -0800 vlivanov 8035828: Turn on @Stable support in VM
Tue, 04 Mar 2014 02:19:04 -0800 vlivanov 8035887: VM crashes trying to force inlining the recursive call
Mon, 03 Mar 2014 15:31:27 +0400 shade 8031818: Experimental VM flag for enforcing safe object construction
Mon, 03 Mar 2014 15:54:45 +0400 shade 8033380: Experimental VM flag to enforce access atomicity
Tue, 28 Jan 2014 15:05:46 +0100 neliasso 8007270: Make IsMethodCompilable test work with tiered
Mon, 03 Mar 2014 08:04:14 +0100 anoll 8035946: Use ResourceHashtable for dependency checking
Wed, 05 Mar 2014 12:31:09 -0500 mseledtsov 8033990: Add message to verbose output to indicate when JVM was unable to use shared archive (with -Xshare:auto)
Mon, 03 Mar 2014 11:54:35 +0100 goetz 8036122: Fix warning 'format not a string literal'
Tue, 04 Mar 2014 09:57:16 -0500 coleenp 8036547: test/runtime/CompressedOops/CompressedClassPointers.java fails with product build since -XX:+PrintMiscellaneous is a debug only flag
Tue, 11 Mar 2014 16:49:35 -0700 amurillo Merge
Mon, 03 Mar 2014 13:58:52 -0500 coleenp 8035735: Metaspace::contains become extremely slow in some cases
Sat, 01 Mar 2014 09:56:15 -0800 dsamersoff 8036102: part of the fix for 6498581 lost in mismerge
Sat, 01 Mar 2014 08:05:55 -0800 sspitsyn 6471769: Error: assert(_cur_stack_depth == count_frames(),"cur_stack_depth out of sync")
Sat, 01 Mar 2014 01:36:48 -0800 dsamersoff Merge
Fri, 28 Feb 2014 16:00:40 +0400 igerasim 8035893: JVM_GetVersionInfo fails to zero structure
Fri, 28 Feb 2014 14:30:25 +0400 sla 8036010: hs: Some jtreg tests use hard coded ports
Wed, 26 Feb 2014 15:20:41 -0800 minqi 6498581: ThreadInterruptTest3 produces wrong output on Windows
Wed, 26 Feb 2014 15:47:44 +0100 sla 8035150: ShouldNotReachHere() in ConstantPool::copy_entry_to
Thu, 20 Mar 2014 13:44:05 -0700 katleman Added tag jdk9-b05 for changeset bdc5311e1db7
Tue, 11 Mar 2014 15:41:45 -0700 katleman Added tag jdk9-b04 for changeset 3812c088b945jdk9-b05
Thu, 06 Mar 2014 10:37:26 -0800 lana Mergejdk9-b04
Fri, 28 Feb 2014 09:30:20 -0800 amurillo Merge
Fri, 28 Feb 2014 08:02:20 -0800 morris Merge
Fri, 28 Feb 2014 13:44:16 +0100 roland 8031754: Type speculation should favor profile data from outermost inlined method
Thu, 27 Feb 2014 20:40:24 +0100 goetz 8035970: PPC64: fix ad file after 8027754: Enable loop optimizations for loops with MathExact
Thu, 27 Feb 2014 09:37:16 +0100 roland 8032011: nsk/stress/jck60/jck60022 crashes in src\share\vm\runtime\synchronizer.cpp:239
Wed, 26 Feb 2014 16:45:15 -0800 iveresov 8035283: Second phase of branch shortening doesn't account for loop alignment
Wed, 26 Feb 2014 11:33:34 -0800 goetz 8035396: Introduce accessor for tmp_oop in frame.
Wed, 26 Feb 2014 02:54:49 -0800 anoll Merge
Wed, 26 Feb 2014 02:38:46 -0800 anoll Merge
Wed, 26 Feb 2014 11:29:47 +0100 anoll 8034839: jvm hangs with gc/gctests/LoadUnloadGC test
Tue, 11 Feb 2014 13:29:53 +0100 neliasso 8034188: OSR methods may not be recompiled at proper compilation level
Wed, 26 Feb 2014 07:46:46 +0100 adlertz 8010500: [parfait] Possible null pointer dereference at hotspot/src/share/vm/opto/loopnode.hpp
Wed, 26 Feb 2014 07:44:59 +0100 anoll 8032642: [TESTBUG] Fix testbugs in compiler/startup/.*
Tue, 25 Feb 2014 10:42:25 -0800 roland Merge
Tue, 25 Feb 2014 18:16:24 +0100 roland 8031752: Failed speculative optimizations should be reattempted when root of compilation is different
Tue, 25 Feb 2014 17:51:27 +0100 adlertz 8033260: assert(lrg._area >= 0.0) failed: negative spill area
Tue, 25 Feb 2014 14:09:02 +0100 adlertz 8032656: Tag the MachSpillCopies with purpose information
Tue, 25 Feb 2014 13:52:37 +0100 anoll 8034775: Failing to initialize VM when running with negative value for -XX:CICompilerCount
Tue, 25 Feb 2014 10:26:21 +0100 adlertz 8032894: Remove dead code in Pressure::lower
Thu, 23 Jan 2014 12:08:28 +0100 rbackman 8027754: Enable loop optimizations for loops with MathExact inside
Mon, 24 Feb 2014 15:12:26 -0800 kvn 8033805: Move Fast_Lock/Fast_Unlock code from .ad files to macroassembler
Fri, 28 Feb 2014 14:56:04 +0100 ehelin Merge
Thu, 27 Feb 2014 10:36:50 +0100 stefank 8035746: Add missing Klass::oop_is_instanceClassLoader() function
Thu, 27 Feb 2014 10:34:55 +0100 stefank 8035648: Don't use Handle in java_lang_String::print
Wed, 26 Feb 2014 14:52:42 +0100 jwilhelm 8035822: Unable to test minimalVM
Tue, 25 Feb 2014 11:02:11 +0100 ehelin Merge
Mon, 24 Feb 2014 10:45:15 +0100 tschatzl 8034948: Back out JDK-6976350 since it does not fix any issue
Mon, 24 Feb 2014 09:41:04 +0100 tschatzl 8035329: Move G1ParCopyClosure::copy_to_survivor_space into G1ParScanThreadState
Mon, 24 Feb 2014 09:40:49 +0100 tschatzl 8035326: Assume non-NULL references in G1CollectedHeap::in_cset_fast_test
Mon, 24 Feb 2014 09:40:21 +0100 tschatzl 8027559: Decrease code size and templatizing in G1ParCopyClosure::do_oop_work
Fri, 21 Feb 2014 10:19:09 +0100 stefank 8035412: Cleanup ClassLoaderData::is_alive
Fri, 21 Feb 2014 10:01:20 +0100 stefank 8035393: Use CLDClosure instead of CLDToOopClosure in frame::oops_interpreted_do
Mon, 24 Feb 2014 21:54:22 -0800 ccheung 8025519: [TESTBUG] runtime/7107135/Test7107135.sh need to use COMPILEJAVA for javac task
Mon, 24 Feb 2014 10:28:22 +0100 jbachorik 4505697: nsk/jdi/ExceptionEvent/_itself_/exevent006 and exevent008 tests fail with InvocationTargetException
Mon, 24 Feb 2014 13:29:14 +0100 mgronlun 8035650: Exclude AIX from VS.NET make/windows/projectcreator.make
Sun, 23 Feb 2014 22:36:19 -0800 sspitsyn 8034867: Object references from expression stack are not visible as roots via jvmti FollowReferences and HeapDump
Sun, 23 Feb 2014 13:16:03 -0500 hseigel Merge
Sat, 22 Feb 2014 10:22:05 +0100 mgronlun 8035493: JVMTI PopFrame capability must instruct compilers not to prune locals
Thu, 20 Feb 2014 16:38:45 -0500 gtriantafill 8034898: [TESTBUG]: Zero failure project - tag all Runtime JTReg bugs that fail nightly
Wed, 19 Feb 2014 16:22:15 +0000 fparain 6546236: Thread interrupt() of Thread.sleep() can be lost on Solaris due to race with signal handler
Wed, 19 Feb 2014 02:58:13 +0000 coleenp 7014526: "java -version" crash on sparc with some values of HeapBaseMinAddress
Tue, 25 Feb 2014 23:59:04 -0800 henryjen 8033898: undefined symbol when build hotspot with Xcode5
Fri, 21 Feb 2014 08:09:15 -0800 amurillo Merge
Fri, 21 Feb 2014 10:00:46 +0100 ehelin Merge
Mon, 17 Feb 2014 09:51:37 +0100 sjohanss 8033440: jmap reports unexpected used/free size of concurrent mark-sweep generation
Mon, 17 Feb 2014 10:13:28 +0100 ehelin Merge
Tue, 11 Feb 2014 09:34:50 +0100 goetz 8034171: Remove use of template template parameters from binaryTreeDictionary.
Fri, 14 Feb 2014 09:29:56 +0100 stefank 8034764: Use process_strong_roots to adjust the StringTable
Thu, 13 Feb 2014 17:44:39 +0100 stefank 8034761: Remove the do_code_roots parameter from process_strong_roots
Thu, 20 Feb 2014 12:20:56 -0800 kvn Merge
Thu, 20 Feb 2014 14:44:33 +0100 simonis 8035423: AIX: Fix os::get_default_process_handle() in os_aix.cpp after 8031968
Thu, 20 Feb 2014 11:05:12 +0100 goetz 8035394: PPC64: Make usage of intrinsic dsqrt depend on processor recognition.
Thu, 20 Feb 2014 10:48:57 +0100 goetz 8035392: cppInterpreter: fix message of NPE
Wed, 19 Feb 2014 14:03:09 -0800 goetz 8034797: AIX: Fix os::naked_short_sleep() in os_aix.cpp after 8028280
Wed, 19 Feb 2014 12:08:49 -0800 kvn Merge
Thu, 30 Jan 2014 14:30:01 +0100 goetz 8033168: PPC64: gcc 4.8 warning in output_c.cpp
Wed, 29 Jan 2014 12:22:13 +0100 goetz 8033117: PPC64: Adapt to 8002074: Support for AES on SPARC
Tue, 28 Jan 2014 12:28:17 -0800 kvn Merge
Tue, 28 Jan 2014 12:25:34 -0800 kvn Merge
Tue, 28 Jan 2014 10:19:45 -0800 kvn 8029941: rollback changes in make/jprt.properties for embedded testing
Fri, 24 Jan 2014 10:23:34 +0100 goetz 8032634: Add #ifdef PPC64 around OrderAccess operations on _thread_state.
Wed, 22 Jan 2014 14:27:18 -0800 kvn Merge
Thu, 16 Jan 2014 14:25:51 +0100 goetz 8029101: PPC64 (part 211): ordering of Independent Reads of Independent Writes
Tue, 07 Jan 2014 17:24:59 +0100 goetz 8031319: PPC64: Some fixes in ppc and aix coding.
Mon, 06 Jan 2014 11:02:21 +0100 goetz 8031188: Fix for 8029015: PPC64 (part 216): opto: trap based null and range checks
Fri, 20 Dec 2013 13:51:14 +0100 goetz 8030863: PPC64: (part 220): ConstantTableBase for calls between args and jvms
Wed, 08 Jan 2014 11:24:00 -0800 kvn Merge
Thu, 12 Dec 2013 11:05:39 -0800 kvn Merge
Wed, 11 Dec 2013 12:28:09 +0100 goetz 8029957: PPC64 (part 213): cppInterpreter: memory ordering for object initialization
Wed, 11 Dec 2013 00:06:11 +0100 goetz 8029940: PPC64 (part 122): C2 compiler port
Tue, 10 Dec 2013 14:29:43 +0100 goetz 8029888: PPC64: (part 219): adl replacement variable CondRegister
Mon, 02 Dec 2013 10:26:14 +0100 goetz 8029396: PPC64 (part 212): Several memory ordering fixes in C-code.
Thu, 05 Dec 2013 15:13:12 -0800 kvn Merge
Thu, 05 Dec 2013 19:19:09 +0100 simonis 8019929: PPC64 (part 107): Extend ELF-decoder to support PPC64 function descriptor tables
Wed, 27 Nov 2013 16:16:21 -0800 goetz 8029015: PPC64 (part 216): opto: trap based null and range checks
Tue, 26 Nov 2013 18:38:19 -0800 goetz 8028515: PPPC64 (part 113.2): opto: Introduce LoadFence/StoreFence.
Fri, 22 Nov 2013 12:14:09 -0800 goetz 8029025: PPC64 (part 203): opto: Move static _in_dump_cnt to Compile object.
Thu, 21 Nov 2013 19:00:57 -0800 goetz 8028767: PPC64: (part 121): smaller shared changes needed to build C2
Thu, 21 Nov 2013 18:29:34 -0800 goetz 8028471: PPC64 (part 215): opto: Extend ImplicitNullCheck optimization.
Thu, 21 Nov 2013 12:30:35 -0800 kvn Merge
Wed, 20 Nov 2013 11:08:09 -0800 goetz 8028580: PPC64 (part 114/120): Support for Call nodes with constants.
Tue, 19 Nov 2013 11:53:58 -0800 simonis 8028514: PPC64: Fix C++ Interpreter after '7195622: CheckUnhandledOops has limited usefulness now'
Sat, 16 Nov 2013 01:42:55 +0100 goetz 8028470: PPC64 (part 214): linux: extend signal handler to catch SIGTRAP on ppc64.
Fri, 15 Nov 2013 12:01:00 -0800 goetz 8028401: PPC (part 117): Improve usability of adlc and format() functionality.
Fri, 15 Nov 2013 14:09:26 -0500 kvn Merge
Fri, 15 Nov 2013 11:05:32 -0800 goetz 8024921: PPC64 (part 113): Extend Load and Store nodes to know about memory ordering
Thu, 14 Nov 2013 19:24:59 -0800 goetz 8003854: PPC64 (part 115): Introduce PostallocExpand that expands nodes after register allocation
Thu, 07 Nov 2013 11:47:11 +0100 goetz 8027968: Adapt PPC to 8024927: Nashorn performance regression with CompressedOops
Thu, 07 Nov 2013 11:51:53 +0100 goetz 8027969: Adapt PPC to 8026328: Setting a breakpoint on invokedynamic crashes the JVM
Thu, 07 Nov 2013 11:44:53 +0100 goetz 8027966: Adapt PPC to 8023657: New type profiling points: arguments to call
Thu, 07 Nov 2013 11:42:26 +0100 goetz 8027965: Adapt PPC to 8015107: NPG: Use consistent naming for metaspace concepts
Thu, 07 Nov 2013 11:40:38 +0100 goetz 8027964: Adapt PPC to 6843347: Boundary values in some public GC options cause crashes
Tue, 05 Nov 2013 17:38:04 -0800 kvn Merge
Wed, 16 Oct 2013 10:52:41 +0200 simonis 8026487: PPC64: Implement 'os::fork_and_exec' on AIX
Sun, 15 Sep 2013 15:28:58 +0200 goetz 8024468: PPC64 (part 201): cppInterpreter: implement bytecode profiling
Thu, 19 Sep 2013 17:31:42 +0200 goetz 8024922: PPC64 (part 116): Extend adlc to generate fields into nodes.
Wed, 18 Sep 2013 14:34:56 -0700 goetz 8024342: PPC64 (part 111): Support for C calling conventions that require 64-bit ints.
Fri, 13 Sep 2013 22:50:47 +0200 goetz 8024469: PPC64 (part 202): cppInterpreter: support for OSR.
Thu, 12 Sep 2013 13:51:13 -0700 goetz 8024344: PPC64 (part 112): C argument in register AND stack slot.
Fri, 06 Sep 2013 20:16:09 +0200 simonis 8023038: PPC64 (part 15): Platform files for AIX/PPC64 support
Fri, 06 Sep 2013 20:08:29 +0200 simonis 8023034: PPC64 (part 14): Implement AIX/PPC64 support in HotSpot makefiles
Fri, 06 Sep 2013 10:13:17 +0200 goetz 8024379: Adapt PPC64 port to 8003424
Thu, 05 Sep 2013 11:04:39 -0700 kvn Merge
Thu, 22 Aug 2013 09:39:54 -0700 goetz 8023033: PPC64 (part 13): basic changes for AIX
Fri, 26 Jul 2013 00:59:18 +0200 goetz 8020775: PPC64 (part 12): posix signal printing
Fri, 16 Aug 2013 16:23:01 -0700 kvn Merge
Fri, 02 Aug 2013 16:46:45 +0200 goetz 8019972: PPC64 (part 9): platform files for interpreter only VM.
Thu, 01 Aug 2013 17:25:10 -0700 kvn Merge
Fri, 26 Jul 2013 10:12:15 +0200 simonis 8019926: PPC64 (part 106): Make hsdis build and work on Linux/PPC64
Fri, 19 Jul 2013 13:32:53 -0700 kvn Merge
Thu, 11 Jul 2013 12:56:29 -0700 kvn Merge
Fri, 05 Jul 2013 22:17:47 +0200 goetz 8019973: PPC64 (part 11): Fix IA64 preprocessor conditionals on AIX.
Wed, 10 Jul 2013 09:14:25 -0700 simonis 8019922: PPC64 (part 8): Implement Linux/PPC64 support in HotSpot makefiles
Tue, 09 Jul 2013 14:28:07 +0200 goetz 8020121: PPC64: fix build in cppInterpreter after 8019519
Wed, 03 Jul 2013 11:25:06 +0200 goetz 8019519: PPC64 (part 105): C interpreter: implement support for jvmti early return.
Wed, 03 Jul 2013 01:41:42 +0200 goetz 8019518: PPC64 (part 103): cppInterpreter: implement support for compressed Oops
Wed, 03 Jul 2013 01:29:13 +0200 goetz 8019517: PPC64 (part 102): cppInterpreter: implement G1 support
Thu, 04 Jul 2013 10:51:31 +0200 goetz 8016696: PPC64 (part 4): add relocation for trampoline stubs
Wed, 03 Jul 2013 11:50:29 -0700 kvn Merge
Wed, 26 Jun 2013 16:06:38 +0200 goetz 8017317: PPC64 (part 7): cppInterpreter: implement support for biased locking
Mon, 24 Jun 2013 17:11:47 +0200 goetz 8017313: PPC64 (part 6): stack handling improvements
Thu, 27 Jun 2013 13:04:51 -0700 kvn Merge
Fri, 21 Jun 2013 15:56:24 -0700 kvn Merge
Thu, 20 Jun 2013 16:30:44 -0700 goetz 8016586: PPC64 (part 3): basic changes for PPC64
Wed, 19 Jun 2013 12:29:30 +0200 goetz 8016491: PPC64 (part 2): Clean up PPC defines.
Wed, 19 Jun 2013 12:15:50 +0200 goetz 8016476: PPC64 (part 1): reenable CORE build
Fri, 24 Jan 2014 13:06:52 +0100 adlertz 8031498: Cleanup and re-factorize PhaseChaitin::build_ifg_physical
Sun, 26 Jan 2014 23:01:57 -0800 anoll Merge
Mon, 27 Jan 2014 07:54:25 +0100 anoll 8009738: compiler/6826736/Test.java times out on big machines
Fri, 24 Jan 2014 13:30:55 -0800 kvn Merge
Fri, 24 Jan 2014 15:26:56 +0400 shade 8032490: Remove -XX:+-UseOldInlining
Fri, 24 Jan 2014 09:31:53 +0100 roland 8027422: assert(_gvn.type(obj)->higher_equal(tjp)) failed: cast_up is no longer needed
Tue, 18 Feb 2014 09:54:24 -0500 coleenp 8035132: [TESTBUG] test/runtime/lambda-features/InvokespecialInterface.java test has unrecognized option
Tue, 18 Feb 2014 06:19:49 -0800 sspitsyn 8034249: need more workarounds for suspend equivalent condition issue
Tue, 18 Feb 2014 09:15:40 +0100 sla 8034080: Remove the USDT1 dtrace code from Hotspot
Sat, 15 Feb 2014 14:41:04 -0500 hseigel Merge
Sat, 15 Feb 2014 13:03:38 -0500 coleenp 8027146: Class loading verification failure if GC occurs in Universe::flush_dependents_on
Fri, 14 Feb 2014 16:17:22 +0100 sjiang 8007710: runtime/7158988/FieldMonitor.java fails with com.sun.jdi.VMDisconnectedException: Connection closed
Fri, 14 Feb 2014 09:50:17 -0800 ccheung 8034860: Fatal error due to incorrect thread state during nightly testing
Wed, 12 Feb 2014 22:16:39 +0000 dsamersoff Merge
Wed, 12 Feb 2014 21:55:56 +0000 dsamersoff Merge
Wed, 12 Feb 2014 23:39:53 +0400 dsamersoff 7127191: SA JSDB does not display native symbols correctly for transported Linux cores
Wed, 12 Feb 2014 20:40:02 +0100 ctornqvi 8034781: [TESTBUG] runtime/ClassFileUnsupportedClassFileVersion.java unable to find or load main class
Wed, 12 Feb 2014 12:09:22 -0800 ccheung Merge
Wed, 12 Feb 2014 12:01:45 -0800 ccheung 8028785: [parfait] warnings from b116 for hotspot.src.share.vm.prims: JNI exception pending
Wed, 12 Feb 2014 10:55:28 -0800 mduigou Merge
Wed, 12 Feb 2014 09:37:18 -0800 mduigou 8030350: Enable additional compiler warnings for GCC
Wed, 12 Feb 2014 22:08:43 +0400 dsamersoff 8023667: SA: ExceptionBlob and other C2 classes not available in client VM
Tue, 11 Feb 2014 21:32:19 -0800 henryjen 8033215: clang: node.cpp:284 IDX_INIT macro use uninitialized field _out
Mon, 24 Feb 2014 12:56:19 -0800 lana Merge
Thu, 20 Feb 2014 19:59:26 -0800 lana Merge
Tue, 28 Jan 2014 20:09:41 +0000 jeff 8032816: THIRDPARTYREADME LittleCMS preamble missing JRE 8 & JDK 8
Mon, 13 Jan 2014 14:42:26 -0800 jeff 7129980: Third Party License Readme update for JDK8
Thu, 13 Feb 2014 17:57:27 +0100 ehelin Merge
Wed, 05 Feb 2014 11:05:13 +0100 sjohanss 8033426: Scale initial NewSize using NewRatio if not set on command line
Tue, 10 Dec 2013 15:11:02 +0100 jwilhelm 8026849: Fix typos in the GC code, part 2
Mon, 10 Feb 2014 12:58:09 +0100 stefank 8033923: Use BufferingOopClosure for G1 code root scanning
Mon, 10 Feb 2014 14:37:53 +0100 ehelin Merge
Mon, 10 Feb 2014 12:51:51 +0100 stefank 8033764: Remove the usage of StarTask from BufferingOopClosure
Mon, 10 Feb 2014 13:31:22 +0100 ehelin Merge
Fri, 07 Feb 2014 13:48:07 +0100 brutisso 8033922: G1: Back out 8033601 and go back to use the to-obj for chunked arrays.
Thu, 06 Feb 2014 17:12:10 +0100 tschatzl 8033545: Missing volatile specifier in Bitmap::par_put_range_within_word
Thu, 06 Feb 2014 14:12:43 +0100 pliden 8031703: Missing post-barrier in ReferenceProcessor
Wed, 05 Feb 2014 14:29:34 +0100 tschatzl 8033443: Test8000311 fails after latest changes to parallelize string and symbol table unlink
Wed, 05 Feb 2014 12:47:48 +0100 tonyp 8033601: G1: Make array chunking use the same length field as the other young GCs
Wed, 05 Feb 2014 10:09:54 +0100 ehelin 8028254: gc/arguments/TestMinInitialErgonomics.java failed with unexpected initial heap size
Mon, 03 Feb 2014 10:49:49 +0100 ehelin Merge
Thu, 16 Jan 2014 13:25:25 -0800 jmasa 8024366: Make UseNUMA enable UseNUMAInterleaving
Fri, 31 Jan 2014 09:58:06 +0100 tschatzl 8033106: Wrong predicate for checking whether the correct amount of symbol table entries have been processed in G1
Fri, 31 Jan 2014 09:57:50 +0100 tschatzl 6991197: G1: specialize deal_with_reference() for narrowOop*
Fri, 31 Jan 2014 09:55:59 +0100 tschatzl 8032771: The flag VerifySilently misses a test case
Tue, 11 Feb 2014 10:05:02 -0800 iklam Merge
Tue, 11 Feb 2014 08:43:17 -0800 iklam 7182040: volano29 limited by os resource on Linux - need better diagnostic message
Mon, 10 Feb 2014 21:29:14 -0800 minqi 8033792: AltHashing used jint for imprecise bit shifting
Mon, 10 Feb 2014 14:07:11 -0800 dcubed Merge
Mon, 10 Feb 2014 12:58:53 -0800 dcubed Merge
Mon, 10 Feb 2014 12:38:34 -0800 rdurbin 8005262: possible gamma launcher issues
Mon, 10 Feb 2014 12:48:54 -0800 dcubed 8028073: race condition in ObjectMonitor implementation causing deadlocks
Mon, 10 Feb 2014 17:49:17 +0100 ctornqvi 8016644: Improve UnsupportedClassVersionError message
Sun, 09 Feb 2014 13:28:58 -0500 hseigel Merge
Fri, 07 Feb 2014 18:30:27 -0500 coleenp 8033528: assert(0 <= i && i < length()) failed: index out of bounds
Fri, 07 Feb 2014 11:47:24 -0800 dcubed 8033931: Several nightly tests failing with assert(imin < imax) failed: Unexpected page size
Fri, 07 Feb 2014 09:03:44 -0800 dcubed 8033714: hotspot 'install_jvm' bld target broken with ZIP_DEBUGINFO_FILES=0
Thu, 06 Feb 2014 20:13:38 -0800 sspitsyn 8025841: JVMTI: "vtable stub" dynamic code notification is misplaced
Thu, 06 Feb 2014 20:32:08 +0000 coleenp Merge
Thu, 06 Feb 2014 14:28:35 -0500 coleenp 8029775: Solaris code cleanup
Thu, 06 Feb 2014 14:51:01 -0500 fparain Merge
Thu, 06 Feb 2014 17:59:35 +0000 fparain 8030808: dtrace/hotspot/Monitors/Monitors001 fails in product builds on solaris-sparc
Thu, 06 Feb 2014 18:57:46 +0000 coleenp 8028735: runtime/RedefineObject/TestRedefineObject.java interrupted (timed out?) on solaris_sparcv9-fastdebug-c2-runtime and solaris_x64-debugOpen-c2-runtime
Wed, 05 Feb 2014 21:24:29 -0800 henryjen 8033289: clang: clean up unused function warning
Fri, 07 Feb 2014 09:41:36 -0800 amurillo Merge
Wed, 05 Feb 2014 15:14:47 -0800 ccheung 8032010: Attempt to resolve abstract method in concrete class fails with AbstractMethodError
Tue, 04 Feb 2014 19:41:46 -0800 sspitsyn 8032223: nsk/regression/b4663146 gets assert(SafepointSynchronize::is_at_safepoint() || JvmtiEnv::is_thread_fully_suspended(get_thread(), false, &debug_bits))
Mon, 03 Feb 2014 15:24:20 +0100 sla 8033126: Can't call default methods from JNI
Mon, 03 Feb 2014 13:41:26 +0100 sla 8032462: Change the linux SDT implementation to use USDT2 instead of USDT1
Sun, 02 Feb 2014 15:31:40 -0500 hseigel Merge
Thu, 30 Jan 2014 14:12:22 -0800 rdurbin 8027113: decouple the '-XXaltjvm=<path>' option from the gamma launcher
Thu, 30 Jan 2014 09:41:45 +0100 jbachorik 6656031: SA: jmap -permstat number of classes is off by 1
Fri, 21 Feb 2014 11:39:47 -0800 katleman Added tag jdk9-b03 for changeset b2fee789d23f
Tue, 11 Feb 2014 11:26:05 -0800 lana Mergejdk9-b03
Wed, 05 Feb 2014 08:57:33 -0800 amurillo Merge
Thu, 30 Jan 2014 14:01:45 +0100 ehelin Merge
Wed, 29 Jan 2014 23:17:05 +0100 jwilhelm 8028391: Make the Min/MaxHeapFreeRatio flags manageable
Wed, 15 Jan 2014 07:20:04 -0800 jmasa 8031290: Adjust call to getisax() for additional words returned
Mon, 20 Jan 2014 10:55:54 +0100 sjohanss 8031686: G1: assert(_hrs.max_length() == _expansion_regions) failed
Mon, 27 Jan 2014 13:14:53 +0100 brutisso 8030177: G1: Enable TLAB resizing
Thu, 23 Jan 2014 14:47:23 +0100 jwilhelm 8025856: Fix typos in the GC code
Tue, 14 Jan 2014 16:40:33 +0100 mgerdin 8032379: Remove the is_scavenging flag to process_strong_roots
Mon, 20 Jan 2014 12:56:18 +0100 sjohanss 8020277: Young GC could be extremely slow due to assertion in ObjectStartArray::object_starts_in_range
Mon, 20 Jan 2014 17:15:55 +0100 ehelin 8031776: Remove the unnecessary enum GenRemSet::Name
Mon, 20 Jan 2014 11:47:53 +0100 tschatzl 8027746: Remove do_gen_barrier template parameter in G1ParCopyClosure
Mon, 20 Jan 2014 11:47:29 +0100 tschatzl 8027454: Do not traverse string table during G1 remark when treating them as strong roots during initial mark
Mon, 20 Jan 2014 11:47:07 +0100 tschatzl 8027476: Improve performance of Stringtable unlink
Wed, 29 Jan 2014 19:54:44 -0500 hseigel Merge
Tue, 28 Jan 2014 06:26:36 -0800 zgu Merge
Tue, 28 Jan 2014 08:55:00 -0500 zgu 8032827: NMT: missing virtual memory tagging in os::workaround_expand_exec_shield_cs_limit()
Tue, 28 Jan 2014 11:42:30 +0000 dsamersoff Merge
Tue, 28 Jan 2014 14:45:39 +0400 dsamersoff 7010732: SA_ALTROOT only works if running the SA tools from their build directory.
Mon, 27 Jan 2014 23:12:13 -0500 coleenp 8028275: Metaspace ShrinkGrowTest causes fatal error if run with JFR
Tue, 21 Jan 2014 16:45:10 -0600 gziemski 7015395: [TESTBUG] runtime/6626217/Test6626217.sh fails if compilation happens fast enough for timestamps to be equal.
Mon, 27 Jan 2014 10:57:52 +0100 sla 8032662: test/compiler/ciReplay/TestSA.sh should report ulimit issues
Mon, 27 Jan 2014 13:46:54 +0400 dsamersoff 8032247: SA: Constantpool lookup for invokedynamic is not implemented
Fri, 24 Jan 2014 08:31:06 -0500 hseigel Merge
Fri, 24 Jan 2014 08:13:42 -0500 hseigel 8028553: The JVM should not throw VerifyError when 'overriding' a static final method in a superclass.
Fri, 24 Jan 2014 09:28:47 +0100 dsimms 8028280: ParkEvent leak when running modified runThese which only loads classes
Thu, 23 Jan 2014 16:02:14 -0500 gdub 8031427: AllocObject and Unsafe.allocateInstance segfault for primitive types
Thu, 23 Jan 2014 09:45:38 -0800 minqi Merge
Thu, 23 Jan 2014 09:40:32 -0800 minqi 6651256: jstack: DeleteGlobalRef method call doesn't lead to descreasing of global refs count shown by jstack
Thu, 23 Jan 2014 09:33:50 +0000 kevinw 8032466: serviceability/sa/jmap-hashcode/Test8028623.java fails with compilation errors
Thu, 23 Jan 2014 09:06:21 +0100 sla 8031968: Mac OS X: VM starts the agent by calling both Agent_OnAttach and Agent_OnAttach_L functions if its agent library is dynamically linked.
Thu, 23 Jan 2014 08:12:12 +0100 sla 8032250: Add trace event for VM flag changes
Mon, 20 Jan 2014 09:56:47 +0000 kevinw Merge
Fri, 17 Jan 2014 18:39:22 +0000 kevinw 8028623: SA: hash codes in SymbolTable mismatching java_lang_String::hash_code for extended characters.
Sun, 19 Jan 2014 20:23:46 -0500 hseigel Merge
Fri, 17 Jan 2014 11:21:29 -0500 coleenp 8032024: Test not added for bug 8025937: assert(existing_f1 == NULL || existing_f1 == f1) failed: illegal field,change
Fri, 17 Jan 2014 09:47:17 -0500 hseigel Merge
Fri, 17 Jan 2014 09:39:51 -0500 hseigel 8031045: Access checks should precede additional per-instruction checks
Thu, 16 Jan 2014 20:14:21 +0100 sla 8030812: Change the solaris DTrace implementation to use USDT2 instead of USDT1
Fri, 17 Jan 2014 02:13:40 -0800 sspitsyn 8030027: nsk/jvmti/scenarios/hotswap/HS101/hs101t006 Crashed the vm on Linux-amd64: SIGSEGV in JavaThread::last_java_vframe(RegisterMap*)+0xfa
Thu, 16 Jan 2014 10:51:16 -0800 ccheung 8027314: Java should recognize Diagnostic options if -XX:+UnlockDiagnosticVMOptions is not specified and print an informative message
Wed, 15 Jan 2014 19:12:45 -0500 mseledtsov 8031151: Add basic CDS tests
Wed, 15 Jan 2014 11:46:19 +0100 dsimms 6945460: [TESTBUG] runtime/6929067/Test6929067.sh
Fri, 24 Jan 2014 09:04:24 -0800 kvn Merge
Thu, 23 Jan 2014 01:23:23 +0400 vlivanov 8031695: CHA ignores default methods during analysis leading to incorrect code generation
Tue, 21 Jan 2014 20:05:28 -0800 iveresov 8031743: C2: loadI2L_immI broken for negative memory values
Fri, 17 Jan 2014 18:09:08 -0800 iveresov 8032207: C2: assert(VerifyOops || MachNode::size(ra_) <= (3+1)*4) failed: bad fixed size
Tue, 28 Jan 2014 11:21:43 -0800 lana Merge
Thu, 23 Jan 2014 10:35:38 -0800 amurillo Merge
Fri, 17 Jan 2014 10:43:43 -0800 morris Merge
Thu, 16 Jan 2014 16:18:34 -0800 twisti 8022395: java.util.zip.ZipException: Not in GZIP format in JT_JDK/test/java/util/zip/GZIP tests
Tue, 14 Jan 2014 21:33:33 -0800 anoll Merge
Wed, 15 Jan 2014 06:16:55 +0100 anoll 7194669: CodeCache::mark_for_deoptimization should avoid verifying dependencies multiple times
Tue, 14 Jan 2014 17:46:48 -0800 kvn 8002074: Support for AES on SPARC
Tue, 14 Jan 2014 14:51:47 +0100 roland 8026253: New type profiling points: sparc support
Tue, 14 Jan 2014 12:44:12 +0100 roland 8030662: "assert(counter_changed) failed: failed dependencies, but counter didn't change" still fails
Tue, 14 Jan 2014 09:44:45 +0100 roland 8028764: dtrace/hotspot_jni/ALL/ALL001 crashes the vm on Solaris-amd64, SIGSEGV in MarkSweep::follow_stack()+0x8a
Mon, 13 Jan 2014 16:16:25 -0800 roland 8029464: assert(ft == ttkp->cast_to_ptr_type(jtkp->ptr()) || ft->isa_narrowoop()
Fri, 17 Jan 2014 09:40:04 +0100 ehelin Merge
Thu, 16 Jan 2014 17:22:35 +0100 ehelin 8031779: Assert in MetaspaceGC is always true
Tue, 14 Jan 2014 14:26:43 +0100 ehelin Merge
Fri, 10 Jan 2014 09:54:25 +0100 pliden 8029162: G1: Shared SATB queue never enabled
Fri, 10 Jan 2014 09:53:53 +0100 pliden 8029255: G1: Reference processing should not enqueue references on the shared SATB queue
Tue, 14 Jan 2014 22:13:21 +0000 dsamersoff Merge
Wed, 15 Jan 2014 02:02:47 +0400 dsamersoff 8030941: Darwin mapfile-vers doesnt work for other BSDs
Tue, 14 Jan 2014 16:27:35 -0500 hseigel 8031059: invokestatic: ICCE trying to invoke static method when it clashes with an abstract method inherited from an interface
Tue, 14 Jan 2014 13:51:47 -0500 hseigel 8028398: [TESTBUG]: test/runtime/memory/ReadFromNoaccessArea.java failed with EXCEPTION_ACCESS_VIOLATION
Mon, 13 Jan 2014 10:05:37 -0500 zgu 8031530: [TESTBUG] Enable test runtime/LoadClass/LoadClassNegative.java
Tue, 14 Jan 2014 15:27:01 +0100 farvidsson 8031304: Add dcmd to print all loaded dynamic libraries.
Mon, 13 Jan 2014 18:30:57 -0500 hseigel Merge
Thu, 09 Jan 2014 15:48:00 -0800 ccheung 8022301: [TESTBUG] runtime/jsig/Test8017498.sh incorrectly compiles native code
Thu, 09 Jan 2014 14:06:53 -0500 zgu 7012961: runtime/jni/WindowsExceptionFilter/WindowsExceptionFilter01 crashes on windows-amd64
Wed, 08 Jan 2014 13:20:33 +0100 sla 8030184: Remove unneeded "content_type" declarations from tracetypes.xml
Wed, 08 Jan 2014 08:34:02 +0100 sla 8031376: TraceClassLoading expects there to be a (Java) caller when you load a class with the bootstrap class loader
Tue, 21 Jan 2014 20:07:14 -0800 henryjen 8028407: adjust-mflags.sh failed build with GNU Make 4.0 with -I<path contains j>
Thu, 06 Feb 2014 13:08:44 -0800 katleman Added tag jdk9-b02 for changeset b188446de75b
Mon, 27 Jan 2014 21:00:29 -0800 lana Mergejdk9-b02
Thu, 05 Dec 2013 00:36:42 -0800 jrose 8029507: Enhance JVM method processing
Thu, 05 Sep 2013 10:29:00 -0400 coleenp 8021266: Better life cycle for objects
Fri, 10 Jan 2014 12:54:08 -0800 morris Merge
Fri, 10 Jan 2014 06:36:18 +0100 anoll 8022494: Make compilation IDs sequential
Thu, 09 Jan 2014 18:09:59 -0800 twisti 8026413: ScopeDesc::is_equal is declared in header file but not implemented
Thu, 09 Jan 2014 19:03:36 +0400 iignatyev 8031115: intrinsics for Math.decrementExact(J) and incrementExact(J) don't work
Thu, 09 Jan 2014 10:47:40 +0100 adlertz 8011391: C1: assert(code_offset() - offset == NativeInstruction::nop_instruction_size) failed: only one instruction can go in a delay slot
Wed, 08 Jan 2014 10:25:50 -0800 kvn 8028468: Add inlining information into ciReplay
Wed, 08 Jan 2014 12:05:19 +0100 adlertz 8029446: assert(_cfg.get_block_for_node(proj) == borig) failed: incorrect block for kill projections
Wed, 08 Jan 2014 09:49:31 +0100 roland 8029873: compiler/uncommontrap/TestStackBangRbp.java crashes with SIGSEGV
Tue, 07 Jan 2014 14:26:12 -0800 twisti 8022263: use same Clang warnings on BSD as on Linux
Tue, 07 Jan 2014 16:02:10 +0100 roland 8027571: fatal error: meet not symmetric
Tue, 07 Jan 2014 14:36:34 +0100 roland 8028064: tiered may collect wrong receiver type at virtual call
Tue, 07 Jan 2014 12:38:22 +0100 roland 8028536: Test cases to cover type system fixes pushed with 8024070
Mon, 06 Jan 2014 17:23:07 -0800 twisti 8029305: add type tag to AbstractCompiler
Mon, 06 Jan 2014 15:35:20 -0800 twisti 8031199: _MSC_VER is only defined on _WIN32
Tue, 24 Dec 2013 11:48:39 -0800 mikael 8029233: Update copyright year to match last edit in jdk8 hotspot repository for 2013
Thu, 19 Dec 2013 20:28:45 +0000 coleenp 8030633: nsk/jvmti/RedefineClasses/StressRedefine failed invalid method ordering length on Solaris
Mon, 16 Dec 2013 08:24:33 -0500 hseigel 8027804: JCK resolveMethod test fails expecting AbstractMethodError
Fri, 13 Dec 2013 09:25:44 +0100 roland 8029383: assert(counter_changed) failed: failed dependencies, but counter didn't change
Thu, 12 Dec 2013 15:11:35 -0500 drchase 8029351: assert(bt != T_OBJECT) failed: Guard is incorrect in VM:defmeth
Fri, 13 Dec 2013 00:34:09 +0400 iignatyev 8026941: [TESTBUG] java.lang.ClassNotFoundException: java.lang.invoke.InvokeGeneric
Thu, 12 Dec 2013 11:25:32 -0800 iveresov 8029668: Kithcensink crashed with guarantee(Assembler::is_simm13(disp)) failed: Do not match large constant offsets
Wed, 11 Dec 2013 13:51:28 -0500 jprovino 8029566: PPC: OrderAccess::load_acquire(julong) is broken
Wed, 11 Dec 2013 01:09:04 +0400 iignatyev 8029153: [TESTBUG] test/compiler/7141637/SpreadNullArg.java fails because it expects NullPointerException
Wed, 11 Dec 2013 01:04:34 +0400 iignatyev 8028122: [TESTBUG] compiler/regalloc/C1ObjectSpillInLogicOp.java
Fri, 06 Dec 2013 16:43:56 -0800 twisti 8029366: ShouldNotReachHere error when creating an array with component type of void
Fri, 06 Dec 2013 12:11:51 -0800 kvn 8028107: Kitchensink crashed with EAV
Mon, 09 Dec 2013 10:03:39 +0100 stefank 8029106: JVM crashes in Metachunk::Metachunk during parallel class redefinition (PrivateMLetController, anonymous-simple_copy_1)
Tue, 10 Dec 2013 10:31:00 +0100 sjohanss 8028993: Full collections with ParallelScavenge slower in JDK 8 compared to 7u40
Mon, 09 Dec 2013 08:20:45 +0100 ehelin 8029326: G1 does not check if threads gets created
Tue, 10 Dec 2013 16:18:26 -0500 hseigel 8028741: Interface Method Resolution should skip static and non-public methods in j.l.Object
Fri, 06 Dec 2013 11:33:10 -0500 hseigel 8029415: java/lang/reflect/Method/invoke/TestPrivateInterfaceMethodReflect.java fails on all platforms with hs25-b61
Thu, 05 Dec 2013 12:35:38 +0100 mgronlun 8028412: AsyncGetCallTrace() is broken on x86 in JDK 7u40
Wed, 04 Dec 2013 14:43:50 +0100 sla 8029395: SA: jstack throws WrongTypeException
Wed, 04 Dec 2013 08:10:31 -0500 hseigel 8027458: VM anonymous classes: wrong context for protected access checks
Tue, 31 Dec 2013 19:26:57 +0400 iignatyev 8028587: New tests development for intrisics for basic operators - add, neg, inc, dec, sub, mul
Thu, 26 Dec 2013 21:00:23 -0800 iveresov 8027388: JVM crashes with SIGSEGV (0xb) at pc=0x00000001077cbbf6
Fri, 20 Dec 2013 10:31:14 +0100 anoll 8028052: compiler/startup/SmallCodeCacheStartup.java fails there is no 'no space to run compiler' in the output
Fri, 20 Dec 2013 10:29:44 +0100 anoll 8030783: Provide regression test for 8026478: -XX:+VerifyAdapterSharing is broken
Thu, 19 Dec 2013 14:08:02 +0100 anoll 8025277: Add -XX: flag to print code cache sweeper statistics
Thu, 19 Dec 2013 06:09:16 +0100 anoll 8026478: -XX:+VerifyAdapterSharing is broken
Tue, 17 Dec 2013 08:31:06 +0100 anoll 8029091: Bug in calculation of code cache sweeping interval
Thu, 09 Jan 2014 16:53:51 +0100 ehelin Merge
Tue, 07 Jan 2014 16:15:35 +0100 ehelin Merge
Tue, 07 Jan 2014 13:31:33 +0100 tschatzl 8027364: PSScavenge accounts too large code section to StringTable unlink
Mon, 16 Dec 2013 13:43:06 +0100 brutisso 8027440: DefNew does not log heap change information when a promotion failure occurs
Mon, 16 Dec 2013 08:54:14 +0100 brutisso 8029524: Remove unsused method CollectedHeap::unsafe_max_alloc()
Wed, 08 Jan 2014 13:53:24 -0800 dcubed Merge
Tue, 07 Jan 2014 13:26:56 -0500 coleenp 8029178: Parallel class loading test anonymous-simple gets SIGSEGV in Metaspace::contains
Tue, 07 Jan 2014 12:32:57 +0100 sla 8031305: (hotspot) com.sun.management.VMOption is missing the ATTACH_ON_DEMAND origin
Tue, 07 Jan 2014 10:50:28 +0100 sla 4990369: visibleMethods() and methodsByName() return wrong visible methods
Mon, 06 Jan 2014 08:44:24 -0500 hseigel 8030955: assert(_prologue != NULL) failed: prologue pointer must be initialized
Tue, 31 Dec 2013 08:58:08 -0500 zgu 6730115: Fastdebug VM crashes with "ExceptionMark destructor expects no pending exceptions" error
Mon, 23 Dec 2013 18:44:59 -0500 hseigel 8023735: [TESTBUG] runtime/XCheckJniJsig/XCheckJSig.java fails on MacOS X
Mon, 23 Dec 2013 18:39:47 +0000 iignatyev Merge
Mon, 23 Dec 2013 20:56:18 +0400 iignatyev 8029070: memory leak in jmm_SetVMGlobal
Mon, 23 Dec 2013 10:13:42 -0500 hseigel 8021774: [TESTBUG] Tests failed because of a warning in its output
Wed, 18 Dec 2013 23:09:57 +0400 dsamersoff 6969276: minor memory leak detected by cppcheck in agent/src/os/linux/symtab.c
Wed, 18 Dec 2013 20:32:46 +0400 dsamersoff 8028408: unused-value warning on forte.cpp when build on Mac
Wed, 18 Dec 2013 08:39:06 +0100 sla 8029726: On OS X some dtrace probe names are mismatched with Solaris
Mon, 16 Dec 2013 10:34:30 +0100 sla 8028737: Remove JVM_AccessVMIntFlag / JVM_AccessVMBooleanFlag / JVM_VMBreakPoint
Mon, 16 Dec 2013 10:57:08 -0800 zgu 8026300: VM warning: increase O_BUFLEN in ostream.hpp -- output truncated occurs with fastdebug VM when printing flags
Mon, 16 Dec 2013 11:17:33 +0100 sla 8029798: Build warnings in windows/makefiles/sa.make
Thu, 26 Dec 2013 11:16:44 -0500 darcy 8030656: Bad version check for parameter information in src/share/vm/classfile/javaClasses.cpp
Tue, 21 Jan 2014 18:16:59 -0800 katleman Added tag jdk9-b01 for changeset 050a626a8895
Fri, 13 Dec 2013 09:35:12 -0800 iris 8030068: Update .jcheck/conf files for JDK 9jdk9-b01
Thu, 12 Dec 2013 15:27:05 -0800 iris Added tag jdk9-b00 for changeset ce2d7e46f3c7
Thu, 12 Dec 2013 05:20:55 -0800 katleman Added tag jdk8-b120 for changeset fca262db9c43jdk9-b00
Fri, 06 Dec 2013 09:29:15 -0800 amurillo Added tag hs25-b62 for changeset 05fedd51e40djdk8-b120
Fri, 06 Dec 2013 09:29:14 -0800 amurillo Mergehs25-b62
Thu, 05 Dec 2013 12:49:55 -0800 anoll Merge
Wed, 04 Dec 2013 09:31:17 +0100 anoll 8028109: compiler/codecache/CheckReservedInitialCodeCacheSizeArgOrder.java crashes in RT_Baseline
Mon, 02 Dec 2013 11:12:32 +0100 simonis 8029190: VM_Version::determine_features() asserts on Fujitsu Sparc64 CPUs
Fri, 22 Nov 2013 15:26:37 +0100 rbackman 8028624: [TESTBUG] compiler/intrinsics/mathexact/DecExactLTest executes DecExactITest
Fri, 22 Nov 2013 14:14:26 +0100 rbackman 8028997: mathexact intrinsics are unstable
Thu, 05 Dec 2013 17:49:55 +0100 ehelin Merge
Tue, 03 Dec 2013 12:01:18 +0100 sjohanss 8029329: tmtools tests fail with NPE (in the tool) when run with G1 and FlightRecorder
Mon, 02 Dec 2013 15:43:04 +0100 ehelin Merge
Tue, 26 Nov 2013 14:35:38 +0100 sjohanss 8027675: Full collections with Serial slower in JDK 8 compared to 7u40
Tue, 03 Dec 2013 13:56:10 -0800 sspitsyn Merge
Tue, 03 Dec 2013 15:41:35 -0800 sspitsyn 8028126: nsk/jvmti/scenarios/hotswap/HS101/hs101t006 Crashed the vm on Solaris-sparc64 fastdebug builds: only current thread can flush its registers
Tue, 03 Dec 2013 11:13:14 -0800 acorn 8028438: static superclass method masks default methods
Tue, 03 Dec 2013 08:36:15 -0800 acorn 8026066: ICCE for invokeinterface static
Mon, 02 Dec 2013 11:42:10 +0100 mgronlun Merge
Wed, 27 Nov 2013 14:26:04 +0400 dsamersoff 7050685: jsdbproc64.sh has a typo in the package name
Sun, 01 Dec 2013 22:35:15 -0500 vladidan Merge
Tue, 19 Nov 2013 16:26:54 -0500 jprovino 8028396: Minimal VM: undefined symbol: _ZN23JvmtiCurrentBreakpoints11metadata_doEPFvP8MetadataE
Fri, 29 Nov 2013 11:20:34 -0800 amurillo 8029367: new hotspot build - hs25-b62
Wed, 04 Dec 2013 23:11:03 -0800 katleman Added tag jdk8-b119 for changeset ce42d815dd21
Fri, 29 Nov 2013 11:10:31 -0800 amurillo Added tag hs25-b61 for changeset b2426da30009jdk8-b119
Fri, 29 Nov 2013 11:10:30 -0800 amurillo Mergehs25-b61
Fri, 29 Nov 2013 11:32:45 -0500 drchase Merge
Tue, 26 Nov 2013 18:16:04 -0500 drchase 8016839: JSR292: AME instead of IAE when calling a method
Tue, 26 Nov 2013 16:03:57 -0500 hseigel 8028160: [TESTBUG] Exclude failing (runtime) jtreg tests using @ignore
Tue, 26 Nov 2013 09:52:22 -0500 hseigel 8026065: InterfaceMethodref for invokespecial must name a direct superinterface
Sat, 23 Nov 2013 12:25:13 +0100 mgronlun 8028128: Add a type safe alternative for working with counter based data
Sat, 23 Nov 2013 09:56:59 +0100 mgronlun Merge
Thu, 21 Nov 2013 14:41:13 -0500 hseigel 8028520: JVM should not throw VerifyError when a private method overrides a final method
Fri, 22 Nov 2013 13:42:46 -0800 amurillo 8028815: new hotspot build - hs25-b61
Thu, 28 Nov 2013 08:23:04 -0800 cl Added tag jdk8-b118 for changeset c9f439732b18
Fri, 22 Nov 2013 13:34:43 -0800 amurillo Added tag hs25-b60 for changeset abad3b2d905djdk8-b118
Fri, 22 Nov 2013 13:34:41 -0800 amurillo Mergehs25-b60
Fri, 22 Nov 2013 20:26:36 +0100 mgronlun Merge
Mon, 18 Nov 2013 08:21:19 +0100 sgabdura 8028341: PSR:FUNC: SCOPE PARAMETER MISSING FROM THE -XX:+PRINTFLAGSFINAL
Mon, 18 Nov 2013 10:20:13 +0100 sla 8027630: SIGSEGV in const char*Klass::external_name()
Fri, 15 Nov 2013 17:20:22 -0500 coleenp 8028347: Rewriter::scan_method asserts with array oob in RT_Baseline
Fri, 15 Nov 2013 21:39:27 +0100 mgronlun Merge
Thu, 14 Nov 2013 20:03:15 +0100 sla 6626412: jstack using SA prints some info messages into err stream
Thu, 14 Nov 2013 19:30:07 +0100 sla 6606002: jinfo doesn't detect dynamic vm flags changing
Wed, 13 Nov 2013 16:35:55 -0800 minqi Merge
Wed, 13 Nov 2013 16:24:33 -0800 minqi 8025632: Remove all references to MagicLambdaImpl from Hotspot
Wed, 20 Nov 2013 12:46:08 +0100 roland 8028308: nsk regression, assert(obj->is_oop()) failed: not an oop
Thu, 14 Nov 2013 19:27:07 +0100 anoll 8028306: nsk stress tests, CodeCache fills, then safepoint asserts
Mon, 18 Nov 2013 12:26:51 -0800 morris 8028319: ConflictingDefaultsTest.testReabstract spins when running with -mode invoke and -Xcomp
Fri, 15 Nov 2013 07:58:06 -0800 amurillo 8028444: new hotspot build - hs25-b60
Thu, 21 Nov 2013 09:22:49 -0800 cl Added tag jdk8-b117 for changeset f573d00213b7
Fri, 15 Nov 2013 07:50:05 -0800 amurillo Added tag hs25-b59 for changeset c78d517c7ea4jdk8-b117
Fri, 15 Nov 2013 07:50:04 -0800 amurillo Mergehs25-b59
Thu, 14 Nov 2013 13:38:49 -0800 drchase Merge
Thu, 14 Nov 2013 15:58:12 -0500 drchase Merge
Thu, 14 Nov 2013 09:14:39 -0800 vlivanov 8028159: C2: compiler stack overflow during inlining of @ForceInline methods
Wed, 13 Nov 2013 13:45:50 +0100 roland 8027572: assert(r != 0) failed: invalid
Wed, 13 Nov 2013 01:50:14 -0800 roland Merge
Wed, 13 Nov 2013 09:45:58 +0100 roland 8027631: "unexpected profiling mismatch" error with new type profiling
Tue, 12 Nov 2013 14:52:48 +0100 rbackman 8028207: assert(_outcnt==1) failed: not unique in compile.cpp
Tue, 12 Nov 2013 13:47:57 +0100 rbackman 8028198: SIGSEGV in PhaseIdealLoop::build_loop_late_post
Tue, 12 Nov 2013 13:58:37 +0100 roland 8027632: assert(xtype->klass_is_exact()) failed: Should be exact at graphKit.cpp
Tue, 12 Nov 2013 09:32:50 +0100 anoll 8027593: performance drop with constrained codecache starting with hs25 b111
Mon, 11 Nov 2013 11:53:33 -0800 kvn 8024830: SEGV in org.apache.lucene.codecs.compressing.CompressingTermVectorsReader.get
Fri, 08 Nov 2013 14:19:55 -0800 drchase Merge
Fri, 08 Nov 2013 01:13:11 -0800 vlivanov 8023037: Race between ciEnv::register_method and nmethod::make_not_entrant_or_zombie
Thu, 14 Nov 2013 21:05:16 +0100 ehelin Merge
Fri, 08 Nov 2013 17:46:53 +0100 sjohanss 8027960: Assertion assert(end >= start) failed during nightly testing on solaris
Mon, 11 Nov 2013 16:20:48 +0100 mgerdin Merge
Mon, 11 Nov 2013 05:05:36 -0800 jwilhelm Merge
Mon, 11 Nov 2013 13:50:10 +0100 jwilhelm 8028093: Initial young size is smaller than minimum young size
Sun, 10 Nov 2013 00:07:29 +0100 jwilhelm 8027911: Assertion in the collector policy when running gc/arguments/TestMaxNewSize.java
Fri, 08 Nov 2013 06:14:21 -0800 jmasa 8024483: assertion failure: (!mirror_alive || loader_alive) failed:
Wed, 16 Oct 2013 15:14:37 -0700 jmasa 8024954: CMS: CMSClassUnloadingMaxInterval is not implemented correctly. This change is also part of the fix for 8024483.
Thu, 07 Nov 2013 15:17:10 +0100 tschatzl 8027756: assert(!hr->isHumongous()) failed: code root in humongous region?
Sat, 02 Nov 2013 13:02:59 -0700 amurillo Merge
Fri, 01 Nov 2013 17:09:38 +0100 jwilhelm 8016309: assert(eden_size > 0 && survivor_size > 0) failed: just checking
Mon, 21 Oct 2013 18:56:20 +0200 jwilhelm 8026853: Prepare GC code for collector policy regression fix
Mon, 21 Oct 2013 18:52:13 +0200 jwilhelm 8026852: Use restricted_align_down in collector policy code
Mon, 21 Oct 2013 18:51:37 +0200 jwilhelm 8026851: Remove unnecessary code in GenRemSet
Wed, 13 Nov 2013 16:42:24 -0500 coleenp 8025937: assert(existing_f1 == NULL || existing_f1 == f1) failed: illegal field change
Wed, 13 Nov 2013 07:31:26 -0800 acorn 8027229: ICCE expected for >=2 maximally specific default methods.
Fri, 08 Nov 2013 23:49:20 +0000 mgerdin Merge
Fri, 08 Nov 2013 16:48:21 +0100 mgerdin 8027237: New tests on ReservedSpace/VirtualSpace classes
Fri, 08 Nov 2013 07:13:57 -0800 amurillo 8028061: new hotspot build - hs25-b59
Thu, 14 Nov 2013 09:04:59 -0800 cl Added tag jdk8-b116 for changeset 52b076e6ffae
Fri, 08 Nov 2013 07:02:54 -0800 amurillo Added tag hs25-b58 for changeset e510dfdec6ddjdk8-b116
Fri, 08 Nov 2013 07:02:53 -0800 amurillo Mergehs25-b58
Thu, 07 Nov 2013 10:02:28 -0500 drchase Merge
Wed, 06 Nov 2013 06:51:24 -0800 mikael 8026775: nsk/jvmti/RedefineClasses/StressRedefine crashes due to EXCEPTION_ACCESS_VIOLATION
Tue, 05 Nov 2013 02:29:41 -0800 iveresov Merge
Tue, 05 Nov 2013 01:57:18 -0800 iveresov 8017065: C2 allows safepoint checks to leak into G1 pre-barriers
Tue, 05 Nov 2013 00:59:30 -0800 iveresov 8027751: C1 crashes in Weblogic with G1 enabled
Mon, 04 Nov 2013 10:44:46 +0100 rbackman 8027622: java.time.Instant.create failing since hs25-b56
Mon, 04 Nov 2013 21:59:54 +0100 roland 8027445: SIGSEGV at TestFloatingDecimal.testAppendToDouble()I
Sat, 02 Nov 2013 20:56:18 +0100 mgronlun Merge
Fri, 01 Nov 2013 17:10:31 +0000 mgronlun Merge
Fri, 01 Nov 2013 15:56:06 +0100 mgronlun Merge
Fri, 01 Nov 2013 10:32:36 -0400 coleenp 8026946: JvmtiEnv::SetBreakpoint and JvmtiEnv::ClearBreakpoint should use MethodHandle
Thu, 31 Oct 2013 14:11:02 -0400 coleenp 8027616: Off by one error in putback for compressed oops nashorn performance improvement
Wed, 30 Oct 2013 09:26:44 -0700 acorn Merge
Wed, 30 Oct 2013 09:11:04 -0700 acorn 8027304: Lambda: inheriting abstract + 1 default -> default, not ICCE
Wed, 30 Oct 2013 15:35:25 +0100 mgerdin 8027252: Crash in interpreter because get_unsigned_2_byte_index_at_bcp reads 4 bytes
Fri, 01 Nov 2013 08:35:58 -0700 amurillo 8027580: new hotspot build - hs25-b58
Thu, 07 Nov 2013 08:16:14 -0800 cl Added tag jdk8-b115 for changeset 9ebaac78a8a0
Tue, 05 Nov 2013 14:06:23 -0800 amurillo Mergejdk8-b115
Fri, 01 Nov 2013 08:26:55 -0700 amurillo Added tag hs25-b57 for changeset 3b32d287da89
Fri, 01 Nov 2013 08:26:54 -0700 amurillo Mergehs25-b57
Thu, 31 Oct 2013 15:04:43 -0700 iveresov Merge
Thu, 31 Oct 2013 14:54:14 -0700 iveresov Merge
Thu, 31 Oct 2013 04:16:40 -0700 iveresov 8024919: G1: SPECjbb2013 crashes due to a broken object reference
Wed, 30 Oct 2013 22:55:11 -0700 iveresov 8026735: Stream tests throw java.lang.IncompatibleClassChangeError
Wed, 30 Oct 2013 13:14:09 +0100 rbackman 8027444: mathExact: assert(i < _max) failed: oob: i=1, _max=1
Mon, 28 Oct 2013 08:34:10 +0100 rbackman 8027353: Exact intrinsics: assert(n != NULL) failed: must not be null
Mon, 28 Oct 2013 17:32:02 -0700 iveresov Merge
Mon, 28 Oct 2013 15:16:17 -0700 iveresov Merge
Fri, 25 Oct 2013 22:57:13 +0200 anoll 8026949: -Xint flag prints wrong warning: Initialization of C1 thread failed (no space to run compilers)
Mon, 28 Oct 2013 12:21:00 -0700 roland Merge
Mon, 28 Oct 2013 09:58:59 +0100 roland 8027140: Assertion in compiler when running bigapps/Kitchensink/stability
Fri, 25 Oct 2013 12:40:10 -0700 adlertz Merge
Fri, 25 Oct 2013 10:13:40 +0200 adlertz 8026940: assert(n->outcnt() != 0 || C->top() == n || n->is_Proj()) failed: No dead instructions after post-alloc
Thu, 24 Oct 2013 16:26:31 -0700 twisti Merge
Thu, 24 Oct 2013 16:23:07 -0700 twisti 8026328: Setting a breakpoint on invokedynamic crashes the JVM
Thu, 31 Oct 2013 21:20:00 +0100 ehelin Merge
Mon, 28 Oct 2013 13:27:57 +0100 brutisso 8027132: Print deprecation warning message for the flags controlling the CMS foreground collector
Wed, 30 Oct 2013 16:31:33 -0700 vladidan Merge
Wed, 30 Oct 2013 16:06:48 -0400 jprovino Merge
Sun, 27 Oct 2013 14:11:06 -0400 jprovino Merge
Thu, 24 Oct 2013 00:33:14 -0400 dholmes 8026877: Error in opening JAR file when invalid jar specified with -Xbootclasspath/a on OpenJDK build
Wed, 30 Oct 2013 14:02:27 -0700 ccheung Merge
Mon, 28 Oct 2013 21:41:48 +0400 dsamersoff 8026950: Nits in agent ps_proc.c file breaks compilation of open hotspot
Fri, 25 Oct 2013 22:06:43 -0700 ccheung Merge
Fri, 25 Oct 2013 15:19:29 -0400 coleenp 8024927: Nashorn performance regression with CompressedOops
Fri, 25 Oct 2013 11:13:11 -0400 hseigel Merge
Fri, 25 Oct 2013 11:05:32 -0400 hseigel 8026822: metaspace/flags/maxMetaspaceSize throws OOM of unexpected type.java.lang.OutOfMemoryError: Compressed class space
Fri, 25 Oct 2013 09:07:58 +0200 jbachorik 8027294: Prepare hotspot for non TOD based uptime counter
Thu, 24 Oct 2013 22:19:48 -0700 iklam 8020753: JNI_CreateJavaVM on Mac OSX 10.9 Mavericks corrupts the callers stack size
Thu, 24 Oct 2013 10:02:02 +0200 farvidsson 8024423: JVMTI: GetLoadedClasses doesn't enumerate anonymous classes
Fri, 25 Oct 2013 13:43:39 -0700 amurillo 8027173: new hotspot build - hs25-b57
Thu, 31 Oct 2013 16:31:31 -0700 lana Merge
Wed, 30 Oct 2013 13:43:16 -0700 lana Merge
Mon, 28 Oct 2013 12:25:44 -0700 lana Merge
Sat, 19 Oct 2013 18:32:34 -0400 acorn 8026893: Push 8026365 to TL early and add test
Thu, 31 Oct 2013 12:36:10 -0700 cl Added tag jdk8-b114 for changeset 7fd913010dbb
Tue, 29 Oct 2013 14:56:30 -0700 katleman Mergejdk8-b114
Mon, 28 Oct 2013 16:02:40 -0700 katleman Merge
Thu, 24 Oct 2013 20:47:18 -0400 dholmes 8025673: [macosx] Disable X11 AWT toolkit
Fri, 25 Oct 2013 13:29:18 -0700 amurillo Added tag hs25-b56 for changeset 82a9cdbf683e
Fri, 25 Oct 2013 13:29:17 -0700 amurillo Mergehs25-b56
Fri, 25 Oct 2013 08:38:42 -0700 jcoomes Merge
Wed, 23 Oct 2013 10:23:06 +0200 tschatzl 8025728: Missing volatile specifier for field G1AllocRegion::_alloc_region
Tue, 22 Oct 2013 12:03:50 -0700 jcoomes Merge
Tue, 22 Oct 2013 11:50:12 +0200 sjohanss 8026848: -XX:+G1SummarizeRSetStats can result in wrong exit code and crash
Mon, 21 Oct 2013 14:20:47 +0200 ehelin 8025834: NPE in Parallel Scavenge with -XX:+CheckUnhandledOops
Mon, 21 Oct 2013 01:04:01 -0700 stefank Merge
Mon, 21 Oct 2013 09:34:10 +0200 stefank 8026781: Add missing test to exercise -XX:+UseLargePagesInMetaspace
Fri, 18 Oct 2013 09:31:59 +0200 mgerdin 8026698: Incorrect error handling in Metaspace::allocate
Tue, 15 Oct 2013 13:56:46 +0200 mgerdin 8015255: NPG: Don't waste fragment at the end of a VirtualSpaceNode before retiring it.
Thu, 24 Oct 2013 16:25:24 -0700 iveresov Merge
Thu, 24 Oct 2013 16:14:28 -0700 iveresov Merge
Thu, 24 Oct 2013 19:32:34 +0200 roland 8026978: JSR292: fatal error: Type profiling not implemented on this platform
Wed, 23 Oct 2013 20:20:03 +0400 vlivanov 8012941: JSR 292: too deep inlining might crash compiler because of stack overflow
Wed, 23 Oct 2013 20:15:24 +0400 sspitsyn 8023004: JSR 292: java.lang.RuntimeException: Original target method was called.
Tue, 15 Oct 2013 08:38:35 +0200 anoll 8025740: Typo. Error line for wrong ReservedCodeCacheSize value is printed twice
Fri, 18 Oct 2013 10:41:56 +0200 rbackman 8026844: Various Math functions needs intrinsification