log

age author description
Fri, 16 Sep 2016 10:57:18 -0700 amurillo Merge
Wed, 14 Sep 2016 11:53:20 -0700 mchung 8157464: Disallow StackWalker.getCallerClass() be called by caller-sensitive method
Tue, 13 Sep 2016 16:18:44 -0700 jmasa 8161029: GPL header missing comma after year
Wed, 14 Sep 2016 10:02:49 -0400 hseigel 8149607: [Verifier] Do not verify pop, pop2, swap, dup* against top
Wed, 14 Sep 2016 08:17:50 -0400 gtriantafill 8165889: Remove jdk.test.lib.unsafe.UnsafeHelper
Tue, 13 Sep 2016 21:29:30 +0000 sspitsyn Merge
Tue, 13 Sep 2016 20:17:46 +0000 sspitsyn Merge
Tue, 13 Sep 2016 13:10:42 -0700 sspitsyn 8165681: ClassLoad and ClassPrepare JVMTI events are missed in the start phase
Tue, 13 Sep 2016 18:22:21 +0000 cjplummer Merge
Tue, 13 Sep 2016 17:22:28 +0000 cjplummer Merge
Tue, 30 Aug 2016 16:08:52 +0200 goetz 8165315: [ppc] Port "8133749: NMT detail stack trace cleanup"
Tue, 13 Sep 2016 19:17:21 +0200 rehn Merge
Tue, 13 Sep 2016 09:04:44 +0200 dsimms 8164086: Checked JNI pending exception check should be cleared when returning to Java frame
Tue, 13 Sep 2016 18:19:05 +0200 mockner Merge
Tue, 13 Sep 2016 11:04:29 -0400 mockner 8163014: Mysterious/wrong value for "long" frame local variable on 64-bit
Tue, 13 Sep 2016 11:32:45 +0200 tschatzl 8164948: Initializing stores of HeapRegions are not ordered with regards to their use in G1ConcurrentMark
Mon, 12 Sep 2016 18:59:13 +0000 poonam Merge
Mon, 12 Sep 2016 17:18:19 +0000 poonam 8165493: SA: Add method in GrowableArray.java to be able to access the 'data' field
Mon, 12 Sep 2016 13:16:39 -0400 ctornqvi 8165881: Backout JDK-8164913
Mon, 12 Sep 2016 16:34:36 +0200 sjohanss 8114823: G1 doesn't honor request to disable class unloading
Thu, 08 Sep 2016 12:30:38 +0200 ehelin 8165455: Tracing events for G1 have incorrect metadata
Mon, 12 Sep 2016 09:34:51 +0200 tschatzl 8165313: Inserting freed regions during Free Collection Set serial phase takes very long on huge heaps
Sat, 10 Sep 2016 12:23:52 -0700 amurillo Merge
Sat, 10 Sep 2016 08:25:51 -0400 hseigel 8165634: Support multiple --add-modules options on the command line
Fri, 09 Sep 2016 19:41:41 +0000 dcubed Merge
Fri, 09 Sep 2016 11:23:59 -0700 dcubed Merge
Fri, 09 Sep 2016 11:14:57 -0700 rdurbin 8140520: segfault on solaris-amd64 with "-XX:VMThreadStackSize=1" option
Fri, 09 Sep 2016 19:30:08 +0300 avorobye 8146128: compiler/cpuflags/TestAESIntrinsicsOnSupportedConfig timeouts
Fri, 09 Sep 2016 06:44:31 +0000 sspitsyn Merge
Thu, 08 Sep 2016 23:38:56 -0700 ysuenaga 8164913: JVMTI.agent_load dcmd should show useful error message
Thu, 08 Sep 2016 23:43:45 -0400 dlong Merge
Tue, 06 Sep 2016 09:59:25 -0700 mcberg 8164989: Inflate and compress intrinsics produce incorrect results with avx512
Thu, 01 Sep 2016 20:16:04 +0300 tpivovarova 8165050: [TESTBUG] tests generated by jittester cannot be run with jtreg
Thu, 01 Sep 2016 21:15:12 +0300 dpochepk 8165244: Unquarantine compiler/jvmci/compilerToVM/ExecuteInstalledCodeTest.java
Thu, 01 Sep 2016 21:13:20 +0300 dpochepk 8146096: [TEST BUG] compiler/loopopts/UseCountedLoopSafepoints.java Timeouts
Thu, 01 Sep 2016 21:12:07 +0300 dpochepk 8157956: OverflowCodeCacheTest.java fails with Out of space in CodeCache for method handle intrinsic
Wed, 31 Aug 2016 12:10:40 -0700 dlong 8156137: SIGSEGV in ReceiverTypeData::clean_weak_klass_links
Wed, 31 Aug 2016 14:47:20 +0300 tpivovarova 8165030: [TESTBUG] ctw failed to build after 8157957
Tue, 30 Aug 2016 13:51:56 +0000 thartmann Merge
Tue, 30 Aug 2016 13:24:26 +0200 thartmann 8164480: Crash with assert(handler_address == SharedRuntime::compute_compiled_exc_handler(..) failed: Must be the same
Tue, 30 Aug 2016 13:53:36 +0200 neliasso 8157024: CodeCache JFR events reporting wrong data
Wed, 13 Jul 2016 12:10:22 +0200 neliasso 8160942: Unused code in GraphKit::record_profiled_receiver_for_speculation
Tue, 30 Aug 2016 09:01:33 +0000 zmajo Merge
Tue, 30 Aug 2016 10:50:29 +0200 zmajo 8141634: Implement VarHandles/Unsafe intrinsics on SPARC
Tue, 30 Aug 2016 09:30:16 +0200 zmajo 8161720: Better byte behavior for off-heap data
Mon, 29 Aug 2016 17:15:20 +0000 never 8161550: [JVMCI] Crash: assert(sig_bt[member_arg_pos] == T_OBJECT)
Mon, 29 Aug 2016 07:32:37 +0200 zmajo 8163880: Constant pool caching of fields inhibited/delayed unnecessarily
Wed, 21 Sep 2016 14:23:33 +0200 alanbur 8165161: Solaris: /usr/ccs /opt/sfw and /opt/csw are dead, references should be expunged
Thu, 22 Sep 2016 16:41:12 +0000 lana Added tag jdk-9+137 for changeset dfcbf839e299
Thu, 15 Sep 2016 21:09:16 +0000 lana Mergejdk-9+137
Sat, 10 Sep 2016 12:18:31 -0700 amurillo Merge
Fri, 02 Sep 2016 16:45:16 +0200 mgerdin 8161079: Default heap size causes native memory exhaustion on 32 bit Windows
Wed, 07 Sep 2016 23:17:24 +0200 dholmes Merge
Wed, 07 Sep 2016 16:43:32 -0400 dholmes 8165153: Crash in rebuild_cpu_to_node_map
Wed, 07 Sep 2016 19:29:01 +0000 coleenp Merge
Wed, 07 Sep 2016 15:25:21 -0400 coleenp 8165246: [REDO] InstanceKlass::_previous_version_count goes negative
Wed, 07 Sep 2016 12:52:20 -0400 fparain 8137035: nsk/stress/stack/stack tests got EXCEPTION_STACK_OVERFLOW on Windows 64 bit
Wed, 07 Sep 2016 15:21:45 +0200 mlarsson Merge
Wed, 07 Sep 2016 14:36:44 +0200 mlarsson 8165226: Bad -Xloggc: arguments crashes the VM
Wed, 07 Sep 2016 07:19:48 -0400 hseigel 8058575: IllegalAccessError trying to access package-private class from VM anonymous class
Wed, 07 Sep 2016 09:20:10 +0200 tschatzl 8165292: The gc+task logging is repeated a lot, decreasing the usefulness of -Xlog:gc*=info
Tue, 06 Sep 2016 22:52:35 +0200 rprotacio Merge
Tue, 06 Sep 2016 16:29:32 -0400 rprotacio 8161224: CONSTANT_NameAndType_info permits references to illegal names and descriptors
Tue, 06 Sep 2016 09:54:45 +0300 dsamersoff 8165114: stale reference to hotspot test Test8028623.java
Mon, 05 Sep 2016 20:40:08 -0400 mdoerr 8165018: Missing memory barrier for PPC64 in Unsafe_GetObjectVolatile
Wed, 31 Aug 2016 09:38:46 +0200 mlarsson 8164939: GTest LogDecorations.iso8601_time_test fails on macOS
Tue, 30 Aug 2016 21:35:56 +0300 kzhaldyb 8157468: gc/testlibrary contains a lot of duplicated code
Fri, 02 Sep 2016 11:18:04 +0200 tschatzl Merge
Fri, 02 Sep 2016 09:49:10 +0200 tschatzl 8164936: G1 age table printout contains contents from previous GC
Fri, 02 Sep 2016 08:51:26 +0200 rehn 8165215: Setting same UL tag multiple times matches wrong tagset
Fri, 02 Sep 2016 01:39:47 +0000 kzhaldyb Merge
Thu, 01 Sep 2016 20:46:40 +0300 kzhaldyb 8164039: Convert test_memset_with_concurrent_readers to GTest
Fri, 02 Sep 2016 00:08:18 +0000 coleenp Merge
Thu, 01 Sep 2016 18:02:13 -0400 coleenp 8165268: [BACKOUT] InstanceKlass::_previous_version_count goes negative
Thu, 01 Sep 2016 15:20:56 -0700 amurillo Merge
Thu, 01 Sep 2016 14:09:01 -0700 amurillo Merge
Thu, 01 Sep 2016 18:15:49 +0300 kzhaldyb Merge
Mon, 29 Aug 2016 20:15:12 +0300 kzhaldyb 8164230: Convert TestCodeCacheRemSet_test to GTest
Mon, 22 Aug 2016 16:43:56 +0300 kzhaldyb 8164028: Convert TestPredictions_test to GTest
Mon, 15 Aug 2016 13:18:35 +0300 kzhaldyb 8163860: Convert TestOldFreeSpaceCalculation_test to GTest
Mon, 29 Aug 2016 14:11:22 +0200 mlarsson 8157948: UL allows same log file with multiple file=
Wed, 24 Aug 2016 19:21:20 +0300 kzhaldyb 8164743: Convert TestAsUtf8 to GTest
Wed, 24 Aug 2016 18:10:09 +0300 kzhaldyb 8164738: Convert AltHashing_test to GTest
Thu, 01 Sep 2016 08:30:17 +0200 rehn 8163589: Add back class id intrinsic method for event based tracing
Wed, 31 Aug 2016 19:41:57 -0400 mdoerr 8165014: Unaligned unsafe access should throw InternalError on Solaris
Wed, 31 Aug 2016 16:41:01 +0000 hseigel Merge
Wed, 31 Aug 2016 10:27:32 -0400 hseigel 8162412: Ignore any System property specified as -Djdk.module that matches reserved module system properties
Wed, 31 Aug 2016 16:48:26 +0200 erikj 8164862: 2 JVMCI tests should not be executed on linux-x86
Wed, 31 Aug 2016 06:35:19 -0400 coleenp 8164692: InstanceKlass::_previous_version_count goes negative
Wed, 31 Aug 2016 11:47:14 +0300 dsamersoff 8163150: SA: CLHSDB printmdo throws an exception with "java.lang.InternalError: missing reason for 22"
Tue, 30 Aug 2016 23:48:16 -0400 kbarrett 8156500: Move Reference pending list into VM to prevent deadlocks
Tue, 30 Aug 2016 12:48:03 +0300 akulyakh 8148103: add more tests for task "Update JDI and JDWP for modules"
Tue, 30 Aug 2016 09:25:18 +0000 dsamersoff Merge
Tue, 30 Aug 2016 11:06:25 +0300 dsamersoff 8164562: serviceability/sa/TestInstanceKlassSizeForInterface.java: fails with NPE
Tue, 30 Aug 2016 09:17:49 +0200 tschatzl 8155917: Memory access in free regions during G1 full gc causes regressions in SPECjvm2008 scimark.fft,lu,sor,sparse with 9+116 on Linux-x64
Mon, 29 Aug 2016 20:13:45 -0400 dholmes 8158854: Ensure release_store is paired with load_acquire in lock-free code
Mon, 29 Aug 2016 23:04:48 +0400 dfazunen 8164660: MinimalVM is not tested with GC tests
Fri, 26 Aug 2016 14:27:41 +0200 mlarsson 8150823: UL disables log outputs incorrectly
Tue, 05 Apr 2016 16:51:58 +0200 mlarsson 8150894: Unused -Xlog tag sequences are silently ignored.
Fri, 26 Aug 2016 14:47:52 -0700 iveresov Merge
Thu, 25 Aug 2016 02:10:03 -0700 jcm 8158639: C2 compilation fails with SIGSEGV
Thu, 25 Aug 2016 12:52:18 +0300 vlivanov 8155635: C2: Mixed unsafe accesses break alias analysis
Thu, 25 Aug 2016 12:51:10 +0300 vlivanov 8162101: C2: Handle "wide" aliases for unsafe accesses
Tue, 23 Aug 2016 22:31:48 +0000 dnsimon Merge
Tue, 23 Aug 2016 22:24:31 +0000 dnsimon 8164358: [JVMCI] expose Hotspot intrinsics and HotSpotIntrinsicCandidate info to JVMCI
Tue, 23 Aug 2016 12:26:05 -0700 vdeshpande 8151988: Hotspot deoptimizes div/mod pair usage
Tue, 23 Aug 2016 18:03:37 +0000 tpivovarova Merge
Tue, 23 Aug 2016 19:53:40 +0300 tpivovarova 8164648: [TESTBUG] jittester failed compilation after 8157957
Tue, 23 Aug 2016 18:57:21 +0200 dpochepk Merge
Tue, 23 Aug 2016 19:30:56 +0300 dpochepk 8164608: [TESTBUG] compiler/profiling tests fail to compile
Tue, 23 Aug 2016 15:16:45 +0000 dnsimon 8164214: [JVMCI] include VarHandle in signature polymorphic method test
Tue, 23 Aug 2016 13:44:26 +0200 thartmann 8038348: Instance field load is replaced by wrong data Phi
Mon, 22 Aug 2016 20:30:37 +0000 dnsimon Merge
Mon, 22 Aug 2016 19:29:15 +0000 dnsimon 8163864: [JVMCI] move MethodProfileWidth to jvmci_globals.hpp
Mon, 22 Aug 2016 11:47:15 -0700 iveresov 8164122: C1: assert(false) failed: stack or locks not matching (invalid bytecodes)
Fri, 19 Aug 2016 18:51:15 -0700 iveresov Merge
Fri, 19 Aug 2016 15:29:57 -0700 iveresov Merge
Sat, 20 Aug 2016 00:15:45 +0300 dpochepk 8139700: compiler/jvmci/compilerToVM/DisassembleCodeBlobTest and InvalidateInstalledCodeTest timeout
Fri, 19 Aug 2016 14:35:15 -0700 iveresov Merge
Fri, 19 Aug 2016 08:34:30 +0200 thartmann 8064892: Non-methods code cache overflow is not handled correctly
Thu, 18 Aug 2016 14:31:02 -0700 kvn 8162496: missing precedence edge for anti_dependence
Fri, 26 Aug 2016 10:14:14 -0700 amurillo Merge
Fri, 26 Aug 2016 06:37:34 -0700 iklam 8161280: assert failed: reference count underflow for symbol
Fri, 26 Aug 2016 13:11:20 +0300 dsamersoff 8163346: Update jmap-hashcode/Test8028623.java for better diagnostic of timeout.
Thu, 25 Aug 2016 12:24:05 +0900 ysuenaga 8163581: Heap Parameters in HSDB cannot handle G1CollectedHeap
Thu, 25 Aug 2016 13:48:42 +0000 rprotacio Merge
Thu, 25 Aug 2016 09:23:45 -0400 rprotacio 8148854: Class names "SomeClass" and "LSomeClass;" treated by JVM as an equivalent
Thu, 25 Aug 2016 08:40:53 -0400 ctornqvi 8164737: Remove Unsafe dependency from ProcessTools
Thu, 25 Aug 2016 14:12:09 +0400 dfazunen 8164133: Tests gc/arguments/TestAlignmentToUseLargePages.java and gc/cms/TestBubbleUpRef.java use too small heap
Thu, 15 Sep 2016 17:15:52 +0000 lana Added tag jdk-9+136 for changeset a20da289f646
Thu, 08 Sep 2016 21:11:53 +0000 lana Added tag jdk-9+135 for changeset 3b1c4562953djdk-9+136
Fri, 02 Sep 2016 02:41:12 +0000 lana Mergejdk-9+135
Wed, 31 Aug 2016 09:22:53 -0700 amurillo Merge
Fri, 26 Aug 2016 10:02:47 -0700 amurillo Merge
Wed, 24 Aug 2016 19:54:03 -0400 dholmes 8157904: Atomic::cmpxchg for jbyte is missing a fence on initial failure
Wed, 24 Aug 2016 20:38:21 +0200 rehn 8164208: Update tests with redefine classes UL options and tags?
Tue, 23 Aug 2016 21:49:33 -0400 ctornqvi 8163146: Remove os::check_heap on Windows
Tue, 23 Aug 2016 22:51:24 +0200 egahlin Merge
Tue, 23 Aug 2016 20:38:19 +0200 egahlin Merge
Tue, 23 Aug 2016 19:21:48 +0200 egahlin 8164523: Clean up metadata for event based tracing
Tue, 23 Aug 2016 19:20:13 +0000 coleenp Merge
Tue, 23 Aug 2016 13:44:59 -0400 coleenp 8038797: JVMTI FollowReferences does not report roots reachable from nmethods
Tue, 23 Aug 2016 17:27:56 +0000 ctornqvi Merge
Tue, 23 Aug 2016 13:20:51 -0400 ctornqvi 8155964: Create a set of tests for verifying the Minimal VM
Mon, 22 Aug 2016 15:54:22 +0000 rprotacio Merge
Mon, 22 Aug 2016 11:06:18 -0400 rprotacio 8163973: VM Anonymous classes should not call Class File Load Hooks
Mon, 22 Aug 2016 16:48:04 +0200 sjohanss 8163413: gc/metaspace/TestMetaspacePerfCounters failure
Thu, 14 Jul 2016 09:52:03 +0200 mlarsson 8061219: Implement unit-tests for UL
Sun, 21 Aug 2016 20:56:37 -0400 dholmes 8157907: Incorrect inclusion of atomic.hpp instead of atomic.inline.hpp
Sun, 21 Aug 2016 06:18:09 +0200 iveresov Merge
Fri, 19 Aug 2016 18:48:25 -0700 iveresov Merge
Fri, 19 Aug 2016 14:33:52 -0700 iveresov Merge
Thu, 18 Aug 2016 11:26:35 +0300 iignatyev 8164035: compiler/profiling/spectrapredefineclass_classloaders/Launcher.java failing with Agent JAR not found or no Agent-Class attribute
Wed, 17 Aug 2016 22:34:33 +0200 neliasso Merge
Mon, 15 Aug 2016 16:04:16 +0200 neliasso 8156659: assert(CodeCache::find_blob_unsafe(_pc) == _cb) failed: inconsistent
Wed, 17 Aug 2016 22:09:57 +0300 vlivanov 8164103: C2: Broken cmpxchgb encoding on x86
Wed, 17 Aug 2016 06:23:04 +0000 thartmann Merge
Wed, 17 Aug 2016 08:19:06 +0200 thartmann 8164091: VM fails during startup with "assert(resolved_method->method_holder()->is_linked()) failed: must be linked"
Tue, 16 Aug 2016 17:54:08 +0000 dlong Merge
Tue, 16 Aug 2016 09:19:13 -0700 dlong 8161598: Kitchensink fails: assert(nm->insts_contains(original_pc)) failed: original PC must be in nmethod/CompiledMethod
Tue, 16 Aug 2016 17:31:57 +0100 aph 8164113: AArch64: follow-up the fix for 8161598
Mon, 15 Aug 2016 14:08:01 -0700 iveresov 8163962: [JVMCI] integrate VarHandles
Sat, 20 Aug 2016 09:35:40 -0400 ctornqvi 8164521: compiler/rangechecks/TestRangeCheckSmearing.java is missing @build for sun.hotspot.WhiteBox
Fri, 19 Aug 2016 23:57:42 +0000 kbarrett Merge
Sun, 14 Aug 2016 21:19:42 -0400 kbarrett 8155043: BitMap set operations assume clear bits beyond unaligned end
Fri, 19 Aug 2016 22:28:32 +0000 amurillo Merge
Fri, 19 Aug 2016 12:17:31 -0700 amurillo Merge
Fri, 19 Aug 2016 22:42:25 +0200 coleenp Merge
Fri, 19 Aug 2016 14:54:31 -0400 coleenp 8145964: NoClassDefFound error in transforming lambdas
Fri, 19 Aug 2016 20:38:30 +0200 acorn Merge
Fri, 19 Aug 2016 11:32:43 -0400 acorn 8163808: Fix asserts and logging for old classfile vtable construction
Fri, 19 Aug 2016 18:20:22 +0200 ctornqvi Merge
Fri, 19 Aug 2016 10:06:30 -0400 ctornqvi 8157957: ClassNotFoundException: jdk.test.lib.JDKToolFinder
Fri, 19 Aug 2016 16:02:21 +0200 erikj 8164297: Jtreg test exeinvoke fails to link on Ubuntu
Fri, 19 Aug 2016 01:20:39 -0400 ysuenaga 8164319: CLHSDB dumpcodecache throws StackOverflowError
Thu, 18 Aug 2016 21:37:26 -0400 dholmes 8152849: share/vm/runtime/mutex.cpp:1161 assert(((uintptr_t(_owner))|(uintptr_t(_LockWord.FullWord))|(uintptr_t(_EntryList))|(uintptr_t(_WaitSet))|(uintptr_t(_OnDeck))) == 0) failed
Thu, 18 Aug 2016 10:47:09 -0400 coleenp 8037138: x86: problem with JVMTI breakpoint
Thu, 18 Aug 2016 11:11:40 +0000 dsamersoff Merge
Thu, 18 Aug 2016 14:07:00 +0300 dsamersoff 8157236: attach on ARMv7 fails with com.sun.tools.attach.AttachNotSupportedException: Unable to open socket file
Thu, 18 Aug 2016 12:10:18 +0300 dsamersoff 8151345: compiler/codecache/jmx/PeakUsageTest.java is failing on jdk9/dev for JPRT -testset hotspot
Tue, 30 Aug 2016 17:48:27 -0700 mchung 8160851: Remove old launcher module-related options
Thu, 01 Sep 2016 23:20:10 +0000 lana Added tag jdk-9+134 for changeset b8b694c6b4d2
Thu, 25 Aug 2016 22:36:30 +0000 lana Mergejdk-9+134
Fri, 19 Aug 2016 17:19:47 +0200 jwilhelm 8164124: [BACKOUT] G1 does not implement millis_since_last_gc which is needed by RMI GC
Thu, 25 Aug 2016 21:18:44 +0000 lana Added tag jdk-9+133 for changeset a25e0fb60332
Fri, 19 Aug 2016 11:22:14 -0700 amurillo Mergejdk-9+133
Tue, 16 Aug 2016 09:56:18 -0400 hseigel 8030221: Checking for anonymous class should check for NULL as well as potential nesting
Mon, 15 Aug 2016 13:14:08 -0700 cjplummer 8133740: NMT for Linux/x86/x64 and bsd/x64 slowdebug builds includes NativeCallStack::NativeCallStack() frame in backtrace
Mon, 15 Aug 2016 13:13:48 -0700 cjplummer 8133747: NMT includes an extra stack frame due to assumption NMT is making on tail calls being used
Mon, 15 Aug 2016 13:06:50 -0700 cjplummer 8133749: os::current_frame() is not returning the proper frame on ARM and solaris-x64
Mon, 15 Aug 2016 16:15:16 +0200 erikj 8069540: Remove universal binaries support from hotspot build
Tue, 09 Aug 2016 21:57:29 +0900 ysuenaga 8163185: jhsdb jstack cannot work with normal mode
Fri, 12 Aug 2016 14:12:55 -0700 amurillo Merge
Fri, 12 Aug 2016 08:46:17 -0700 fparain 8146697: VM crashes in test Test7005594
Fri, 12 Aug 2016 00:19:44 -0400 dholmes 8159461: bigapps/Kitchensink/stressExitCode hits assert: Must be VMThread or JavaThread
Thu, 11 Aug 2016 16:22:08 -0700 iveresov Merge
Tue, 09 Aug 2016 16:47:47 +0300 dpochepk 8160299: Test8015436 doesn't check which method was executed
Tue, 09 Aug 2016 14:17:28 +0300 dpochepk 8163366: compiler/codecache/jmx/ThresholdNotificationsTest.java doesn't set -XX:+UnlockDiagnosticVMOptions while using WB
Tue, 09 Aug 2016 14:16:44 +0300 dpochepk 8160083: compiler.codecache.jmx.InitialAndMaxUsageTest can not be used w/ disabled SegmentedCodeCache
Mon, 08 Aug 2016 17:06:21 +0200 dnsimon 8163105: SIGSEGV: constantPoolHandle::constantPoolHandle(ConstantPool*)
Mon, 08 Aug 2016 11:30:46 +0300 dpochepk 8163243: [TESTBUG] compiler/codecache/jmx/UsageThresholdIncreasedTest.java failed with: Failed to find sun/hotspot/WhiteBox.class
Sat, 06 Aug 2016 11:52:37 -0700 iveresov 8163313: assert(comp != __null) failed: compiler not available
Fri, 05 Aug 2016 13:37:53 -0700 iveresov Merge
Fri, 05 Aug 2016 16:23:44 +0300 dpochepk 8157498: compiler/codecache/jmx/InitialAndMaxUsageTest.java times out on 32-bit platforms
Fri, 05 Aug 2016 16:22:30 +0300 dpochepk 8161279: Various JMX-tests timed out
Thu, 04 Aug 2016 22:42:05 -0400 mdoerr 8162369: PPC64: Wrong ucontext used after SIGTRAP while in HTM critical section
Thu, 04 Aug 2016 10:34:34 +0200 thartmann 8136818: Test compiler/arraycopy/TestEliminatedArrayCopyDeopt.java fails with "m1 failed"
Thu, 04 Aug 2016 08:58:22 +0200 thartmann 8162881: Effect of -XX:CICompilerCount depends on ordering of other flags
Wed, 03 Aug 2016 15:52:38 +0000 never Merge
Tue, 02 Aug 2016 17:12:16 -0700 never 8162477: [JVMCI] assert(wf.check_method_context(ctxk, m)) failed: proper context
Tue, 02 Aug 2016 19:46:29 -0700 kvn 8163018: Slow compiler tests in JPRT
Thu, 11 Aug 2016 21:35:09 +0200 dcubed Merge
Thu, 11 Aug 2016 16:13:05 +0000 lfoltan Merge
Thu, 11 Aug 2016 11:41:11 -0400 lfoltan 8162553: Crash in class unloading due to null CLD having a zero _keep_alive value
Thu, 11 Aug 2016 17:47:25 +0300 dsamersoff 8163143: illegal bci error with interpreted frames in SA due to mirror being stored in interpreted frames
Wed, 10 Aug 2016 21:02:14 -0400 ysuenaga 8163580: Cannot get Monitor Cache Dump in HSDB
Wed, 10 Aug 2016 09:24:42 +0200 rehn 8161026: GPL header missing comma in year
Thu, 18 Aug 2016 21:33:36 +0000 lana Merge
Tue, 16 Aug 2016 08:08:00 -0700 amurillo Merge
Thu, 11 Aug 2016 12:27:20 -0700 dcubed 8163879: quarantine serviceability/sa/sadebugd/SADebugDTest.java since it hangs intermittently
Fri, 12 Aug 2016 13:58:14 -0700 amurillo Merge
Mon, 08 Aug 2016 15:53:02 +0000 dsamersoff Merge
Mon, 08 Aug 2016 21:59:12 +0900 ysuenaga 8163272: jhsdb jinfo cannot show system properties
Mon, 08 Aug 2016 17:15:46 +0300 dsamersoff 8163269: Testcase missed in push for JDK-8160817
Fri, 05 Aug 2016 09:58:09 -0700 amurillo Merge
Thu, 04 Aug 2016 16:11:49 -0700 cjplummer 8162670: make of jtreg_tests fails if no tests are run, causing jprt test runs to also fail
Thu, 04 Aug 2016 23:17:33 +0200 mockner Merge
Thu, 04 Aug 2016 12:55:28 -0400 mockner 8145543: JPRT jobs see intermittent failures in compiler/floatingpoint/ModNaN.java
Thu, 04 Aug 2016 19:50:23 +0000 coleenp Merge
Thu, 04 Aug 2016 10:11:35 -0700 gthornbr 8162999: Build give extraneous find warnings
Thu, 04 Aug 2016 20:28:12 +0200 mockner Merge
Thu, 04 Aug 2016 18:34:40 +0200 mockner Merge
Thu, 04 Aug 2016 12:24:10 -0400 mockner 8159917: Space character is missing in ClassLoaderData::print_value_on
Thu, 04 Aug 2016 14:04:14 +0300 lmesnik 8162852: Mark stress compiler and gc tests with stress keyword
Wed, 03 Aug 2016 15:55:40 -0700 iveresov Merge
Tue, 02 Aug 2016 11:06:25 -0700 dlong 8029441: assert(!((nmethod*)_cb)->is_deopt_pc(_pc)) failed: invariant broken
Mon, 01 Aug 2016 22:34:23 -0700 kvn Merge
Sat, 30 Jul 2016 04:05:28 -0700 roland 8161652: Crash with assert(ft == _type) failed in PhiNode::Value()
Wed, 03 Aug 2016 13:56:27 -0700 cjplummer 8161030: GPL header missing comma after year
Wed, 03 Aug 2016 09:40:21 -0400 coleenp 8159284: bigapps/Jetty - assert(jfa->last_Java_sp() > sp()) failed with JFR in use
Tue, 02 Aug 2016 20:55:27 -0700 dcubed Merge
Tue, 02 Aug 2016 13:48:07 -0700 gthornbr 8161696: [TESTBUG] runtime/StackGuardPages/testme.sh uses invalid argument -Xss328k
Wed, 03 Aug 2016 02:10:23 +0000 jprovino Merge
Tue, 02 Aug 2016 16:39:33 -0400 jprovino 8071770: G1 does not implement millis_since_last_gc which is needed by RMI GC
Thu, 18 Aug 2016 21:01:21 +0000 lana Added tag jdk-9+132 for changeset 713951c08aa2
Fri, 12 Aug 2016 08:59:20 -0700 mhaupt 8163533: jdk.vm.ci.hotspot.test.MethodHandleAccessProviderTest fails on jdk9/devjdk-9+132
Thu, 11 Aug 2016 17:02:27 +0000 lana Merge
Wed, 10 Aug 2016 15:48:04 -0700 hseigel 8136930: Simplify use of module-system options by custom launchers
Thu, 11 Aug 2016 15:47:07 +0000 lana Added tag jdk-9+131 for changeset 943bf73b49c3
Fri, 05 Aug 2016 09:50:25 -0700 amurillo Mergejdk-9+131
Tue, 02 Aug 2016 16:24:04 -0400 dholmes 7008747: Header files with conditional behaviour can not be precompiled
Tue, 02 Aug 2016 15:22:41 +0300 mchernov 8161604: TestNewSizeFlags fails with RuntimeException: max new size != MaxNewSize value
Mon, 01 Aug 2016 20:47:51 -0700 kvn Merge
Fri, 29 Jul 2016 17:41:14 +0300 tpivovarova 8161138: testlibrary_tests/ctw/* failed with "Failed. Unexpected exit from test [exit code: 0]"
Mon, 01 Aug 2016 20:41:15 -0400 clanger 8162869: Small fixes for AIX perf memory and attach listener
Mon, 01 Aug 2016 16:28:23 -0400 coleenp 8161445: [BACKOUT] MemberNameTable doesn't purge stale entries
Mon, 01 Aug 2016 15:38:58 +0300 dsamersoff 8160817: Add jsadebugd functionality to jhsdb
Mon, 01 Aug 2016 10:51:22 +0300 dsamersoff 8158050: Remove SA-JDI
Fri, 29 Jul 2016 16:50:45 -0700 amurillo Merge
Fri, 29 Jul 2016 16:11:55 -0700 amurillo Merge
Fri, 29 Jul 2016 20:23:24 +0000 jmasa Merge
Wed, 08 Jun 2016 14:11:51 -0700 jmasa 8159073: : Error handling incomplete when creating GC threads lazily
Fri, 29 Jul 2016 11:38:07 -0700 dcubed 8161601: Solaris: __USE_LEGACY_PROTOTYPES__ is redundant and should be removed
Fri, 29 Jul 2016 08:17:43 +0000 rbackman Merge
Fri, 29 Jul 2016 09:23:05 +0200 rbackman Merge
Thu, 28 Jul 2016 16:09:31 +0300 dpochepk 8162603: Unrecognized VM option 'UseCountedLoopSafepoints'
Thu, 28 Jul 2016 08:19:35 +0000 zmajo Merge
Wed, 27 Jul 2016 12:33:33 +0200 roland 8162384: Performance regression: bimorphic inlining may be bypassed by type speculation
Wed, 27 Jul 2016 10:56:01 -0700 dlong 8160742: Node::operator new invokes undefined behavior
Wed, 20 Jul 2016 12:34:11 +0200 goetz 8161907: adlc: Fix crash in cisc_spill_match if _rChild == NULL
Mon, 25 Jul 2016 14:31:42 -0700 roland 8161147: jvm crashes when -XX:+UseCountedLoopSafepoints is enabled
Thu, 23 Jun 2016 17:58:59 +0000 aph 8157306: Random infrequent null pointer exceptions in javac
Mon, 25 Jul 2016 21:02:51 +0300 dpochepk 8162376: TestSHA512Intrinsics.java failed with Unexpected count of intrinsic _sha5_implCompress is expected
Fri, 22 Jul 2016 12:47:08 -1000 twisti 8162427: fix indent in CompileTask::print_tty
Mon, 18 Jul 2016 20:45:51 +0200 roland 8161651: Logic in ConnectionGraph::split_unique_types() wrongly assumes node always have memory input
Fri, 22 Jul 2016 17:52:03 +0000 dnsimon Merge
Wed, 20 Jul 2016 22:18:13 +0000 dnsimon 8161265: [JVMCI] EnableJVMCI should only be required when its not implied by other flags
Fri, 22 Jul 2016 17:05:08 +0100 aph 8161190: AArch64: Fix overflow in immediate cmp instruction
Wed, 20 Jul 2016 19:35:08 +0300 dpochepk 8071652: -XX:CompileOnly does not behave as documented
Wed, 20 Jul 2016 19:33:22 +0300 dpochepk 8161695: compiler/jsr292/MHInlineTest.java can't be run on client-only platforms
Wed, 20 Jul 2016 19:31:34 +0300 dpochepk 8158756: [Testbug] serviceability/dcmd/compiler/CompilerQueueTest.java fails with TieredStopAtLevel=1
Wed, 20 Jul 2016 19:29:10 +0300 dpochepk 8161508: JVMCI: MaterializeVirtualObjectTest fails w/ "CASE: invalidate=true: has no virtual object before materialization
Tue, 19 Jul 2016 18:17:40 -0700 never 8161603: [JVMCI] HotSpotVMConfig.baseVtableLength is incorrectly computed
Tue, 19 Jul 2016 18:59:11 +0000 dnsimon 8161274: [JVMCI] compiler/jvmci/events/JvmciNotifyInstallEventTest.java fails with NoClassDefFound
Tue, 19 Jul 2016 18:11:03 +0000 never 8161292: [JVMCI] missing test files from 8159368
Tue, 19 Jul 2016 13:15:46 +0200 rbackman Merge
Thu, 23 Jun 2016 22:33:46 +0200 goetz 8160245: C1: Clean up platform #defines in c1_LIR.hpp.
Thu, 14 Jul 2016 20:11:55 +0300 dpochepk 8157861: [TESTBUG] compiler/jvmci/compilerToVM/ReprofileTest.java failed with RuntimeException
Thu, 14 Jul 2016 20:10:16 +0300 dpochepk 8157984: [TESTBUG] Several compiler tests fails when are executed with -XX:TieredStopAtLevel=1
Thu, 14 Jul 2016 14:44:53 +0000 tpivovarova Merge
Wed, 13 Jul 2016 18:03:15 +0300 tpivovarova 8151280: update hotspot tests to use vm.compMode instead of their own logic
Thu, 14 Jul 2016 15:18:15 +0100 aph Merge
Wed, 13 Jul 2016 15:19:34 +0100 aph 8159467: AArch64: Enable compact strings
Fri, 08 Jul 2016 17:11:37 +0100 aph 8161072: AArch64: jtreg compiler/uncommontrap/TestDeoptOOM failure
Thu, 14 Jul 2016 08:33:08 +0200 mhaupt 8161068: jdk.vm.ci.hotspot.test.MethodHandleAccessProviderTest fails
Wed, 13 Jul 2016 19:08:07 +0300 ppunegov 8160761: [TESTBUG] Several compiler tests fail with product bits
Mon, 04 Jul 2016 16:28:27 +0200 goetz 8056950: Compiled code (64-bit) on SPARC should sign extend INT parameters passed on registers to runtime or native methods.
Tue, 12 Jul 2016 20:42:46 +0000 sanzinger 8159368: [JVMCI] SPARCHotSpotRegisterConfig.callingConvention gives incorrect calling convention for native calls containing fp args
Tue, 12 Jul 2016 18:24:48 +0300 tpivovarova 8132919: Put compiler tests in packages
Tue, 12 Jul 2016 08:42:46 +0000 zmajo Merge
Tue, 12 Jul 2016 10:16:36 +0200 zmajo 8098573: Compiler accesses to shared archive fail if archive is remapped
Tue, 12 Jul 2016 08:57:00 +0200 thartmann 8160898: assert while replaying ciReplay file created using TieredStopAtLevel=1
Mon, 11 Jul 2016 19:15:21 +0000 dnsimon 8160730: [JVMCI] compiler selection should work without -Djvmci.Compiler
Mon, 11 Jul 2016 13:14:19 +0200 rbackman Merge
Fri, 08 Jul 2016 21:26:02 +0300 iignatyev 8160657: Compiler HotSpot tests should use the "run driver" directive where applicable
Fri, 08 Jul 2016 20:14:18 +0300 dpochepk 8160276: Jittester: bytecode tests generation hangs in ClassWriter infinite loop
Fri, 08 Jul 2016 17:02:10 +0100 aph 8160969: aarch64: CDS is broken after 8079507
Thu, 07 Jul 2016 15:39:12 +0100 aph Merge
Thu, 07 Jul 2016 15:07:13 +0100 aph 8141633: Implement VarHandles/Unsafe intrinsics on AArch64
Thu, 07 Jul 2016 13:53:52 +0300 tpivovarova 8160773: error: package jdk.internal.jimage does not exist
Wed, 06 Jul 2016 15:05:28 +0300 vlivanov 8160360: Mismatched field loads are folded in LoadNode::Value
Tue, 05 Jul 2016 17:57:20 -0700 dnsimon 8159888: [JVMCI] the client VM build is broken when INCLUDE_JVMCI is defined
Tue, 05 Jul 2016 07:57:09 +0200 thartmann 8159129: TestStringIntrinsicRangeChecks fails w/ No exception thrown for compressByte/inflateByte
Mon, 04 Jul 2016 09:14:02 +0200 thartmann 8160651: StubRoutines::_dtan does not restore callee save register rbx
Sat, 02 Jul 2016 00:27:19 +0000 dnsimon 8160647: [JVMCI] need to be able to copy internal arrays from LocalVariableTable and LineNumberTable
Thu, 30 Jun 2016 05:05:52 -0700 rraghavan 8153194: PreserveFPRegistersTest.java runs out of memory in the nightlies.
Tue, 24 May 2016 01:13:57 -0700 enevill 8156943: aarch64: string compare does not support CompactStrings
Thu, 30 Jun 2016 08:24:51 +0200 thartmann 8160425: Vectorization with signalling NaN returns wrong result
Wed, 29 Jun 2016 18:04:04 +0300 ppunegov 8160471: compiler/rangechecks/TestRangeCheckEliminationDisabled.java fails after JDK-8150900
Wed, 29 Jun 2016 11:38:58 +0000 tpivovarova Merge
Wed, 29 Jun 2016 14:32:13 +0300 tpivovarova 8153515: [ctw] CompileTheWorld testlibrary should trigger compilation of <clinit> and <init>
Wed, 29 Jun 2016 11:24:13 +0000 enevill 8160534: aarch64: fails to build after 8157834
Tue, 28 Jun 2016 20:08:43 +0000 never Merge
Tue, 28 Jun 2016 17:22:56 +0000 never 8160121: [JVMCI] JvmciNotifyBootstrapFinishedEventTest.java failed NoClassDefFoundError: jdk/vm/ci/runtime/JVMCI
Tue, 28 Jun 2016 19:58:15 +0300 tpivovarova 8143081: [ctw] Test CompileTheWorld.java needs to be updated for Jigsaw
Mon, 27 Jun 2016 17:23:15 +0300 dpochepk 8132318: -XX:TraceJumps is broken on Sparc
Mon, 27 Jun 2016 10:10:11 +0200 thartmann 8159016: Over-unrolled loop is partially removed
Fri, 24 Jun 2016 15:30:50 -0700 kvn Merge
Fri, 24 Jun 2016 19:06:00 +0000 iveresov Merge
Fri, 24 Jun 2016 11:22:08 -0700 iveresov 8157249: [JVMCI] remove ConstantReflectionProvider.isEmbeddable method
Fri, 24 Jun 2016 17:12:50 +0000 ppunegov Merge
Fri, 24 Jun 2016 19:06:15 +0300 ppunegov 8160085: @library' must appear before first `@run'
Fri, 24 Jun 2016 17:11:17 +0000 rschatz Merge
Fri, 24 Jun 2016 15:45:47 +0000 rschatz 8160177: [JVMCI] race condition in HotSpotMemoryAccessProviderImpl.verifyReadRawObject
Thu, 16 Jun 2016 06:42:08 -0400 enevill 8159063: aarch64: optimise unaligned array copy long
Wed, 22 Jun 2016 17:05:40 +0200 simonis 8159620: -XX:-UseOnStackReplacement does not work together with -XX:+TieredCompilation on ppc64 and sparc
Fri, 29 Jul 2016 08:36:13 +0200 thartmann 8162540: Crash in C2 escape analysis with assert: "node should be registered"
Thu, 28 Jul 2016 09:57:49 -0400 lfoltan 8160487: JVM should validate a module by checking for an instance of java.lang.reflect.Module
Wed, 27 Jul 2016 18:43:52 +0300 mchernov 8159606: gc/g1/TestShrinkAuxiliaryData* tests fail because GC triggered before VM initialization completed
Wed, 27 Jul 2016 21:16:38 +0400 dfazunen 8161990: Un-quarantine TestParallelHeapSizeFlags.java and TestSmallHeap.java.
Wed, 27 Jul 2016 13:33:52 +0000 acorn Merge
Wed, 27 Jul 2016 08:31:48 -0400 acorn 8162340: Better class stream parsing
Tue, 26 Jul 2016 23:52:25 -0400 dholmes 8140723: Remove source code conditionalized on JAVASE_EMBEDDED
Tue, 26 Jul 2016 17:25:58 -0400 jiangli 8156959: compiler/codecache/jmx/UsageThresholdExceededSeveralTimesTest.java fails with exit 134.
Tue, 26 Jul 2016 10:29:27 -0400 lfoltan 8154239: -Xbootclasspath/a breaks exploded build
Tue, 26 Jul 2016 11:04:20 +0200 tschatzl 8161993: G1 crashes if active_processor_count changes during startup
Tue, 26 Jul 2016 11:04:20 +0200 tschatzl 8147910: Cache initial active_processor_count
Wed, 13 Jul 2016 12:23:05 +0200 goetz 8161258: Simplify including platform files.
Mon, 25 Jul 2016 18:52:59 +0000 amurillo Merge
Mon, 25 Jul 2016 15:30:23 +0000 amurillo Merge
Fri, 22 Jul 2016 19:04:38 +0000 amurillo Merge
Fri, 22 Jul 2016 10:35:46 -0700 amurillo Merge
Fri, 22 Jul 2016 10:14:23 -0700 amurillo Merge
Mon, 25 Jul 2016 17:35:25 +0200 ddmitriev Merge
Fri, 22 Jul 2016 16:55:55 +0300 akulyakh 8153978: New test to verify the modules info as returned by the JVMTI
Mon, 25 Jul 2016 09:40:31 -0400 mockner 8038332: The trace event vm/class/load is not always being sent
Fri, 22 Jul 2016 10:15:42 -0700 bchristi 8161028: GPL header missing comma after year
Thu, 21 Jul 2016 14:55:54 +0200 ehelin 8159464: DumpHeap.java hits assert in G1 code
Fri, 22 Jul 2016 02:36:39 -0700 sspitsyn 8145627: sun.jvm.hotspot.oops.InstanceKlass::getSize() returns the incorrect size and has no test
Fri, 22 Jul 2016 04:05:04 +0000 amurillo Merge
Thu, 21 Jul 2016 20:09:19 -0700 amurillo Merge
Thu, 21 Jul 2016 19:50:41 -0700 amurillo Merge
Thu, 21 Jul 2016 19:29:33 -0700 ccheung 8161539: 8159666 breaks minimal VM
Thu, 21 Jul 2016 16:45:56 +0000 dfazunen Merge
Thu, 21 Jul 2016 17:12:35 +0400 dfazunen 8161552: Test issue: VM init failed: GC triggered before VM initialization completed. Try increasing NewSize, current value 768K.
Thu, 21 Jul 2016 16:29:21 +0200 psandoz 8161947: runtime/Unsafe/GetUnsafe.java is failing on jdk9/dev
Thu, 21 Jul 2016 14:06:22 +0200 mgerdin 8161915: Linking gtestLauncher may end up linking with non-gtest libjvm
Wed, 20 Jul 2016 14:47:53 +0300 bmoloden 8160119: Utils.tryFindJvmPid sometimes find incorrect pid
Tue, 19 Jul 2016 22:14:22 +0200 jiangli Merge
Tue, 19 Jul 2016 20:39:23 +0200 jiangli Merge
Tue, 19 Jul 2016 20:07:06 +0200 jiangli Merge
Tue, 19 Jul 2016 13:52:14 -0400 jiangli 8141341: CDS should be disabled if JvmtiExport::should_post_class_file_load_hook() is true.
Tue, 19 Jul 2016 19:05:06 +0000 jmasa Merge
Wed, 06 Jul 2016 13:23:10 -0700 jmasa 8155263: DisableStartThread should not be applied to GC worker threads
Tue, 19 Jul 2016 17:26:51 +0000 gziemski Merge
Tue, 19 Jul 2016 11:00:45 -0500 gziemski 8138760: [JVMCI] VM warning: Performance bug: SystemDictionary lookup_count=21831450 lookup_length=1275207287 average=58.411479 load=5.572844
Tue, 19 Jul 2016 18:15:46 +0300 mchernov 8160827: gc/stress/TestStressG1Humongous.java fails with OOME
Tue, 19 Jul 2016 09:30:30 +0200 tschatzl 8157459: G1 IHOP JFR event attribute with incorrect content type
Tue, 19 Jul 2016 10:31:41 +0200 tschatzl 8034842: Parallelize the Free CSet phase in G1
Mon, 18 Jul 2016 14:20:30 -0700 dcubed 8161173: quarantine compiler/arraycopy/TestEliminatedArrayCopyDeopt.java
Mon, 18 Jul 2016 14:30:39 +0200 mgerdin 8161027: GPL header missing comma after year
Sat, 16 Jul 2016 23:10:00 +0300 igerasim 8160892: Race at the VM exit causes "WaitForMultipleObjects timed out"
Fri, 15 Jul 2016 17:05:10 -0700 dcubed Merge
Fri, 15 Jul 2016 10:46:08 -0700 gthornbr 8144278: [TESTBUG] hotspot/runtime/StackGuardPages/testme.sh should use native library build support
Fri, 15 Jul 2016 10:31:50 -0700 gthornbr 8144279: [TESTBUG] hotspot/runtime/jsig/Test8017498.sh should use native library build support
Fri, 15 Jul 2016 10:25:16 -0700 gthornbr 8081770: [TESTBUG] regression Test7107135 needs to remove dependence on locally installed gcc
Fri, 15 Jul 2016 18:09:33 +0000 dcubed Merge
Fri, 15 Jul 2016 09:36:28 -0700 dcubed 8160997: Solaris: deprecated <pwd.h> and <gid.h> interfaces should be replaced
Fri, 15 Jul 2016 09:10:36 -0700 amurillo Merge
Fri, 15 Jul 2016 12:40:47 +0000 psandoz Merge
Fri, 15 Jul 2016 12:36:18 +0200 psandoz 8151163: All Buffer implementations should leverage Unsafe unaligned accessors
Fri, 15 Jul 2016 13:33:44 +0200 tschatzl 8160897: Concurrent mark mark stack memory allocation leaks memory
Tue, 12 Jul 2016 15:06:18 +0300 mchernov 8158508: gc/logging/TestUnifiedLoggingSwitchStress.java timeout
Wed, 13 Jul 2016 18:26:51 -0700 ccheung 8159901: missing newline char in the exception messages in diagnosticArgument.cpp
Thu, 07 Jul 2016 18:40:53 +0100 andrew 8156980: Hotspot build doesn't have -std=gnu++98 gcc option
Wed, 13 Jul 2016 10:51:19 +0300 dsamersoff 8134434: JVM_DoPrivileged() fires assert(_exception_caught == false) failed: _exception_caught is out of phase
Tue, 21 Jun 2016 19:37:30 +0200 jwilhelm 8024137: Flags should be set using the proper macro
Tue, 21 Jun 2016 19:35:39 +0200 jwilhelm 8048093: Explicitly setting := vs = in the -XX:+PrintFlagsFinal output
Thu, 04 Aug 2016 15:52:14 -0700 darcy 8163231: A couple of runtime tests failing for the -testset hotspot snapshot job
Thu, 04 Aug 2016 17:32:52 +0000 amurillo Added tag jdk-9+130 for changeset 7d54c7056328
Thu, 28 Jul 2016 16:08:14 +0000 amurillo Added tag jdk-9+129 for changeset e96b34b76d86jdk-9+130
Thu, 21 Jul 2016 21:42:16 +0000 vlivanov Mergejdk-9+129
Thu, 21 Jul 2016 20:18:11 +0300 vlivanov 8155781: C2: opaque unsafe access triggers an assert
Thu, 21 Jul 2016 17:14:02 +0000 amurillo Merge
Wed, 20 Jul 2016 10:55:32 -0700 dcubed 8161949: quarantine runtime/Unsafe/GetUnsafe.java to allow sync with JDK9-dev
Wed, 11 May 2016 12:03:46 -0400 hseigel 8155981: Bolster bytecode verification
Wed, 20 Apr 2016 16:39:37 -0400 jiangli 8153312: Constrain AppCDS behavior
Wed, 06 Apr 2016 21:53:44 -0700 iklam 8150752: Share Class Data
Wed, 06 Apr 2016 07:55:32 -0400 hseigel 8152479: Coded byte streams
Tue, 19 Jul 2016 11:02:28 +0200 zmajo Merge
Tue, 19 Jul 2016 10:14:34 +0200 zmajo 8161660: Quarantine TestParallelHeapSizeFlags.java and TestSmallHeap.java
Mon, 18 Jul 2016 15:53:56 +0200 zmajo 8161581: Quarantine compiler/jvmci/jdk.vm.ci.runtime.test/src/jdk/vm/ci/runtime/test/TestResolvedJavaType.java
Fri, 15 Jul 2016 09:05:33 -0700 amurillo Merge
Wed, 06 Jul 2016 20:58:08 +0900 ysuenaga 8153074: UL: Show output option in VM.log jcmd
Sat, 09 Jul 2016 19:20:38 -0700 sspitsyn 8159145: Add JVMTI function GetNamedModule
Fri, 08 Jul 2016 12:17:10 -0700 amurillo Merge
Thu, 19 May 2016 13:59:50 -0700 jmasa 8157240: GC task trace logging is incomprehensible
Tue, 21 Jun 2016 14:00:18 +0200 stefank 8159893: StringTable cleaning log line lacks the GC ID prefix
Thu, 07 Jul 2016 14:58:17 -0700 dcubed 8068592: Remove unused code in objectMonitor.hpp
Thu, 07 Jul 2016 15:40:36 -0400 kbarrett 8160350: cannot truss jdk9 [ solaris ]
Wed, 06 Jul 2016 12:01:07 +0000 zmajo Merge
Wed, 06 Jul 2016 11:16:36 +0200 zmajo 8160527: Check for final instance field updates can be omitted
Wed, 06 Jul 2016 11:22:55 +0200 tschatzl 8159978: Use an array to store the collection set regions instead of linking through regions
Tue, 05 Jul 2016 21:24:24 +0000 dcubed Merge
Tue, 05 Jul 2016 14:00:21 -0700 dcubed 8160739: quarantine tests failing due to -XX:TieredStopAtLevel=1
Tue, 05 Jul 2016 15:34:06 -0400 drwhite 8158946: btree009 fails with assert(s > 0) failed: Bad size calculated
Tue, 05 Jul 2016 20:09:21 +0200 kbarrett Merge
Mon, 04 Jul 2016 12:43:01 +0900 ysuenaga 8160353: narrowing conversion error is occurred with GCC 6
Mon, 13 Jun 2016 14:10:09 -0700 jmasa 8024945: Remove check on minimum size of MetaspaceSize
Tue, 28 Jun 2016 00:24:10 +0900 ysuenaga 8160361: SEGV occurred at JNIHandleBlock::oops_do(OopClosure*)
Mon, 04 Jul 2016 11:27:11 +0200 pliden 8159974: G1 String deduplication logging not aligned with the rest of G1
Sat, 02 Jul 2016 00:26:51 +0000 amurillo Merge
Fri, 01 Jul 2016 16:55:44 -0700 amurillo Merge
Thu, 21 Jul 2016 16:42:57 +0000 amurillo Added tag jdk-9+128 for changeset 22bf6db9767b
Thu, 14 Jul 2016 16:21:57 +0000 amurillo Mergejdk-9+128
Tue, 12 Jul 2016 10:03:30 -0700 amurillo Merge
Fri, 08 Jul 2016 12:12:54 -0700 amurillo Merge
Fri, 01 Jul 2016 23:11:45 +0000 poonam Merge
Fri, 01 Jul 2016 12:51:29 -0700 poonam 8064814: Print more helpful error message when getting OOM due to low Java Heap base when running with CompressedOops
Thu, 30 Jun 2016 19:16:14 -0400 kbarrett 8160356: invalid suffix on literal warning is occurred with GCC 6
Fri, 01 Jul 2016 13:39:36 +0200 ctornqvi Merge
Fri, 01 Jul 2016 07:21:33 -0400 ctornqvi 8160484: Implement Hotspot Runtime tier 2
Fri, 01 Jul 2016 11:55:25 +0200 erikj 8158629: bash >(...) construct still causes race conditions
Wed, 29 Jun 2016 16:11:50 +0200 mlarsson 8159695: Arguments::atojulong() fails to detect overflows
Thu, 30 Jun 2016 00:19:48 +0000 coleenp Merge
Wed, 29 Jun 2016 20:16:05 -0400 coleenp 8160551: assert(c == Bytecodes::_putfield) failed: must be putfield
Wed, 29 Jun 2016 18:40:28 +0300 kzhaldyb 8132711: Add tests which check that Humongous objects behave as expected after Mixed GC
Wed, 29 Jun 2016 17:01:55 +0300 kzhaldyb 8132715: Add tests which check that no allocations allowed in any of humongous regions
Tue, 28 Jun 2016 10:11:01 -0400 lfoltan 8159262: Walking PackageEntry Export and ModuleEntry Reads Must Occur Only When Neccessary And Wait Until ClassLoader's Aliveness Determined
Tue, 28 Jun 2016 10:37:52 +0200 pliden 8159890: SIGSEGV with UseStringDeduplication and UseSharedSpaces/RequireSharedSpaces
Tue, 12 Jul 2016 10:39:46 +0200 mhaupt 8161032: GPL header incorrect - address wrong - not swapped in licensee bundles
Thu, 14 Jul 2016 15:47:44 +0000 amurillo Added tag jdk-9+127 for changeset 352357128f60
Tue, 12 Jul 2016 21:14:52 +0000 amurillo Mergejdk-9+127
Fri, 08 Jul 2016 20:11:22 +0300 dsamersoff 8161074: Quarantine jdk/vm/ci/hotspot/test/MethodHandleAccessProviderTest.java in JDK9-dev
Thu, 07 Jul 2016 18:35:44 +0000 amurillo Merge
Thu, 07 Jul 2016 19:00:43 +0000 amurillo Merge
Fri, 01 Jul 2016 16:50:34 -0700 amurillo Merge
Mon, 27 Jun 2016 09:35:18 +0200 pliden 8158871: Long response times with G1 and StringDeduplication
Sun, 26 Jun 2016 20:00:45 -0700 iklam 8148813: Windows os::check_heap needs more information
Fri, 24 Jun 2016 15:09:00 -0700 kvn Merge
Thu, 23 Jun 2016 10:22:36 -0700 never 8160197: [JVMCI] AllocatableValue.toString overrides are missing reference information
Thu, 23 Jun 2016 15:41:33 +0000 dpochepk Merge
Thu, 23 Jun 2016 17:40:20 +0300 dpochepk 8159730: compiler/jvmci/compilerToVM/IsMatureTest failed with "Multiple times invoked method should have method data (assert failed: 0 != 0)"
Thu, 23 Jun 2016 17:39:49 +0300 dpochepk 8159803: Jittester: FileAlreadyExists exception during tests generation
Thu, 23 Jun 2016 17:39:06 +0300 dpochepk 8158650: [jittester] when generating tests with default parameters, generation hangs after 98 test
Thu, 23 Jun 2016 17:38:29 +0200 mdoerr 8159976: PPC64: Add missing intrinsics for sub-word atomics
Thu, 23 Jun 2016 05:13:55 +0000 dnsimon 8159613: [Findbugs] various warnings reported for JVMCI sources
Wed, 22 Jun 2016 23:31:33 +0000 never Merge
Wed, 22 Jun 2016 22:39:32 +0000 never 8158850: [JVMCI] be more precise when enforcing OopMapValue encoding limitations
Thu, 23 Jun 2016 00:37:25 +0200 iignatyev Merge
Wed, 22 Jun 2016 20:06:39 +0300 lmesnik 8158581: ciReplay can not be run w/ JFR enabled
Wed, 22 Jun 2016 00:29:32 +0300 iignatyev 8132920: use package in compiler testlibraries
Wed, 22 Jun 2016 21:24:07 +0300 iignatyev 8160025: compiler/testlibrary/uncommontrap/Verifier doesn't close FileReader
Wed, 22 Jun 2016 21:13:52 +0000 never 8159856: [JVMCI] InterpreterFrameSizeTest.java failed compilation
Wed, 22 Jun 2016 13:29:09 +0300 shade 8156803: Turn StressLCM/StressGCM flags to diagnostic
Tue, 21 Jun 2016 13:15:56 -0400 adinn 8160006: Fix AArch64 after changes made by 8151661
Tue, 21 Jun 2016 13:14:33 -0400 adinn 8151661: Performance regression on Solaris-SPARC in 9-b103
Mon, 20 Jun 2016 13:06:33 +0200 psandoz 8158039: VarHandle float/double field/array access should support CAS/set/add atomics
Mon, 20 Jun 2016 08:11:22 -0400 cvarming 8159720: Failure of C2 compilation with tiered prevents some C1 compilations.
Wed, 15 Jun 2016 09:46:15 +0200 rbackman 8139379: Tests fail with assert(nm->insts_contains(original_pc)) failed: original PC must be in nmethod