log

age author description
Fri, 31 Jan 2014 09:57:50 +0100 tschatzl 6991197: G1: specialize deal_with_reference() for narrowOop*
Fri, 31 Jan 2014 09:55:59 +0100 tschatzl 8032771: The flag VerifySilently misses a test case
Tue, 11 Feb 2014 10:05:02 -0800 iklam Merge
Tue, 11 Feb 2014 08:43:17 -0800 iklam 7182040: volano29 limited by os resource on Linux - need better diagnostic message
Mon, 10 Feb 2014 21:29:14 -0800 minqi 8033792: AltHashing used jint for imprecise bit shifting
Mon, 10 Feb 2014 14:07:11 -0800 dcubed Merge
Mon, 10 Feb 2014 12:58:53 -0800 dcubed Merge
Mon, 10 Feb 2014 12:38:34 -0800 rdurbin 8005262: possible gamma launcher issues
Mon, 10 Feb 2014 12:48:54 -0800 dcubed 8028073: race condition in ObjectMonitor implementation causing deadlocks
Mon, 10 Feb 2014 17:49:17 +0100 ctornqvi 8016644: Improve UnsupportedClassVersionError message
Sun, 09 Feb 2014 13:28:58 -0500 hseigel Merge
Fri, 07 Feb 2014 18:30:27 -0500 coleenp 8033528: assert(0 <= i && i < length()) failed: index out of bounds
Fri, 07 Feb 2014 11:47:24 -0800 dcubed 8033931: Several nightly tests failing with assert(imin < imax) failed: Unexpected page size
Fri, 07 Feb 2014 09:03:44 -0800 dcubed 8033714: hotspot 'install_jvm' bld target broken with ZIP_DEBUGINFO_FILES=0
Thu, 06 Feb 2014 20:13:38 -0800 sspitsyn 8025841: JVMTI: "vtable stub" dynamic code notification is misplaced
Thu, 06 Feb 2014 20:32:08 +0000 coleenp Merge
Thu, 06 Feb 2014 14:28:35 -0500 coleenp 8029775: Solaris code cleanup
Thu, 06 Feb 2014 14:51:01 -0500 fparain Merge
Thu, 06 Feb 2014 17:59:35 +0000 fparain 8030808: dtrace/hotspot/Monitors/Monitors001 fails in product builds on solaris-sparc
Thu, 06 Feb 2014 18:57:46 +0000 coleenp 8028735: runtime/RedefineObject/TestRedefineObject.java interrupted (timed out?) on solaris_sparcv9-fastdebug-c2-runtime and solaris_x64-debugOpen-c2-runtime
Wed, 05 Feb 2014 21:24:29 -0800 henryjen 8033289: clang: clean up unused function warning
Fri, 07 Feb 2014 09:41:36 -0800 amurillo Merge
Wed, 05 Feb 2014 15:14:47 -0800 ccheung 8032010: Attempt to resolve abstract method in concrete class fails with AbstractMethodError
Tue, 04 Feb 2014 19:41:46 -0800 sspitsyn 8032223: nsk/regression/b4663146 gets assert(SafepointSynchronize::is_at_safepoint() || JvmtiEnv::is_thread_fully_suspended(get_thread(), false, &debug_bits))
Mon, 03 Feb 2014 15:24:20 +0100 sla 8033126: Can't call default methods from JNI
Mon, 03 Feb 2014 13:41:26 +0100 sla 8032462: Change the linux SDT implementation to use USDT2 instead of USDT1
Sun, 02 Feb 2014 15:31:40 -0500 hseigel Merge
Thu, 30 Jan 2014 14:12:22 -0800 rdurbin 8027113: decouple the '-XXaltjvm=<path>' option from the gamma launcher
Thu, 30 Jan 2014 09:41:45 +0100 jbachorik 6656031: SA: jmap -permstat number of classes is off by 1
Fri, 21 Feb 2014 11:39:47 -0800 katleman Added tag jdk9-b03 for changeset b2fee789d23f
Tue, 11 Feb 2014 11:26:05 -0800 lana Mergejdk9-b03
Wed, 05 Feb 2014 08:57:33 -0800 amurillo Merge
Thu, 30 Jan 2014 14:01:45 +0100 ehelin Merge
Wed, 29 Jan 2014 23:17:05 +0100 jwilhelm 8028391: Make the Min/MaxHeapFreeRatio flags manageable
Wed, 15 Jan 2014 07:20:04 -0800 jmasa 8031290: Adjust call to getisax() for additional words returned
Mon, 20 Jan 2014 10:55:54 +0100 sjohanss 8031686: G1: assert(_hrs.max_length() == _expansion_regions) failed
Mon, 27 Jan 2014 13:14:53 +0100 brutisso 8030177: G1: Enable TLAB resizing
Thu, 23 Jan 2014 14:47:23 +0100 jwilhelm 8025856: Fix typos in the GC code
Tue, 14 Jan 2014 16:40:33 +0100 mgerdin 8032379: Remove the is_scavenging flag to process_strong_roots
Mon, 20 Jan 2014 12:56:18 +0100 sjohanss 8020277: Young GC could be extremely slow due to assertion in ObjectStartArray::object_starts_in_range
Mon, 20 Jan 2014 17:15:55 +0100 ehelin 8031776: Remove the unnecessary enum GenRemSet::Name
Mon, 20 Jan 2014 11:47:53 +0100 tschatzl 8027746: Remove do_gen_barrier template parameter in G1ParCopyClosure
Mon, 20 Jan 2014 11:47:29 +0100 tschatzl 8027454: Do not traverse string table during G1 remark when treating them as strong roots during initial mark
Mon, 20 Jan 2014 11:47:07 +0100 tschatzl 8027476: Improve performance of Stringtable unlink
Wed, 29 Jan 2014 19:54:44 -0500 hseigel Merge
Tue, 28 Jan 2014 06:26:36 -0800 zgu Merge
Tue, 28 Jan 2014 08:55:00 -0500 zgu 8032827: NMT: missing virtual memory tagging in os::workaround_expand_exec_shield_cs_limit()
Tue, 28 Jan 2014 11:42:30 +0000 dsamersoff Merge
Tue, 28 Jan 2014 14:45:39 +0400 dsamersoff 7010732: SA_ALTROOT only works if running the SA tools from their build directory.
Mon, 27 Jan 2014 23:12:13 -0500 coleenp 8028275: Metaspace ShrinkGrowTest causes fatal error if run with JFR
Tue, 21 Jan 2014 16:45:10 -0600 gziemski 7015395: [TESTBUG] runtime/6626217/Test6626217.sh fails if compilation happens fast enough for timestamps to be equal.
Mon, 27 Jan 2014 10:57:52 +0100 sla 8032662: test/compiler/ciReplay/TestSA.sh should report ulimit issues
Mon, 27 Jan 2014 13:46:54 +0400 dsamersoff 8032247: SA: Constantpool lookup for invokedynamic is not implemented
Fri, 24 Jan 2014 08:31:06 -0500 hseigel Merge
Fri, 24 Jan 2014 08:13:42 -0500 hseigel 8028553: The JVM should not throw VerifyError when 'overriding' a static final method in a superclass.
Fri, 24 Jan 2014 09:28:47 +0100 dsimms 8028280: ParkEvent leak when running modified runThese which only loads classes
Thu, 23 Jan 2014 16:02:14 -0500 gdub 8031427: AllocObject and Unsafe.allocateInstance segfault for primitive types
Thu, 23 Jan 2014 09:45:38 -0800 minqi Merge
Thu, 23 Jan 2014 09:40:32 -0800 minqi 6651256: jstack: DeleteGlobalRef method call doesn't lead to descreasing of global refs count shown by jstack
Thu, 23 Jan 2014 09:33:50 +0000 kevinw 8032466: serviceability/sa/jmap-hashcode/Test8028623.java fails with compilation errors
Thu, 23 Jan 2014 09:06:21 +0100 sla 8031968: Mac OS X: VM starts the agent by calling both Agent_OnAttach and Agent_OnAttach_L functions if its agent library is dynamically linked.
Thu, 23 Jan 2014 08:12:12 +0100 sla 8032250: Add trace event for VM flag changes
Mon, 20 Jan 2014 09:56:47 +0000 kevinw Merge
Fri, 17 Jan 2014 18:39:22 +0000 kevinw 8028623: SA: hash codes in SymbolTable mismatching java_lang_String::hash_code for extended characters.
Sun, 19 Jan 2014 20:23:46 -0500 hseigel Merge
Fri, 17 Jan 2014 11:21:29 -0500 coleenp 8032024: Test not added for bug 8025937: assert(existing_f1 == NULL || existing_f1 == f1) failed: illegal field,change
Fri, 17 Jan 2014 09:47:17 -0500 hseigel Merge
Fri, 17 Jan 2014 09:39:51 -0500 hseigel 8031045: Access checks should precede additional per-instruction checks
Thu, 16 Jan 2014 20:14:21 +0100 sla 8030812: Change the solaris DTrace implementation to use USDT2 instead of USDT1
Fri, 17 Jan 2014 02:13:40 -0800 sspitsyn 8030027: nsk/jvmti/scenarios/hotswap/HS101/hs101t006 Crashed the vm on Linux-amd64: SIGSEGV in JavaThread::last_java_vframe(RegisterMap*)+0xfa
Thu, 16 Jan 2014 10:51:16 -0800 ccheung 8027314: Java should recognize Diagnostic options if -XX:+UnlockDiagnosticVMOptions is not specified and print an informative message
Wed, 15 Jan 2014 19:12:45 -0500 mseledtsov 8031151: Add basic CDS tests
Wed, 15 Jan 2014 11:46:19 +0100 dsimms 6945460: [TESTBUG] runtime/6929067/Test6929067.sh
Fri, 24 Jan 2014 09:04:24 -0800 kvn Merge
Thu, 23 Jan 2014 01:23:23 +0400 vlivanov 8031695: CHA ignores default methods during analysis leading to incorrect code generation
Tue, 21 Jan 2014 20:05:28 -0800 iveresov 8031743: C2: loadI2L_immI broken for negative memory values
Fri, 17 Jan 2014 18:09:08 -0800 iveresov 8032207: C2: assert(VerifyOops || MachNode::size(ra_) <= (3+1)*4) failed: bad fixed size
Tue, 28 Jan 2014 11:21:43 -0800 lana Merge
Thu, 23 Jan 2014 10:35:38 -0800 amurillo Merge
Fri, 17 Jan 2014 10:43:43 -0800 morris Merge
Thu, 16 Jan 2014 16:18:34 -0800 twisti 8022395: java.util.zip.ZipException: Not in GZIP format in JT_JDK/test/java/util/zip/GZIP tests
Tue, 14 Jan 2014 21:33:33 -0800 anoll Merge
Wed, 15 Jan 2014 06:16:55 +0100 anoll 7194669: CodeCache::mark_for_deoptimization should avoid verifying dependencies multiple times
Tue, 14 Jan 2014 17:46:48 -0800 kvn 8002074: Support for AES on SPARC
Tue, 14 Jan 2014 14:51:47 +0100 roland 8026253: New type profiling points: sparc support
Tue, 14 Jan 2014 12:44:12 +0100 roland 8030662: "assert(counter_changed) failed: failed dependencies, but counter didn't change" still fails
Tue, 14 Jan 2014 09:44:45 +0100 roland 8028764: dtrace/hotspot_jni/ALL/ALL001 crashes the vm on Solaris-amd64, SIGSEGV in MarkSweep::follow_stack()+0x8a
Mon, 13 Jan 2014 16:16:25 -0800 roland 8029464: assert(ft == ttkp->cast_to_ptr_type(jtkp->ptr()) || ft->isa_narrowoop()
Fri, 17 Jan 2014 09:40:04 +0100 ehelin Merge
Thu, 16 Jan 2014 17:22:35 +0100 ehelin 8031779: Assert in MetaspaceGC is always true
Tue, 14 Jan 2014 14:26:43 +0100 ehelin Merge
Fri, 10 Jan 2014 09:54:25 +0100 pliden 8029162: G1: Shared SATB queue never enabled
Fri, 10 Jan 2014 09:53:53 +0100 pliden 8029255: G1: Reference processing should not enqueue references on the shared SATB queue
Tue, 14 Jan 2014 22:13:21 +0000 dsamersoff Merge
Wed, 15 Jan 2014 02:02:47 +0400 dsamersoff 8030941: Darwin mapfile-vers doesnt work for other BSDs
Tue, 14 Jan 2014 16:27:35 -0500 hseigel 8031059: invokestatic: ICCE trying to invoke static method when it clashes with an abstract method inherited from an interface
Tue, 14 Jan 2014 13:51:47 -0500 hseigel 8028398: [TESTBUG]: test/runtime/memory/ReadFromNoaccessArea.java failed with EXCEPTION_ACCESS_VIOLATION
Mon, 13 Jan 2014 10:05:37 -0500 zgu 8031530: [TESTBUG] Enable test runtime/LoadClass/LoadClassNegative.java
Tue, 14 Jan 2014 15:27:01 +0100 farvidsson 8031304: Add dcmd to print all loaded dynamic libraries.
Mon, 13 Jan 2014 18:30:57 -0500 hseigel Merge
Thu, 09 Jan 2014 15:48:00 -0800 ccheung 8022301: [TESTBUG] runtime/jsig/Test8017498.sh incorrectly compiles native code
Thu, 09 Jan 2014 14:06:53 -0500 zgu 7012961: runtime/jni/WindowsExceptionFilter/WindowsExceptionFilter01 crashes on windows-amd64
Wed, 08 Jan 2014 13:20:33 +0100 sla 8030184: Remove unneeded "content_type" declarations from tracetypes.xml
Wed, 08 Jan 2014 08:34:02 +0100 sla 8031376: TraceClassLoading expects there to be a (Java) caller when you load a class with the bootstrap class loader
Tue, 21 Jan 2014 20:07:14 -0800 henryjen 8028407: adjust-mflags.sh failed build with GNU Make 4.0 with -I<path contains j>
Thu, 06 Feb 2014 13:08:44 -0800 katleman Added tag jdk9-b02 for changeset b188446de75b
Mon, 27 Jan 2014 21:00:29 -0800 lana Mergejdk9-b02
Thu, 05 Dec 2013 00:36:42 -0800 jrose 8029507: Enhance JVM method processing
Thu, 05 Sep 2013 10:29:00 -0400 coleenp 8021266: Better life cycle for objects
Fri, 10 Jan 2014 12:54:08 -0800 morris Merge
Fri, 10 Jan 2014 06:36:18 +0100 anoll 8022494: Make compilation IDs sequential
Thu, 09 Jan 2014 18:09:59 -0800 twisti 8026413: ScopeDesc::is_equal is declared in header file but not implemented
Thu, 09 Jan 2014 19:03:36 +0400 iignatyev 8031115: intrinsics for Math.decrementExact(J) and incrementExact(J) don't work
Thu, 09 Jan 2014 10:47:40 +0100 adlertz 8011391: C1: assert(code_offset() - offset == NativeInstruction::nop_instruction_size) failed: only one instruction can go in a delay slot
Wed, 08 Jan 2014 10:25:50 -0800 kvn 8028468: Add inlining information into ciReplay
Wed, 08 Jan 2014 12:05:19 +0100 adlertz 8029446: assert(_cfg.get_block_for_node(proj) == borig) failed: incorrect block for kill projections
Wed, 08 Jan 2014 09:49:31 +0100 roland 8029873: compiler/uncommontrap/TestStackBangRbp.java crashes with SIGSEGV
Tue, 07 Jan 2014 14:26:12 -0800 twisti 8022263: use same Clang warnings on BSD as on Linux
Tue, 07 Jan 2014 16:02:10 +0100 roland 8027571: fatal error: meet not symmetric
Tue, 07 Jan 2014 14:36:34 +0100 roland 8028064: tiered may collect wrong receiver type at virtual call
Tue, 07 Jan 2014 12:38:22 +0100 roland 8028536: Test cases to cover type system fixes pushed with 8024070
Mon, 06 Jan 2014 17:23:07 -0800 twisti 8029305: add type tag to AbstractCompiler
Mon, 06 Jan 2014 15:35:20 -0800 twisti 8031199: _MSC_VER is only defined on _WIN32
Tue, 24 Dec 2013 11:48:39 -0800 mikael 8029233: Update copyright year to match last edit in jdk8 hotspot repository for 2013
Thu, 19 Dec 2013 20:28:45 +0000 coleenp 8030633: nsk/jvmti/RedefineClasses/StressRedefine failed invalid method ordering length on Solaris
Mon, 16 Dec 2013 08:24:33 -0500 hseigel 8027804: JCK resolveMethod test fails expecting AbstractMethodError
Fri, 13 Dec 2013 09:25:44 +0100 roland 8029383: assert(counter_changed) failed: failed dependencies, but counter didn't change
Thu, 12 Dec 2013 15:11:35 -0500 drchase 8029351: assert(bt != T_OBJECT) failed: Guard is incorrect in VM:defmeth
Fri, 13 Dec 2013 00:34:09 +0400 iignatyev 8026941: [TESTBUG] java.lang.ClassNotFoundException: java.lang.invoke.InvokeGeneric
Thu, 12 Dec 2013 11:25:32 -0800 iveresov 8029668: Kithcensink crashed with guarantee(Assembler::is_simm13(disp)) failed: Do not match large constant offsets
Wed, 11 Dec 2013 13:51:28 -0500 jprovino 8029566: PPC: OrderAccess::load_acquire(julong) is broken
Wed, 11 Dec 2013 01:09:04 +0400 iignatyev 8029153: [TESTBUG] test/compiler/7141637/SpreadNullArg.java fails because it expects NullPointerException
Wed, 11 Dec 2013 01:04:34 +0400 iignatyev 8028122: [TESTBUG] compiler/regalloc/C1ObjectSpillInLogicOp.java
Fri, 06 Dec 2013 16:43:56 -0800 twisti 8029366: ShouldNotReachHere error when creating an array with component type of void
Fri, 06 Dec 2013 12:11:51 -0800 kvn 8028107: Kitchensink crashed with EAV
Mon, 09 Dec 2013 10:03:39 +0100 stefank 8029106: JVM crashes in Metachunk::Metachunk during parallel class redefinition (PrivateMLetController, anonymous-simple_copy_1)
Tue, 10 Dec 2013 10:31:00 +0100 sjohanss 8028993: Full collections with ParallelScavenge slower in JDK 8 compared to 7u40
Mon, 09 Dec 2013 08:20:45 +0100 ehelin 8029326: G1 does not check if threads gets created
Tue, 10 Dec 2013 16:18:26 -0500 hseigel 8028741: Interface Method Resolution should skip static and non-public methods in j.l.Object
Fri, 06 Dec 2013 11:33:10 -0500 hseigel 8029415: java/lang/reflect/Method/invoke/TestPrivateInterfaceMethodReflect.java fails on all platforms with hs25-b61
Thu, 05 Dec 2013 12:35:38 +0100 mgronlun 8028412: AsyncGetCallTrace() is broken on x86 in JDK 7u40
Wed, 04 Dec 2013 14:43:50 +0100 sla 8029395: SA: jstack throws WrongTypeException
Wed, 04 Dec 2013 08:10:31 -0500 hseigel 8027458: VM anonymous classes: wrong context for protected access checks
Tue, 31 Dec 2013 19:26:57 +0400 iignatyev 8028587: New tests development for intrisics for basic operators - add, neg, inc, dec, sub, mul
Thu, 26 Dec 2013 21:00:23 -0800 iveresov 8027388: JVM crashes with SIGSEGV (0xb) at pc=0x00000001077cbbf6
Fri, 20 Dec 2013 10:31:14 +0100 anoll 8028052: compiler/startup/SmallCodeCacheStartup.java fails there is no 'no space to run compiler' in the output
Fri, 20 Dec 2013 10:29:44 +0100 anoll 8030783: Provide regression test for 8026478: -XX:+VerifyAdapterSharing is broken
Thu, 19 Dec 2013 14:08:02 +0100 anoll 8025277: Add -XX: flag to print code cache sweeper statistics
Thu, 19 Dec 2013 06:09:16 +0100 anoll 8026478: -XX:+VerifyAdapterSharing is broken
Tue, 17 Dec 2013 08:31:06 +0100 anoll 8029091: Bug in calculation of code cache sweeping interval
Thu, 09 Jan 2014 16:53:51 +0100 ehelin Merge
Tue, 07 Jan 2014 16:15:35 +0100 ehelin Merge
Tue, 07 Jan 2014 13:31:33 +0100 tschatzl 8027364: PSScavenge accounts too large code section to StringTable unlink
Mon, 16 Dec 2013 13:43:06 +0100 brutisso 8027440: DefNew does not log heap change information when a promotion failure occurs
Mon, 16 Dec 2013 08:54:14 +0100 brutisso 8029524: Remove unsused method CollectedHeap::unsafe_max_alloc()
Wed, 08 Jan 2014 13:53:24 -0800 dcubed Merge
Tue, 07 Jan 2014 13:26:56 -0500 coleenp 8029178: Parallel class loading test anonymous-simple gets SIGSEGV in Metaspace::contains
Tue, 07 Jan 2014 12:32:57 +0100 sla 8031305: (hotspot) com.sun.management.VMOption is missing the ATTACH_ON_DEMAND origin
Tue, 07 Jan 2014 10:50:28 +0100 sla 4990369: visibleMethods() and methodsByName() return wrong visible methods
Mon, 06 Jan 2014 08:44:24 -0500 hseigel 8030955: assert(_prologue != NULL) failed: prologue pointer must be initialized
Tue, 31 Dec 2013 08:58:08 -0500 zgu 6730115: Fastdebug VM crashes with "ExceptionMark destructor expects no pending exceptions" error
Mon, 23 Dec 2013 18:44:59 -0500 hseigel 8023735: [TESTBUG] runtime/XCheckJniJsig/XCheckJSig.java fails on MacOS X
Mon, 23 Dec 2013 18:39:47 +0000 iignatyev Merge
Mon, 23 Dec 2013 20:56:18 +0400 iignatyev 8029070: memory leak in jmm_SetVMGlobal
Mon, 23 Dec 2013 10:13:42 -0500 hseigel 8021774: [TESTBUG] Tests failed because of a warning in its output
Wed, 18 Dec 2013 23:09:57 +0400 dsamersoff 6969276: minor memory leak detected by cppcheck in agent/src/os/linux/symtab.c
Wed, 18 Dec 2013 20:32:46 +0400 dsamersoff 8028408: unused-value warning on forte.cpp when build on Mac
Wed, 18 Dec 2013 08:39:06 +0100 sla 8029726: On OS X some dtrace probe names are mismatched with Solaris
Mon, 16 Dec 2013 10:34:30 +0100 sla 8028737: Remove JVM_AccessVMIntFlag / JVM_AccessVMBooleanFlag / JVM_VMBreakPoint
Mon, 16 Dec 2013 10:57:08 -0800 zgu 8026300: VM warning: increase O_BUFLEN in ostream.hpp -- output truncated occurs with fastdebug VM when printing flags
Mon, 16 Dec 2013 11:17:33 +0100 sla 8029798: Build warnings in windows/makefiles/sa.make
Thu, 26 Dec 2013 11:16:44 -0500 darcy 8030656: Bad version check for parameter information in src/share/vm/classfile/javaClasses.cpp
Tue, 21 Jan 2014 18:16:59 -0800 katleman Added tag jdk9-b01 for changeset 050a626a8895
Fri, 13 Dec 2013 09:35:12 -0800 iris 8030068: Update .jcheck/conf files for JDK 9jdk9-b01
Thu, 12 Dec 2013 15:27:05 -0800 iris Added tag jdk9-b00 for changeset ce2d7e46f3c7
Thu, 12 Dec 2013 05:20:55 -0800 katleman Added tag jdk8-b120 for changeset fca262db9c43jdk9-b00
Fri, 06 Dec 2013 09:29:15 -0800 amurillo Added tag hs25-b62 for changeset 05fedd51e40djdk8-b120
Fri, 06 Dec 2013 09:29:14 -0800 amurillo Mergehs25-b62
Thu, 05 Dec 2013 12:49:55 -0800 anoll Merge
Wed, 04 Dec 2013 09:31:17 +0100 anoll 8028109: compiler/codecache/CheckReservedInitialCodeCacheSizeArgOrder.java crashes in RT_Baseline
Mon, 02 Dec 2013 11:12:32 +0100 simonis 8029190: VM_Version::determine_features() asserts on Fujitsu Sparc64 CPUs
Fri, 22 Nov 2013 15:26:37 +0100 rbackman 8028624: [TESTBUG] compiler/intrinsics/mathexact/DecExactLTest executes DecExactITest
Fri, 22 Nov 2013 14:14:26 +0100 rbackman 8028997: mathexact intrinsics are unstable
Thu, 05 Dec 2013 17:49:55 +0100 ehelin Merge
Tue, 03 Dec 2013 12:01:18 +0100 sjohanss 8029329: tmtools tests fail with NPE (in the tool) when run with G1 and FlightRecorder
Mon, 02 Dec 2013 15:43:04 +0100 ehelin Merge
Tue, 26 Nov 2013 14:35:38 +0100 sjohanss 8027675: Full collections with Serial slower in JDK 8 compared to 7u40
Tue, 03 Dec 2013 13:56:10 -0800 sspitsyn Merge
Tue, 03 Dec 2013 15:41:35 -0800 sspitsyn 8028126: nsk/jvmti/scenarios/hotswap/HS101/hs101t006 Crashed the vm on Solaris-sparc64 fastdebug builds: only current thread can flush its registers
Tue, 03 Dec 2013 11:13:14 -0800 acorn 8028438: static superclass method masks default methods
Tue, 03 Dec 2013 08:36:15 -0800 acorn 8026066: ICCE for invokeinterface static
Mon, 02 Dec 2013 11:42:10 +0100 mgronlun Merge
Wed, 27 Nov 2013 14:26:04 +0400 dsamersoff 7050685: jsdbproc64.sh has a typo in the package name
Sun, 01 Dec 2013 22:35:15 -0500 vladidan Merge
Tue, 19 Nov 2013 16:26:54 -0500 jprovino 8028396: Minimal VM: undefined symbol: _ZN23JvmtiCurrentBreakpoints11metadata_doEPFvP8MetadataE
Fri, 29 Nov 2013 11:20:34 -0800 amurillo 8029367: new hotspot build - hs25-b62
Wed, 04 Dec 2013 23:11:03 -0800 katleman Added tag jdk8-b119 for changeset ce42d815dd21
Fri, 29 Nov 2013 11:10:31 -0800 amurillo Added tag hs25-b61 for changeset b2426da30009jdk8-b119
Fri, 29 Nov 2013 11:10:30 -0800 amurillo Mergehs25-b61
Fri, 29 Nov 2013 11:32:45 -0500 drchase Merge
Tue, 26 Nov 2013 18:16:04 -0500 drchase 8016839: JSR292: AME instead of IAE when calling a method
Tue, 26 Nov 2013 16:03:57 -0500 hseigel 8028160: [TESTBUG] Exclude failing (runtime) jtreg tests using @ignore
Tue, 26 Nov 2013 09:52:22 -0500 hseigel 8026065: InterfaceMethodref for invokespecial must name a direct superinterface
Sat, 23 Nov 2013 12:25:13 +0100 mgronlun 8028128: Add a type safe alternative for working with counter based data
Sat, 23 Nov 2013 09:56:59 +0100 mgronlun Merge
Thu, 21 Nov 2013 14:41:13 -0500 hseigel 8028520: JVM should not throw VerifyError when a private method overrides a final method
Fri, 22 Nov 2013 13:42:46 -0800 amurillo 8028815: new hotspot build - hs25-b61
Thu, 28 Nov 2013 08:23:04 -0800 cl Added tag jdk8-b118 for changeset c9f439732b18
Fri, 22 Nov 2013 13:34:43 -0800 amurillo Added tag hs25-b60 for changeset abad3b2d905djdk8-b118
Fri, 22 Nov 2013 13:34:41 -0800 amurillo Mergehs25-b60
Fri, 22 Nov 2013 20:26:36 +0100 mgronlun Merge
Mon, 18 Nov 2013 08:21:19 +0100 sgabdura 8028341: PSR:FUNC: SCOPE PARAMETER MISSING FROM THE -XX:+PRINTFLAGSFINAL
Mon, 18 Nov 2013 10:20:13 +0100 sla 8027630: SIGSEGV in const char*Klass::external_name()
Fri, 15 Nov 2013 17:20:22 -0500 coleenp 8028347: Rewriter::scan_method asserts with array oob in RT_Baseline
Fri, 15 Nov 2013 21:39:27 +0100 mgronlun Merge
Thu, 14 Nov 2013 20:03:15 +0100 sla 6626412: jstack using SA prints some info messages into err stream
Thu, 14 Nov 2013 19:30:07 +0100 sla 6606002: jinfo doesn't detect dynamic vm flags changing
Wed, 13 Nov 2013 16:35:55 -0800 minqi Merge
Wed, 13 Nov 2013 16:24:33 -0800 minqi 8025632: Remove all references to MagicLambdaImpl from Hotspot
Wed, 20 Nov 2013 12:46:08 +0100 roland 8028308: nsk regression, assert(obj->is_oop()) failed: not an oop
Thu, 14 Nov 2013 19:27:07 +0100 anoll 8028306: nsk stress tests, CodeCache fills, then safepoint asserts
Mon, 18 Nov 2013 12:26:51 -0800 morris 8028319: ConflictingDefaultsTest.testReabstract spins when running with -mode invoke and -Xcomp
Fri, 15 Nov 2013 07:58:06 -0800 amurillo 8028444: new hotspot build - hs25-b60
Thu, 21 Nov 2013 09:22:49 -0800 cl Added tag jdk8-b117 for changeset f573d00213b7
Fri, 15 Nov 2013 07:50:05 -0800 amurillo Added tag hs25-b59 for changeset c78d517c7ea4jdk8-b117
Fri, 15 Nov 2013 07:50:04 -0800 amurillo Mergehs25-b59
Thu, 14 Nov 2013 13:38:49 -0800 drchase Merge
Thu, 14 Nov 2013 15:58:12 -0500 drchase Merge
Thu, 14 Nov 2013 09:14:39 -0800 vlivanov 8028159: C2: compiler stack overflow during inlining of @ForceInline methods
Wed, 13 Nov 2013 13:45:50 +0100 roland 8027572: assert(r != 0) failed: invalid
Wed, 13 Nov 2013 01:50:14 -0800 roland Merge
Wed, 13 Nov 2013 09:45:58 +0100 roland 8027631: "unexpected profiling mismatch" error with new type profiling
Tue, 12 Nov 2013 14:52:48 +0100 rbackman 8028207: assert(_outcnt==1) failed: not unique in compile.cpp
Tue, 12 Nov 2013 13:47:57 +0100 rbackman 8028198: SIGSEGV in PhaseIdealLoop::build_loop_late_post
Tue, 12 Nov 2013 13:58:37 +0100 roland 8027632: assert(xtype->klass_is_exact()) failed: Should be exact at graphKit.cpp
Tue, 12 Nov 2013 09:32:50 +0100 anoll 8027593: performance drop with constrained codecache starting with hs25 b111
Mon, 11 Nov 2013 11:53:33 -0800 kvn 8024830: SEGV in org.apache.lucene.codecs.compressing.CompressingTermVectorsReader.get
Fri, 08 Nov 2013 14:19:55 -0800 drchase Merge
Fri, 08 Nov 2013 01:13:11 -0800 vlivanov 8023037: Race between ciEnv::register_method and nmethod::make_not_entrant_or_zombie
Thu, 14 Nov 2013 21:05:16 +0100 ehelin Merge