log

age author description
Mon, 14 Jul 2014 13:31:03 +0400 hseigel 8043454: Test case for 8037157 should not throw a VerifyError
Wed, 07 May 2014 19:34:48 +0400 hseigel 8037157: Verify <init> call
Mon, 14 Jul 2014 13:15:06 +0400 acorn 8037167: Better method signature resolution
Mon, 14 Jul 2014 13:01:34 +0400 hseigel 8036800: Attribute OOM to correct part of code
Mon, 14 Jul 2014 12:45:14 +0400 hseigel 8035119: Fix exceptions to bytecode verification
Wed, 07 May 2014 19:21:52 +0400 hseigel 8032536: JVM resolves wrong method in some unusual cases
Mon, 14 Jul 2014 12:43:50 +0400 hseigel 8030763: Validate global memory allocation
Fri, 11 Jul 2014 09:14:21 -0700 amurillo Merge
Fri, 11 Jul 2014 05:59:08 -0700 jmasa Merge
Wed, 09 Jul 2014 16:44:30 +0200 ehelin 8049426: Minor cleanups after G1 class unloading
Fri, 11 Jul 2014 02:34:11 -0700 roland Merge
Wed, 09 Jul 2014 21:56:16 +0000 mduigou 8047734: Backout use of -Og
Wed, 09 Jul 2014 02:50:46 -0700 roland Merge
Mon, 23 Jun 2014 13:33:23 +0200 rbackman 8046289: compiler/6340864/TestLongVect.java timeout with
Thu, 03 Jul 2014 08:46:44 +0200 thartmann 8022968: Some codecache allocation failures don't result in invoking the sweeper
Wed, 02 Jul 2014 22:54:18 +0200 roland 8046542: [I.finalize() calls from methods compiled by C1 do not cause IllegalAccessError on Sparc
Thu, 10 Jul 2014 13:39:18 -0700 jmasa Merge
Mon, 07 Jul 2014 10:12:40 +0200 stefank 8049421: G1 Class Unloading after completing a concurrent mark cycle
Mon, 07 Jul 2014 12:37:11 +0200 stefank 8049420: Backout 8048248 to correct attribution
Mon, 07 Jul 2014 10:12:40 +0200 stefank 8048248: G1 Class Unloading after completing a concurrent mark cycle
Mon, 07 Jul 2014 10:18:33 +0200 stefank 8049411: Minimal VM build broken after gcId.cpp was added
Wed, 02 Jul 2014 17:24:18 -0700 jmasa Merge
Wed, 02 Jul 2014 11:13:58 +0200 ehelin Merge
Tue, 01 Jul 2014 09:03:55 +0200 stefank 8047362: Add a version of CompiledIC_at that doesn't create a new RelocIterator
Thu, 26 Jun 2014 13:30:43 -0700 jcoomes 8034246: remove CMS and ParNew adaptive size policy code
Thu, 26 Jun 2014 16:01:07 +0200 tschatzl 8040977: G1 crashes when run with -XX:-G1DeferredRSUpdate
Thu, 26 Jun 2014 15:48:05 +0200 tschatzl 8035401: Fix visibility of G1ParScanThreadState members
Thu, 26 Jun 2014 15:45:07 +0200 tschatzl 8035400: Move G1ParScanThreadState into its own files
Thu, 26 Jun 2014 11:36:58 +0200 mgerdin 8047818: G1 HeapRegions can no longer be ContiguousSpaces
Thu, 26 Jun 2014 13:20:18 +0200 mgerdin 8048214: Linker error when compiling G1SATBCardTableModRefBS after include order changes
Thu, 26 Jun 2014 10:00:00 +0200 mgerdin 8047821: G1 Does not use the save_marks functionality as intended
Tue, 08 Jul 2014 13:52:29 -0400 lfoltan 8048128: Fix for Solaris Studio C++ 5.13, CHECK_UNHANDLED_OOPS breaks PPC build.
Tue, 08 Jul 2014 08:04:06 -0700 fparain 8047714: Fix for JDK-6546236 made Solaris os::yield() a no-op
Mon, 07 Jul 2014 12:08:07 -0400 darcy 8048620: Remove unneeded/obsolete -source/-target options in hotspot tests
Sat, 05 Jul 2014 20:05:29 +0200 mgronlun 8049324: interpretedVFrame::expressions to index oopmap correctly
Thu, 03 Jul 2014 16:55:57 -0700 dcubed Merge
Thu, 03 Jul 2014 21:37:31 +0200 mgronlun 8039905: heapdump/OnOOMToFile and heapdump/OnOOMToPath fail with "assert(fr().interpreter_frame_expression_stack_size() >= length) failed: error in expression stack!"
Thu, 03 Jul 2014 11:07:51 -0700 dcubed 8047104: cleanup misc issues prior to Contended Locking reorder and cache
Thu, 03 Jul 2014 09:16:56 -0700 mikael 8046818: Hotspot build system looking for sdt.h in the wrong place
Thu, 03 Jul 2014 10:25:42 -0400 hseigel 8026894: Improve VerifyError message about overriding a final method
Wed, 02 Jul 2014 20:20:45 -0400 coleenp Merge
Thu, 26 Jun 2014 16:05:15 +0200 goetz 8048241: Introduce umbrella header os.inline.hpp and clean up includes
Wed, 02 Jul 2014 20:56:54 +0000 dcubed Merge
Wed, 02 Jul 2014 13:50:16 -0700 simonis 8048232: Fix for 8046471 breaks PPC64 build
Wed, 02 Jul 2014 15:22:18 -0400 coleenp 8047737: Move array component mirror to instance of java/lang/Class
Wed, 02 Jul 2014 15:17:11 +0200 sla Merge
Thu, 17 Jul 2014 09:50:15 -0700 katleman Added tag jdk9-b23 for changeset dd472cdacc32
Thu, 10 Jul 2014 12:40:03 -0700 lana Mergejdk9-b23
Thu, 03 Jul 2014 13:17:29 -0700 amurillo Merge
Thu, 03 Jul 2014 09:41:29 -0700 roland Merge
Tue, 01 Jul 2014 13:09:40 +0400 iignatyev 8047996: Quarantine compiler/whitebox tests
Tue, 01 Jul 2014 09:02:45 +0200 thartmann 8007987: ciConstantPoolCache::_keys should be array of 32bit int
Mon, 30 Jun 2014 08:28:29 +0200 thartmann 8048003: test/compiler/8009761/Test8009761.java failed with: java.lang.RuntimeException: static java.lang.Object Test8009761.m3(boolean,boolean) not compiled
Wed, 02 Jul 2014 17:24:50 -0700 sspitsyn Merge
Mon, 30 Jun 2014 10:04:05 +0200 sla 8047973: Quarantine compiler/ciReplay/*
Mon, 30 Jun 2014 14:58:52 -0400 coleenp 8048169: Change 8037816 breaks HS build on PPC64 and CPP-Interpreter platforms
Fri, 27 Jun 2014 14:00:50 -0700 dcubed 8047720: Xprof hangs on Solaris
Fri, 27 Jun 2014 08:11:49 -0700 dcubed Merge
Fri, 27 Jun 2014 13:33:36 +0200 mgronlun 8047812: Ensure ClassLoaderDataGraph::classes_unloading_do only delivers klasses from CLDs with non-reclaimed class loader oops
Wed, 25 Jun 2014 22:12:25 +0000 egahlin Merge
Wed, 25 Jun 2014 21:36:48 +0200 egahlin 8046783: Add hidden field to methods for event based tracing
Wed, 25 Jun 2014 13:03:29 -0700 ctornqvi 8048076: [TESTBUG] runtime/Unsafe/RangeCheck.java fails with -Xcomp
Wed, 02 Jul 2014 13:52:52 +0200 ehelin Merge
Wed, 02 Jul 2014 11:05:10 +0200 ehelin 8048895: Back out JDK-8027915
Thu, 26 Jun 2014 18:55:29 -0700 jmasa Merge
Wed, 25 Jun 2014 20:43:05 -0700 jmasa Merge
Wed, 25 Jun 2014 15:43:47 +0000 tschatzl Merge
Wed, 25 Jun 2014 17:22:58 +0200 tschatzl 8026847: [TESTBUG] gc/g1/TestSummarizeRSetStats* tests launch 32bit jvm with UseCompressedOops
Wed, 25 Jun 2014 16:53:13 +0200 mgerdin 8047820: G1 Block offset table does not need to support generic Space classes
Wed, 25 Jun 2014 10:55:10 +0200 mgerdin 8047819: G1 HeapRegionDCTOC does not need to inherit ContiguousSpaceDCTOC
Wed, 25 Jun 2014 08:56:57 +0200 stefank 8047326: Consolidate all CompiledIC::CompiledIC implementations and move it to compiledIC.cpp
Wed, 25 Jun 2014 08:28:01 +0200 stefank 8047323: Remove unused _copy_metadata_obj_cl in G1CopyingKeepAliveClosure
Tue, 24 Jun 2014 17:09:48 +0200 stefank 8047373: Clean the ExceptionCache in one pass
Tue, 24 Jun 2014 16:20:15 +0200 stefank 8046670: Make CMS metadata aware closures applicable for other collectors
Tue, 24 Jun 2014 15:50:50 +0200 ehelin 8027915: TestParallelHeapSizeFlags fails with unexpected heap size on sparcv9
Wed, 25 Jun 2014 20:41:16 -0700 jmasa Merge
Mon, 23 Jun 2014 14:20:20 -0700 jmasa Merge
Mon, 23 Jun 2014 16:43:41 +0200 pliden 8046231: G1: Code root location ... from nmethod ... not in strong code roots for region
Wed, 04 Jun 2014 11:56:44 +0200 goetz 8044775: Improve usage of umbrella header atomic.inline.hpp.
Thu, 19 Jun 2014 13:31:14 +0200 brutisso 8043607: Add a GC id as a log decoration similar to PrintGCTimeStamps
Thu, 26 Jun 2014 16:53:35 -0700 twisti Merge
Thu, 26 Jun 2014 12:04:10 -0700 iveresov Merge
Thu, 26 Jun 2014 12:01:44 -0700 iveresov 8048298: Clang needs to lower optimization level for some files
Wed, 25 Jun 2014 09:19:09 +0200 thartmann 8033332: missing types in TemplateInterpreterGenerator::generate_result_handler_for
Tue, 24 Jun 2014 08:12:30 +0200 thartmann 8035328: closed/compiler/6595044/Main.java failed with timeout
Mon, 23 Jun 2014 04:44:02 +0000 anoll Merge
Mon, 23 Jun 2014 08:40:31 +0200 anoll 8046286: assert: Do not add task if compilation is turned off forever
Fri, 20 Jun 2014 20:42:48 +0000 iignatyev Merge
Fri, 20 Jun 2014 22:39:56 +0400 iignatyev 8041794: remove bytecodes_<arch>.{cpp,hpp} files
Fri, 20 Jun 2014 11:25:08 -0700 iveresov 8047321: Hotspot debug builds with clang are broken
Fri, 20 Jun 2014 09:25:13 +0200 anoll 8043158: Crash in CodeSweeperSweepNoFlushTest in CompileQueue::free_all()
Fri, 20 Jun 2014 08:14:30 +0200 thartmann 8008321: compile.cpp verify_graph_edges uses bool as int
Tue, 24 Jun 2014 12:27:51 -0700 amurillo 8043541: 'fastdebug' is printed twice in java -version
Tue, 24 Jun 2014 07:10:06 -0700 ctornqvi 8047939: [TESTBUG] Rewrite test/runtime/8001071/Test8001071.sh
Tue, 24 Jun 2014 02:19:59 -0700 poonam 8046282: SA update
Mon, 23 Jun 2014 14:51:10 -0700 ctornqvi 8047878: [TESTBUG] runtime/memory/ReadFromNoaccessArea.java and runtime/memory/ReserveMemory.java time out on Solaris
Mon, 23 Jun 2014 06:58:26 -0700 fparain 8043630: Method os::yield_all() should be removed
Sun, 22 Jun 2014 21:23:32 -0400 dholmes 8044818: [TESTBUG] runtime/CDSCompressedKPtrs/XShareAuto.java fails with RuntimeException 'sharing' found in stderr
Wed, 18 Jun 2014 12:35:32 -0700 mikael 8046471: Use OPENJDK_TARGET_CPU_ARCH instead of legacy value for hotspot ARCH
Fri, 20 Jun 2014 20:37:57 +0000 dcubed Merge
Fri, 20 Jun 2014 12:45:24 -0700 dcubed Merge
Fri, 20 Jun 2014 11:19:22 -0700 mikael 8046611: Build errors with gcc on sparc/fastdebug
Fri, 20 Jun 2014 10:12:02 -0700 gtriantafill 8038074: [TESTBUG] Add test for anewarray instruction with more than 255 dimensions
Thu, 19 Jun 2014 14:49:33 -0400 coleenp 6642881: Improve performance of Class.getClassLoader()
Thu, 19 Jun 2014 11:16:10 -0400 coleenp 8026977: NPG: Remove ConstantPool::lock
Thu, 10 Jul 2014 12:13:09 -0700 katleman Added tag jdk9-b22 for changeset 518d1fcc0799
Wed, 09 Jul 2014 10:42:04 -0700 lana Mergejdk9-b22
Tue, 01 Jul 2014 14:26:52 -0700 lana Merge
Fri, 20 Jun 2014 11:10:18 -0700 amurillo Merge
Thu, 19 Jun 2014 12:50:52 -0700 twisti Merge
Mon, 16 Jun 2014 16:27:41 -0700 mikael 8046769: Set T family feature bit on Niagara systems
Mon, 16 Jun 2014 15:12:24 +0400 iignatyev 8044742: testlibrary_tests/whitebox/vm_flags/BooleanTest.java NoClassDefFoundError: com/oracle/java/testlibrary/JDKToolFinder
Thu, 19 Jun 2014 09:44:12 -0700 jmasa Merge
Wed, 18 Jun 2014 12:39:57 -0700 jmasa Merge
Wed, 18 Jun 2014 13:02:33 +0000 jwilhelm Merge
Thu, 12 Jun 2014 20:15:51 +0200 jwilhelm 8046715: Add a way to verify an extended set of command line options
Wed, 18 Jun 2014 13:25:40 +0200 tschatzl 8043722: Swapped usage of idx_t and bm_word_t types in parMarkBitMap.cpp
Fri, 13 Jun 2014 17:07:39 -0400 jwilhelm 8046408: Build failure from multiple ptrace.h
Fri, 13 Jun 2014 19:05:56 -0700 amurillo Merge
Fri, 13 Jun 2014 13:46:06 +0200 pliden 8044796: G1: Enable G1CollectedHeap::stop()
Wed, 18 Jun 2014 14:21:28 -0700 dcubed 8047156: cleanup more non-indent white space issues prior to Contended Locking cleanup bucket
Wed, 18 Jun 2014 12:21:39 -0700 iveresov Merge
Wed, 18 Jun 2014 10:54:32 -0700 iveresov 8046684: sharedRuntime.cpp...assert(((nmethod*)cb)->is_at_poll_or_poll_return(pc)) failed: safepoint polling: type must be poll
Wed, 18 Jun 2014 13:58:13 -0400 coleenp 8039150: host_klass invariant fails when verifying newly loaded JSR-292 anonymous classes
Tue, 17 Jun 2014 11:18:10 -0700 ddehaven 8043340: [macosx] Fix hard-wired paths to JavaVM.framework
Tue, 17 Jun 2014 12:54:01 -0700 dcubed 8046758: cleanup non-indent white space issues prior to Contended Locking cleanup bucket
Fri, 13 Jun 2014 19:07:11 -0700 dcubed Merge
Fri, 13 Jun 2014 05:10:44 -0700 dsamersoff 8038392: Generating prelink cache breaks JAVA &#39;jinfo&#39; utility normal behaviour
Thu, 12 Jun 2014 15:57:16 -0700 dcubed 8046287: [TESTBUG] runtime/Thread/TestThreadDumpMonitorContention.java failed error_cnt=12
Thu, 12 Jun 2014 13:37:53 -0400 lfoltan 6961433: Revisit need to disable Windows C++ compiler optimisation of sharedRuntimeTrig.cpp.
Thu, 12 Jun 2014 11:34:35 +0200 dsimms 8046662: Check JNI ReleaseStringChars / ReleaseStringUTFChars verify_guards test inverted
Wed, 11 Jun 2014 18:34:09 +0200 dsimms 8043224: -Xcheck:jni improvements to exception checking and excessive local refs
Wed, 11 Jun 2014 09:58:23 -0400 hseigel 8031819: Remove legacy jdk checks and code
Wed, 11 Jun 2014 12:09:12 +0200 dsimms 6311046: -Xcheck:jni should support checking of GetPrimitiveArrayCritical.
Tue, 10 Jun 2014 20:24:48 -0700 dcubed Merge
Tue, 10 Jun 2014 14:04:37 -0400 hseigel 8044738: Check attribute_length of EnclosingMethod attribute
Mon, 09 Jun 2014 11:03:09 +0200 sla 8044797: Building with clang gives: fatal error: file '...' has been modified since the precompiled header was built
Fri, 06 Jun 2014 14:46:42 +0200 ctornqvi 8043492: ad_x86_64_misc.obj : error LNK2011: precompiled object not linked in; image may not run
Wed, 04 Jun 2014 11:05:30 +0200 sla 8044107: Add Diagnostic Command to list all ClassLoaders
Mon, 02 Jun 2014 17:21:15 +0200 miauno 8044540: serviceability/sa/jmap-hashcode/Test8028623.java should be quarantined
Thu, 03 Jul 2014 11:36:49 -0700 katleman Added tag jdk9-b21 for changeset 17b4a5e831b3
Thu, 26 Jun 2014 12:51:26 -0700 katleman Added tag jdk9-b20 for changeset c1af79d122ecjdk9-b21
Fri, 20 Jun 2014 10:15:08 -0700 lana Mergejdk9-b20
Wed, 18 Jun 2014 10:56:06 -0700 lana Merge
Fri, 13 Jun 2014 12:04:33 -0700 amurillo Merge
Fri, 13 Jun 2014 10:21:30 -0700 kvn Merge
Thu, 12 Jun 2014 16:31:07 -0700 mduigou 8032045: Enable compiler and linker safety switches for debug builds
Thu, 12 Jun 2014 10:15:43 -0700 kvn 8046516: Segmentation fault in JVM (easily reproducible)
Wed, 11 Jun 2014 11:05:10 -0700 kvn 8035968: Leverage CPU Instructions to Improve SHA Performance on SPARC
Wed, 11 Jun 2014 09:16:19 +0200 thartmann 8044538: assert(which != imm_operand) failed: instruction is not a movq reg, imm64
Tue, 10 Jun 2014 20:53:23 +0000 iignatyev Merge
Tue, 10 Jun 2014 23:18:25 +0400 iignatyev 8044575: testlibrary_tests/whitebox/vm_flags/UintxTest.java failed: assert(!res || TypeEntriesAtCall::arguments_profiling_enabled()) failed: no profiling of arguments
Tue, 10 Jun 2014 12:57:50 -0700 kvn Merge
Tue, 10 Jun 2014 12:28:06 -0700 kvn 8035605: Expand functionality of PredictedIntrinsicGenerator
Mon, 09 Jun 2014 10:32:49 +0200 neliasso 8040244: compiler/whitebox/IsMethodCompilableTest.java fails
Tue, 10 Jun 2014 13:37:16 +0200 roland 8026796: Make replace_in_map() on parent maps generic
Tue, 10 Jun 2014 10:00:59 +0000 vlivanov 8033626: assert(ex_map->jvms()->same_calls_as(_exceptions->jvms())) failed: all collected exceptions must come from the same place
Tue, 10 Jun 2014 08:53:22 +0200 thartmann 8033145: Runtime1::arraycopy_count_address uses wrong _oop_arraycopy_cnt variable
Wed, 11 Jun 2014 18:56:01 +0400 iignatyev 8044673: Create jtreg groups to list GC specific tests
Tue, 10 Jun 2014 20:46:28 -0700 jmasa Merge
Fri, 02 May 2014 02:11:34 +0200 jwilhelm 8042298: Remove the names gen0 and gen1 from the GC code
Wed, 30 Apr 2014 02:41:00 +0200 jwilhelm 8026396: Remove information duplication in the collector policy
Mon, 09 Jun 2014 15:42:31 -0700 kvn 8046275: Fastdebug build failing on jdk9/hs/ control jobs after pulling some hs-comp changes
Mon, 09 Jun 2014 11:49:02 +0000 vlivanov 8046226: assert(_thread == Thread::current()) failed: thread must be current w/ -XX:+TraceDeoptimization -XX:+Verbose
Fri, 06 Jun 2014 13:31:55 -0700 amurillo Merge
Fri, 06 Jun 2014 11:37:23 -0700 kvn Merge
Thu, 05 Jun 2014 10:43:16 +0200 thartmann 8031389: On x86 C1 emits two relocations for polls
Thu, 22 May 2014 13:42:44 +0200 rbackman 8030976: Untaken paths should be more vigorously pruned at highest optimization level
Wed, 04 Jun 2014 10:01:28 +0200 rbackman 8031994: java/lang/Character/CheckProp test times out
Tue, 03 Jun 2014 18:24:38 -0700 mikael 8044735: Print format/argument warnings
Wed, 04 Jun 2014 00:25:21 +0400 iignatyev 8044339: Update FilterSpuriousWakeups documentation. Review "Solaris only" vm options descriptions
Mon, 02 Jun 2014 15:48:34 -0700 mikael 8044242: Remove dead NativeMovRegMemPatching class
Mon, 02 Jun 2014 13:53:52 -0700 twisti Merge
Mon, 02 Jun 2014 10:48:02 -0700 twisti Merge
Mon, 02 Jun 2014 15:49:53 -0400 drchase Merge
Mon, 02 Jun 2014 14:32:29 -0400 drchase 8029381: assert(is_method_type()) failed: bad cast
Mon, 02 Jun 2014 07:26:52 -1000 iveresov 8044496: 8034812 broke build with clang
Mon, 02 Jun 2014 10:01:15 +0200 roland 8043413: REGRESSION: Hotspot causes segmentation fault in jdk8ux, but not in jdk7ux
Mon, 02 Jun 2014 08:07:29 +0200 thartmann 8034812: remove IDX_INIT macro hack in Node class
Fri, 30 May 2014 20:01:11 +0000 iignatyev Merge
Fri, 30 May 2014 17:20:48 +0400 iignatyev 8038756: new WB API :: get/setVMFlag
Fri, 30 May 2014 19:21:42 +0000 anoll Merge
Fri, 30 May 2014 09:26:48 +0200 thartmann 8021775: compiler/8009761/Test8009761.java "Failed: init recursive calls: 51. After deopt 50"
Fri, 30 May 2014 09:49:50 -0700 twisti Merge
Thu, 29 May 2014 16:01:13 -0700 mikael 8044071: Print format/argument warnings
Fri, 30 May 2014 06:50:38 +0200 anoll 8011646: SEGV in compiled code with loop predication
Thu, 19 Jun 2014 11:22:25 -0700 katleman Added tag jdk9-b19 for changeset d4cffb3ae621
Wed, 18 Jun 2014 10:08:52 -0700 lana Mergejdk9-b19
Thu, 12 Jun 2014 19:03:25 -0700 lana Merge
Thu, 12 Jun 2014 15:36:49 -0700 lana Merge
Fri, 06 Jun 2014 10:19:50 -0700 amurillo Merge
Thu, 05 Jun 2014 10:34:57 -0700 jmasa Merge
Wed, 04 Jun 2014 14:16:20 +0200 pliden 8044768: Backout fix for JDK-8040807
Thu, 29 May 2014 14:31:28 +0200 ehelin 8042933: assert(capacity_until_gc >= committed_bytes) failed
Tue, 03 Jun 2014 09:34:04 +0000 brutisso Merge
Tue, 03 Jun 2014 10:44:36 +0200 brutisso 8043239: G1: Missing post barrier in processing of j.l.ref.Reference objects
Tue, 03 Jun 2014 10:37:46 +0200 pliden 8040807: G1: Enable G1CollectedHeap::stop()
Mon, 02 Jun 2014 06:29:34 -0700 jmasa Merge
Fri, 30 May 2014 10:43:51 +0200 pliden 8042310: TestStringDeduplicationMemoryUsage test failing
Fri, 30 May 2014 10:37:39 +0200 pliden 8044132: Quarantine unstable/broken GC tests
Mon, 02 Jun 2014 21:36:59 -0400 mseledtsov 8038587: [TESTBUG] Create CDS tests to exercise region sizes and base address
Tue, 03 Jun 2014 09:44:54 +0200 mgronlun 8044531: Event based tracing locks to rank as leafs where possible
Mon, 02 Jun 2014 18:15:18 +0000 ctornqvi Merge
Mon, 02 Jun 2014 19:08:18 +0200 ctornqvi 8044364: runtime/RedefineFinalizer test fails on windows
Mon, 02 Jun 2014 09:30:08 -0700 rdurbin 8038132: jprt bundles have libjsig.dylib in different place on OSX
Mon, 02 Jun 2014 11:20:14 +0200 ykantser 8043915: Tests get ClassNotFoundException: com.oracle.java.testlibrary.StreamPumper
Sun, 01 Jun 2014 11:56:15 -0400 coleenp Merge
Fri, 30 May 2014 19:13:07 +0200 sla 8044398: Attach code should propagate errors in Diagnostic Commands as errors
Fri, 30 May 2014 07:20:51 -0700 dcubed 8036823: Stack trace sometimes shows 'locked' instead of 'waiting to lock'
Thu, 29 May 2014 08:58:51 -0400 lfoltan 8041623: Solaris Studio 12.4 C++ 5.13, CHECK_UNHANDLED_OOPS use of class oop's copy constructor definitions causing error level diagnostic.
Wed, 28 May 2014 22:59:29 +0200 ctornqvi 8043786: [TESTBUG] runtime/CommandLine/TestHexArguments.java test fails in nightly
Wed, 28 May 2014 15:03:36 +0000 dsamersoff Merge
Wed, 28 May 2014 07:36:32 -0700 dsamersoff 6904403: assert(f == k-&gt;has_finalizer(),&quot;inconsistent has_finalizer&quot;) with debug VM
Wed, 28 May 2014 06:26:05 -0700 poonam 8043086: Hotspot is expected to report OOM which is occurred String.intern(), but crashes in JDK8u5
Tue, 27 May 2014 21:58:23 -0700 minqi 8043896: Error reporting for insufficient shared region size is incorrect
Fri, 13 Jun 2014 11:21:19 -0700 katleman Added tag jdk9-b18 for changeset 871fd1285484
Thu, 12 Jun 2014 18:42:33 +0000 tbell Mergejdk9-b18
Thu, 12 Jun 2014 18:09:29 +0000 tbell 8046474: Source changes needed to build JDK 9 with new platforms and compilers on Solaris and Linux
Thu, 12 Jun 2014 10:32:21 -0700 katleman Added tag jdk9-b17 for changeset 14b656df31c2
Thu, 05 Jun 2014 19:39:08 -0700 lana Mergejdk9-b17
Fri, 30 May 2014 13:46:02 -0700 amurillo Merge
Fri, 30 May 2014 10:07:19 -0700 twisti Merge
Fri, 30 May 2014 09:49:53 -0700 twisti Merge
Thu, 29 May 2014 09:41:07 +0000 vlivanov 8034935: JSR 292 support for PopFrame has a fragile coupling with DirectMethodHandle
Wed, 28 May 2014 07:59:23 -1000 iveresov 8044090: C1: Old value instead of new one is passed to post-barrier in UnsafeGetAndSetObject
Wed, 28 May 2014 14:42:00 +0400 iignatyev 8043899: compiler/5091921/Test7005594.java fails if specified -Xmx is less than 1600m
Tue, 27 May 2014 16:05:29 -0700 mikael 8043206: Fix signed vs. unsigned comparison warning in copy_sparc.hpp
Mon, 26 May 2014 19:05:01 +0400 iignatyev 8038924: Test bit-instructions fails with unexpected exit value on sparc
Mon, 26 May 2014 14:27:01 +0200 roland 8043638: Multiple compilation attempts break LogCompulation, lead to confusing PrintInlining output
Mon, 26 May 2014 10:48:58 +0200 roland 8042557: compiler/uncommontrap/TestSpecTrapClassUnloading.java fails with: GC triggered before VM initialization completed
Sat, 24 May 2014 00:04:21 +0400 iignatyev 8032970: Add stack size check methods to WhiteBox API
Fri, 23 May 2014 09:22:01 -0700 twisti Merge
Wed, 21 May 2014 11:25:25 +0200 neliasso 8031475: Missing oopmap in patching stubs
Thu, 29 May 2014 13:01:54 -0700 jmasa Merge
Mon, 26 May 2014 19:21:01 +0400 iignatyev 8040250: The test test/gc/parallelScavenge/TestDynShrinkHeap.java fails with OOME
Mon, 26 May 2014 09:31:43 +0200 tschatzl 8043723: max_heap_for_compressed_oops() declared with size_t, but defined with uintx
Tue, 27 May 2014 08:44:23 -0700 minqi 8038422: CDS test failed: assert((size % os::vm_allocation_granularity()) == 0) failed when limiting SharedMiscDataSize
Fri, 23 May 2014 21:34:49 +0000 coleenp Merge
Fri, 23 May 2014 16:54:01 -0400 coleenp 8043925: Fix typo in verifier.cpp
Fri, 23 May 2014 16:43:47 -0400 coleenp Merge