log

age author description
Thu, 25 Jul 2019 14:10:23 +0100 clanger 8228466: Fix build on AIX and with Solaris Studio 12u4 in 12u after HarfBuzz 2.3.1 upgradedefault tip
Wed, 17 Jul 2019 14:58:26 +0000 robm Added tag jdk-12.0.2+10 for changeset 7b6accc7c009
Tue, 16 Jul 2019 16:39:04 +0000 robm Added tag jdk-12.0.2-ga for changeset 7b6accc7c009
Tue, 16 Jul 2019 16:38:28 +0000 robm Added tag jdk-12.0.2+9 for changeset ffb3065f13fejdk-12.0.2+10 jdk-12.0.2-ga
Wed, 03 Jul 2019 18:55:46 -0700 igerasim 8227230: Backout JDK-8215367 from update releasesjdk-12.0.2+9
Tue, 16 Jul 2019 16:38:19 +0000 robm Added tag jdk-12.0.2+8 for changeset 0379a8f7d78c
Tue, 16 Jul 2019 16:37:15 +0000 robm Added tag jdk-12.0.2+7 for changeset e7a0af21d06ajdk-12.0.2+8
Wed, 29 May 2019 06:56:57 -0700 robm 8224907: Backout JDK-8209901 from JDK 11u-cpu and 12u-cpujdk-12.0.2+7
Thu, 23 May 2019 08:28:06 +0100 rpatil 8215982: (tz) Upgrade time-zone data to tzdata2018i
Tue, 16 Jul 2019 16:36:20 +0000 robm Added tag jdk-12.0.2+6 for changeset 24d568de67bb
Tue, 16 Jul 2019 16:31:19 +0000 robm Added tag jdk-12.0.2+5 for changeset 0c8f90b175b5jdk-12.0.2+6
Tue, 16 Jul 2019 16:29:56 +0000 robm Added tag jdk-12.0.2+4 for changeset c4aad40eb1e9jdk-12.0.2+5
Thu, 02 May 2019 17:43:26 -0700 jnimeh 8222678: Improve TLS negotiationjdk-12.0.2+4
Mon, 22 Apr 2019 11:39:07 -0700 igerasim 8209901: Canonical file handling
Tue, 16 Jul 2019 16:29:42 +0000 robm Added tag jdk-12.0.2+3 for changeset 107e6491faec
Thu, 11 Apr 2019 17:58:18 -0700 xuelei 8218873: Improve JSSE endpoint checkingjdk-12.0.2+3
Wed, 03 Apr 2019 13:35:11 -0700 jnimeh 8221345: Better Poly1305 support
Wed, 10 Apr 2019 14:43:13 -0700 serb 8218876: Improve PNG support options
Wed, 10 Apr 2019 15:32:36 -0700 igerasim 8221518: Normalize normalization
Tue, 16 Jul 2019 16:24:54 +0000 robm Merge
Tue, 16 Jul 2019 16:20:54 +0000 robm Added tag jdk-12.0.2+2 for changeset b6c02a742b40
Wed, 10 Apr 2019 06:19:45 -0700 diazhou 8222262: change milestone to fcs for jdk 12.0.2 build 2 on jdk12.0.2 reposjdk-12.0.2+2
Mon, 01 Apr 2019 13:30:41 -0700 robm Merge
Sun, 31 Mar 2019 16:57:21 -0700 serb 8220495: Update GIFlib library to the 5.1.8
Mon, 01 Apr 2019 22:56:25 +0530 dkejriwal 8205432: Replace the placeholder Japanese era name
Fri, 29 Mar 2019 01:05:41 -0700 igerasim 8212328: Exceptional throw cases
Thu, 28 Mar 2019 02:55:08 -0700 diazhou Added tag jdk-12.0.2+1 for changeset 4ce38123759d
Thu, 07 Mar 2019 22:19:12 -0800 jnimeh 8219775: Certificate validation improvementsjdk-12.0.2+1
Tue, 26 Mar 2019 19:10:47 -0700 diazhou 8217737: Change the milestone to ea for jdk-12.0.2+1 build
Wed, 27 Mar 2019 00:24:13 -0700 serb 8220517: Enhanced GIF support
Tue, 26 Mar 2019 10:23:43 -0700 robm Merge
Tue, 26 Mar 2019 10:17:10 -0700 robm Merge
Wed, 20 Mar 2019 10:27:00 +0000 coffeys 8218863: Better endpoint checks
Tue, 19 Mar 2019 14:16:20 -0700 igerasim 8217563: Improve realm maintenance
Mon, 11 Mar 2019 07:56:37 -0700 robm Merge
Mon, 11 Mar 2019 07:53:08 -0700 robm Merge
Sun, 10 Mar 2019 03:34:59 -0700 prr 8210782: Upgrade HarfBuzz to the latest 2.3.1
Mon, 25 Feb 2019 17:16:03 -0800 robm Merge
Mon, 25 Feb 2019 17:11:28 -0800 robm Merge
Mon, 25 Feb 2019 17:06:28 -0800 robm Merge
Mon, 18 Feb 2019 11:44:57 -0800 igerasim 8218453: More dynamic RMI interactions
Mon, 18 Feb 2019 08:31:32 -0800 robm Merge
Mon, 18 Feb 2019 07:45:57 -0800 robm Merge
Mon, 18 Feb 2019 11:17:31 +0530 pbansal 8218469: JSlider display issue with slider for GTKLookAndFeel
Fri, 15 Feb 2019 11:22:37 -0800 ssadetsky 8218473: JOptionPane display issue with GTKLookAndFeel
Fri, 15 Feb 2019 11:20:50 -0800 ssadetsky 8218479: JTextPane display issue with GTKLookAndFeel
Thu, 07 Feb 2019 08:47:10 -0500 mullan 8216381: More limited privilege usage
Wed, 23 Jan 2019 14:45:54 -0800 smarks 8213432: Better copies of CopiesList
Mon, 04 Feb 2019 06:49:11 -0800 robm Merge
Thu, 17 Jan 2019 10:44:17 -0500 rriggs 8215367: Better Collection of References
Thu, 31 Jan 2019 21:52:15 -0800 diazhou 8217737: Change the release version from 12.0.1 to 12.0.2
Wed, 30 Jan 2019 19:33:04 -0800 igerasim 8213431: Improve file protocol handling
Tue, 22 Jan 2019 17:42:30 -0800 igerasim 8211936: Better String parsing
Tue, 22 Jan 2019 15:40:41 -0800 robm Added tag jdk-12.0.1+0 for changeset c09bdb9043f1
Tue, 22 Jan 2019 15:26:30 -0800 robm Added tag jdk-12.0.2+0 for changeset 9a91d1dc777a
Sun, 19 May 2019 22:14:09 +0800 ljiang 8218781: Localized names for Japanese era Reiwa in COMPAT provider
Tue, 21 May 2019 15:18:33 +0100 rhalade 8223499: Remove two DocuSign root certificates that are expiring
Tue, 21 May 2019 15:12:39 +0100 rhalade 8222136: Remove two Comodo root CA certificates that are expiring
Tue, 14 May 2019 21:36:09 +0300 dsamersoff 8223767: Shenandoah fails to build on Solaris x86_64
Fri, 17 May 2019 10:48:02 -0400 rriggs 8220166: Performance regression in deserialization (4-6% in SPECjbb)
Fri, 17 May 2019 11:44:44 +0200 bulasevich 8223472: volatile long field corruption on x86_32
Tue, 14 May 2019 09:25:58 +0100 clanger 8223597: jdk/nio/zipfs/ZipFSTester.java RuntimeException: CHECK_FAILED! (getAttribute.crc <entries20> failed 6af4413c vs 0 ...)
Wed, 15 May 2019 22:45:54 +0200 shade 8223980: Shenandoah: Refactor and fix ObjArrayChunkedTask verification
Tue, 14 May 2019 09:12:06 +0200 shade 8223762: Shenandoah: overflows in calculations involving heap capacity
Tue, 14 May 2019 09:12:00 +0200 shade 8223759: Shenandoah should allow arbitrarily low initial heap size
Wed, 08 May 2019 09:50:23 +0000 pli 8223427: [TESTBUG] Disable JTReg Shenandoah tests when Graal is enabled
Tue, 07 May 2019 21:53:46 +0200 shade 8223447: Stabilize gc/shenandoah/TestStringDedupStress test
Tue, 07 May 2019 21:53:38 +0200 shade 8223446: Shenandoah breaks alignment with some HumongousThreshold values
Fri, 10 May 2019 01:41:45 +0800 aoqi 8223651: Build fails with --with-jvm-features=-jfr and --disable-precompiled-headers
Wed, 08 May 2019 14:27:14 +0200 shade 8223570: Shenandoah needs to acquire lock before CLDG::clear_claimed_marks
Fri, 10 May 2019 06:31:09 +0100 clanger 8223555: Cleanups in cacerts tests
Tue, 07 May 2019 17:33:19 -0400 dholmes 8223437: Backout JDK-8219974 Restore static callsite resolution for the current class
Wed, 24 Apr 2019 15:37:55 +0200 redestad 8222532: (zipfs) Performance regression when writing ZipFileSystem entries in parallel
Tue, 30 Apr 2019 10:39:22 +0200 jlahoda 8218152: [javac] fails and exits with no error if a bad annotation processor provided
Thu, 02 May 2019 06:33:28 -0700 dl 8222930: ConcurrentSkipListMap.clone() shares size variable between original and clone
Thu, 07 Mar 2019 22:16:03 +0100 neliasso 8219448: split-if update_uses accesses stale idom data
Tue, 02 Apr 2019 17:11:04 -0700 lmesnik 8221437: assert(java_lang_invoke_ResolvedMethodName::vmtarget(resolved_method()) == m()) failed: Should not change after link resolution
Tue, 07 May 2019 16:07:44 +0100 coffeys 8222137: Remove T-Systems root CA certificate
Thu, 18 Apr 2019 13:58:31 +0200 sgehwolf 8221639: [i386] expand_exec_shield_cs_limit workaround is undefined code after JDK-8199717
Tue, 30 Apr 2019 22:06:39 -0700 igerasim 8223003: SunMSCAPI keys are not cleaned up
Mon, 08 Apr 2019 15:01:39 +0100 sgroeger 8222027: java/util/logging/LogManager/TestLoggerNames.java generates intermittent ClassCastException
Fri, 12 Apr 2019 09:55:30 -0400 zgu 8222403: Shenandoah: Remove ShenandoahAlwaysTrueClosure, use AlwaysTrueClosure instead
Wed, 24 Apr 2019 11:40:04 +0200 shade 8222838: Shenandoah: SEGV on accessing cset bitmap for NULL ptr
Wed, 24 Apr 2019 11:39:56 +0200 shade 8222843: Print Shenandoah cset map addresses in hs_err
Mon, 15 Apr 2019 13:07:06 -0400 zgu 8222425: Shenandoah: Move commonly used closures to separate files
Mon, 15 Apr 2019 18:22:08 +0200 shade 8222410: java/nio/file/attribute/BasicFileAttributeView/UnixSocketFile hangs when "nc" does not accept "-U"
Mon, 15 Apr 2019 18:22:10 +0200 shade 8222397: x86_32 tests with UseSHA1Intrinsics SEGV due to garbled registers
Fri, 01 Feb 2019 16:03:15 +0100 shade 8217879: hs_err should print more instructions in hex dump
Tue, 09 Apr 2019 09:49:36 -0700 smarks 8221924: get(null) on single-entry unmodifiable Map returns null instead of throwing NPE
Wed, 17 Apr 2019 13:17:01 -0700 igerasim 8222111: exeCallerAccessTest.c fails to build: control reaches end of non-void function
Wed, 17 Apr 2019 13:16:36 -0700 igerasim 8222082: Build of test/jdk/java/lang/reflect/exeCallerAccessTest/exeCallerAccessTest.c still failing on Windows
Wed, 17 Apr 2019 13:16:07 -0700 igerasim 8222078: test/jdk/java/lang/reflect/exeCallerAccessTest/exeCallerAccessTest.c build fails after 8221530
Wed, 17 Apr 2019 13:15:48 -0700 igerasim 8221530: Caller sensitive methods not handling caller = null when invoked by JNI code with no java frames on stack
Mon, 04 Feb 2019 17:35:35 -0800 vlivanov 8188133: C2: Static field accesses in clinit can trigger deoptimizations
Mon, 08 Apr 2019 13:22:59 -0400 zgu 8222086: CodeCache::UnloadingScope needs to preserve and restore previous IsUnloadingBehavior
Tue, 22 Jan 2019 10:42:41 +0300 bulasevich 8214235: arm32: assertion in collectedHeap.cpp: attempt to clean empty remainder
Wed, 19 Dec 2018 10:36:16 +0000 clanger 8215472: (zipfs) Cleanups in implementation classes of jdk.zipfs and tests
Fri, 22 Feb 2019 17:30:07 +0300 bulasevich 8217647: JFR: recordings on 32-bit systems unreadable
Wed, 17 Apr 2019 00:40:59 -0700 igerasim 8170494: JNI exception pending in PlainDatagramSocketImpl.c
Tue, 16 Apr 2019 17:15:57 +0100 clanger 8222522: Add configure options for Mac Bundle creation
Mon, 08 Apr 2019 06:56:37 +0100 clanger 8221880: Better customization for Windows RC properties FileDescription and ProductName
Mon, 15 Apr 2019 10:16:04 +0200 mdoerr 8220625: tools/javac/classreader/8171132/BadConstantValue.java failed with "did not see expected error"
Tue, 16 Apr 2019 07:09:26 -0700 robm Merge
Tue, 16 Apr 2019 06:44:04 -0700 robm Added tag jdk-12.0.1-ga for changeset e831fc6bca9e
Mon, 01 Apr 2019 19:24:06 -0700 robm Added tag jdk-12.0.1+12 for changeset e831fc6bca9e
Mon, 01 Apr 2019 22:56:25 +0530 dkejriwal 8205432: Replace the placeholder Japanese era namejdk-12.0.1+12 jdk-12.0.1-ga
Tue, 26 Mar 2019 10:11:51 -0700 robm Merge
Fri, 15 Mar 2019 00:41:19 -0700 diazhou Added tag jdk-12.0.1+11 for changeset 8afa031910e3
Tue, 29 Jan 2019 07:46:50 -0800 naoto 8217609: New era placeholder not recognized by java.text.SimpleDateFormatjdk-12.0.1+11
Mon, 11 Mar 2019 07:52:02 -0700 robm Merge
Tue, 05 Mar 2019 23:17:03 -0800 diazhou Added tag jdk-12.0.1+10 for changeset e657e6b86884
Wed, 27 Feb 2019 00:34:39 -0800 diazhou Added tag jdk-12.0.1+9 for changeset edbfbc928f5djdk-12.0.1+10
Fri, 04 Jan 2019 17:46:56 +0100 mbaesken 8215962: Support ThreadPriorityPolicy mode 1 for non-root users on linux/bsdjdk-12.0.1+9
Mon, 18 Feb 2019 11:44:57 -0800 igerasim 8218453: More dynamic RMI interactions
Tue, 19 Feb 2019 22:26:31 -0800 diazhou Added tag jdk-12.0.1+8 for changeset efc36b43b3f9
Tue, 12 Feb 2019 23:53:17 -0800 diazhou Added tag jdk-12.0.1+7 for changeset e4607e374223jdk-12.0.1+8
Tue, 05 Feb 2019 20:26:35 -0800 diazhou Added tag jdk-12.0.1+6 for changeset 0c9a2cd825dcjdk-12.0.1+7
Mon, 04 Feb 2019 08:08:44 -0800 robm Mergejdk-12.0.1+6
Tue, 22 Jan 2019 17:42:30 -0800 igerasim 8211936: Better String parsing
Mon, 04 Feb 2019 06:53:19 -0800 robm Merge
Wed, 30 Jan 2019 08:36:41 -0800 diazhou Added tag jdk-12.0.1+5 for changeset c9c530b917a3
Wed, 30 Jan 2019 00:00:44 +0000 diazhou 8217973: JDK 12.0.1 - Release Date is wrongjdk-12.0.1+5
Tue, 29 Jan 2019 00:16:55 +0000 diazhou 8217469: CPU+Apr+2019: Change builds from ea to fcs for 11.0.3 and 12.0.1
Wed, 23 Jan 2019 12:53:18 +0000 diazhou Added tag jdk-12.0.1+4 for changeset 9a91d1dc777a
Tue, 22 Jan 2019 08:01:44 -0800 robm Mergejdk-12.0.1+4 jdk-12.0.2+0
Mon, 21 Jan 2019 17:58:21 +0000 aefimov 8215330: javax.xml.catalog.CatalogResolverImpl: GroupEntry.matchURI fails to match
Wed, 16 Jan 2019 22:29:31 -0800 rhalade 8216577: Add GlobalSign's R6 Root certificate
Wed, 16 Jan 2019 06:23:55 +0000 diazhou Added tag jdk-12.0.1+3 for changeset d52a133717ee
Mon, 14 Jan 2019 13:14:05 -0800 robm Mergejdk-12.0.1+3
Wed, 09 Jan 2019 01:51:43 +0000 diazhou Added tag jdk-12.0.1+2 for changeset c3fc07bf4080
Mon, 07 Jan 2019 07:54:33 -0800 robm Mergejdk-12.0.1+2
Fri, 04 Jan 2019 10:36:09 +0000 diazhou Added tag jdk-12.0.1+1 for changeset 60ff8949381a
Fri, 04 Jan 2019 03:33:15 +0000 diazhou 8216144: RE changes for new forked repos for JDK 12.0.1jdk-12.0.1+1
Thu, 03 Jan 2019 09:18:12 -0800 robm Merge
Wed, 12 Dec 2018 11:57:22 -0800 ccheung 8214809: CDS storage improvementsjdk-12.0.1+0
Tue, 09 Apr 2019 21:20:16 +0200 shade 8222186: Shenandoah should not uncommit below minimum heap size
Tue, 09 Apr 2019 21:20:15 +0200 shade 8222185: Shenandoah should report "committed" as capacity
Tue, 25 Dec 2018 18:35:42 +0300 bulasevich 8206107: [x86_32] jck tests for ldc2_w bytecode fail
Tue, 29 Jan 2019 11:56:51 -0500 lfoltan 8216970: condy causes JVM crash
Fri, 25 Jan 2019 10:43:02 -0600 gziemski 8216493: VirtualSpaceNodeTest.half_vsn_is_committed_humongous_chunk_is_used_test_vm crashes on local machine
Sun, 07 Apr 2019 13:28:18 +0200 shade 8221917: serviceability/sa/TestPrintMdo.java fails on 32-bit platforms
Sat, 30 Mar 2019 21:29:37 +0100 clanger 8221610: Resurrect (legacy) JRE bundle target
Wed, 10 Apr 2019 10:32:52 -0400 mullan 8222133: Add temporary exceptions for root certs that are due to expire soon
Fri, 05 Apr 2019 09:06:19 +0200 shade 8221918: runtime/SharedArchiveFile/serviceability/ReplaceCriticalClasses.java fails: Shared archive not found
Sun, 07 Apr 2019 13:28:18 +0200 shade 8222032: x86_32 fails with "wrong size of mach node" on AVX-512 machine
Mon, 08 Apr 2019 19:43:04 +0200 shade 8222130: Shenandoah should verify roots after pre-evacuation
Mon, 08 Apr 2019 18:42:27 +0200 rkennke 8222125: Shenandoah: Crash when running with ShenandoahParallelSafepointThreads=1
Wed, 27 Mar 2019 22:25:03 +0100 rkennke 8220664: Simplify ShenandoahUpdateHeapRefsClosure
Wed, 10 Apr 2019 09:41:22 -0400 mullan 8222089: [TESTBUG] sun/security/lib/cacerts/VerifyCACerts.java fails due to cert within 90-day expiry window
Mon, 01 Apr 2019 13:33:58 +0200 shade 8221735: Shenandoah fails ctw/modules/jdk_management_agent.java with Traversal
Thu, 04 Apr 2019 12:14:51 +0530 pbansal 8220349: The fix done for JDK-8214253 have caused issues in JTree behaviour
Sun, 31 Mar 2019 16:57:21 -0700 serb 8220495: Update GIFlib library to the 5.1.8
Fri, 05 Apr 2019 15:44:09 -0700 igerasim 8221801: Update src/java.base/share/legal/public_suffix.md
Fri, 18 Jan 2019 09:04:09 +0100 clanger 8217311: Improve Exception thrown when MulticastSocket.setInterface fails on AIX(Unix)
Wed, 27 Mar 2019 11:35:28 +0100 shade 8220198: Lots of com/sun/crypto/provider/Cipher tests fail on x86_32 due to missing SHA512 stubs
Fri, 15 Mar 2019 09:57:42 +0100 rkennke 8220714: C2 Compilation failure when accessing off-heap memory using Unsafe
Tue, 05 Mar 2019 14:03:21 +0530 pbansal 8214112: The whole text in target JPasswordField image are not selected
Fri, 18 Jan 2019 13:36:16 +0530 pbansal 8214111: There is no icon in all JOptionPane target image
Tue, 26 Feb 2019 18:12:06 +0000 dmarkov 8214109: XToolkit is not correctly displayed color on 16-bit high color setting
Thu, 10 Jan 2019 16:38:02 +0530 pbansal 8214252: Expanded & Collapsed nodes of a JTree look the same on GTK3
Tue, 05 Mar 2019 13:09:15 +0530 pbansal 8214253: Tooltip is transparent rather than having a black background
Tue, 12 Mar 2019 15:42:32 +0100 roland 8220374: C2: LoopStripMining doesn't strip as expected
Fri, 01 Mar 2019 10:15:04 +0000 clanger 8219915: [TESTBUG] Fix test langtools/tools/javac/processing/model/completionfailure/SymbolsDontCumulate.java in Standalone mode
Thu, 04 Apr 2019 11:59:26 +0200 shade 8221870: use driver to run CtwRunner in applications/ctw tests
Mon, 17 Dec 2018 13:47:22 +0100 mbaesken 8215296: do not disable c99 on Solaris
Fri, 29 Mar 2019 09:31:44 +0000 ngasson 8220707: [TESTBUG] serviceability/sa/TestHeapDumpForLargeArray.java fails with jtreg -vmoption:-Xmx < 8g
Tue, 26 Mar 2019 16:00:20 +0100 ghaug 8221479: Fix JFR profiling on s390
Tue, 26 Mar 2019 18:42:10 +0100 simonis 8221483: TestOopCmp.java fails due to "Multiple garbage collectors selected"
Tue, 26 Mar 2019 11:51:41 +0100 simonis 8221083: [ppc64] Wrong oop compare in C1-generated code
Mon, 01 Apr 2019 21:42:04 -0700 igerasim 8217690: Update public suffix version
Wed, 27 Mar 2019 11:35:40 +0100 shade 8221400: java/lang/String/StringRepeat.java test requests too much heap
Wed, 27 Mar 2019 11:35:41 +0100 shade 8221401: java/math/BigInteger/LargeValueExceptions.java test should be disabled on 32-bit platforms
Fri, 22 Mar 2019 09:05:06 -0400 dbuck 8217564: idempotent protection missing in crc32c.h
Wed, 13 Mar 2019 13:33:50 -0400 zgu 8220546: Shenandoah Reports timing details for weak root processing
Fri, 22 Mar 2019 08:56:30 +0100 clanger 8200286: (testbug) MOptionTest test fails with java.lang.AssertionError: Classfiles too old!
Thu, 21 Mar 2019 09:16:58 +0100 clanger 8172695: (scanner) java/util/Scanner/ScanTest.java fails
Thu, 21 Mar 2019 22:37:36 +0100 rkennke 8221278: Shenandoah should not enqueue string dedup candidates during root scan
Fri, 15 Feb 2019 12:10:12 -0500 aph 8219006: AArch64: Register corruption in slow subtype check
Wed, 20 Mar 2019 11:51:43 +0300 dcherepanov 8211100: hotspot C1 issue with comparing long numbers on x86 32-bit
Mon, 18 Feb 2019 17:41:31 +0100 roland 8219335: "failed: unexpected type" assert failure in ConnectionGraph::split_unique_types() with unsafe accesses
Mon, 18 Mar 2019 16:33:28 +0100 rkennke 8220780: ShenandoahBS::AccessBarrier::oop_store_in_heap ignores AS_NO_KEEPALIVE
Fri, 15 Mar 2019 13:01:30 +0100 shade 8220712: [TESTBUG] gc/shenandoah/compiler/TestMaybeNullUnsafeAccess should run with Shenandoah enabled
Tue, 19 Mar 2019 17:03:18 +0800 aoqi 8220812: gc/shenandoah/options/TestLoopMiningArguments.java fails if default GC is serial/parallel/cms
Tue, 26 Mar 2019 10:04:24 -0700 ssadetsky 8218469: JSlider display issue with slider for GTKLookAndFeel
Mon, 25 Mar 2019 08:06:18 -0700 ssadetsky 8218473: JOptionPane display issue with GTKLookAndFeel
Fri, 22 Mar 2019 13:03:17 -0700 ssadetsky 8218479: JTextPane display issue with GTKLookAndFeel
Wed, 20 Feb 2019 11:11:38 +0100 jlahoda 8218287: jshell tool: input behavior unstable after 12-ea+24 on Windows
Thu, 07 Feb 2019 13:57:12 +0000 aivanov 8217263: Automate DashOffset test
Fri, 08 Mar 2019 13:56:05 +0100 sgehwolf 8220353: [TESTBUG] TestRegisterRestoring uses SafepointALot without UnlockDiagnosticVMOptions
Fri, 08 Mar 2019 11:23:30 +0100 mdoerr 8219584: Try to dump error file by thread which causes safepoint timeout
Wed, 20 Mar 2019 20:17:30 -0400 coleenp 8210457: JVM crash in ResolvedMethodTable::add_method(Handle)
Thu, 21 Mar 2019 00:12:05 +0100 jwilhelm Merge
Wed, 20 Mar 2019 17:13:08 +0100 jwilhelm Added tag jdk-12-ga for changeset b67884871b5f
Thu, 20 Dec 2018 12:44:41 +0000 aivanov 8214122: JDWP is broken on 32 bit Windows: transport library missing onLoad entry
Mon, 18 Mar 2019 10:30:07 -0400 mullan 8218618: Program fails when using JDK addressed by UNC path and using Security Manager
Wed, 20 Feb 2019 10:20:48 -0800 xuelei 8219389: Delegated task created by SSLEngine throws BufferUnderflowException
Tue, 12 Feb 2019 14:08:07 -0800 ascarpino 8215790: Delegated task created by SSLEngine throws java.nio.BufferUnderflowException
Tue, 19 Feb 2019 10:02:00 +0100 stefank 8218733: SA: CollectedHeap provides broken implementation for used() and capacity()
Thu, 21 Feb 2019 11:10:35 +0530 sveerabhadra 8190361: Incorrect version info in jaccessinspector.exe and jaccesswalker.exe
Tue, 12 Mar 2019 09:59:58 -0400 zgu 8220344: Build failures when using --with-jvm-features=-g1gc,-jfr
Tue, 29 Jan 2019 08:39:04 -0500 zgu 8215047: Task terminators do not complete termination in consistent state
Tue, 29 Jan 2019 12:12:27 -0500 zgu 8217794: Missing termination check results violation of termination invariant
Wed, 09 Jan 2019 19:05:05 -0500 zgu 8215299: Remove G1CMTask::should_exit_termination()'s undesirable side-effect
Thu, 07 Mar 2019 17:34:21 +0100 sgehwolf 8220294: ZGC fails to build on GCC 4.4.7: Type parameter issue
Thu, 07 Mar 2019 16:15:43 +0100 sgehwolf 8220283: ZGC fails to build on GCC 4.4.7: ATTRIBUTE_ALIGNED compatibility issue
Mon, 11 Mar 2019 00:06:48 +0100 shade 8220162: Shenandoah should not commit HugeTLBFS memory
Mon, 11 Mar 2019 00:06:47 +0100 shade 8220153: Shenandoah does not work with TransparentHugePages properly
Mon, 11 Mar 2019 00:06:46 +0100 shade 8220350: Refactor ShenandoahHeap::initialize
Mon, 11 Mar 2019 14:06:05 -0400 zgu 8220444: Shenandoah should use parallel version of WeakProcessor in root processor for weak roots
Mon, 04 Mar 2019 19:38:50 -0500 dholmes 8219974: REDO JDK-8219492: Restore static callsite resolution for the current class
Tue, 26 Feb 2019 10:52:31 +0800 fyang 8219698: aarch64: SIGILL triggered when specifying unsupported hardware features
Thu, 07 Mar 2019 19:35:02 -0800 ascarpino 8220165: Encryption using GCM results in RuntimeException- input length out of bound
Tue, 12 Mar 2019 11:43:32 +0100 tschatzl 8218880: G1 crashes when issuing a periodic GC while the GCLocker is held
Mon, 11 Mar 2019 16:41:24 -0400 mullan 8217878: ENVELOPING XML signature no longer works in JDK 11
Mon, 11 Mar 2019 06:28:27 -0700 robm Merge
Thu, 21 Feb 2019 01:04:46 +0100 jwilhelm Added tag jdk-12+33 for changeset b67884871b5f
Tue, 19 Feb 2019 08:25:11 -0800 sviswanathan 8219151: Illegal instruction exception on JDK 12 due to incorrect CPU feature bitsjdk-12+33 jdk-12-ga
Thu, 14 Feb 2019 01:22:07 +0100 jwilhelm Added tag jdk-12+32 for changeset 4ce47bc1fb92
Fri, 08 Feb 2019 12:23:16 +0000 chegar 8218662: Allow 204 responses with Content-Length:0jdk-12+32
Fri, 08 Feb 2019 11:26:21 +0000 chegar 8218546: Unable to connect to https://google.com using java.net.HttpClient
Thu, 07 Feb 2019 01:49:10 -0800 ljiang 8218411: JDK 12 L10n resource file update msg drop 20
Thu, 07 Feb 2019 02:53:27 +0100 jwilhelm Added tag jdk-12+31 for changeset b5f7bb57de2f
Mon, 21 Jan 2019 02:43:33 +0000 diazhou 8217352: Remove EA from version string starting with Initial RC promotionjdk-12+31
Tue, 05 Feb 2019 20:06:10 +0100 eosterlund 8216541: CompiledICHolders of VM locked unloaded nmethods are released too late
Mon, 04 Feb 2019 17:53:26 -0800 iignatyev 8218197: [failurehandler] parent processes shouldn't be killed till their children are handle
Thu, 07 Mar 2019 10:22:19 +0100 shade 8220228: Improve Shenandoah pacing histogram message
Thu, 28 Feb 2019 14:22:03 +0100 stuefe 8219650: [Testbug] Fix potential crashes in new test hotspot gtest "test_print_hex_dump"
Tue, 05 Mar 2019 12:30:47 -0500 zgu 8220161: Shenandoah does not need to initialize PLABs for safepoint workers
Sat, 02 Mar 2019 08:33:32 -0500 zgu 8219976: GarbageCollectionNotificationInfo always says "No GC" when running Shenandoah
Fri, 01 Mar 2019 17:48:53 +0100 mdoerr 8219582: PPC: Crash after C1 checkcast patched and GC
Thu, 28 Feb 2019 10:55:07 -0600 gziemski 8219789: [TESTBUG] TestOptionsWithRanges.java produces hs_err_pidXXXXX.log file for VMThreadStackSize=9007199254740991
Thu, 14 Feb 2019 10:11:18 -0500 zgu 8200109: NMT: diff_malloc_site assert(early->flags() == current->flags(), "Must be the same memory type")
Wed, 02 Jan 2019 10:35:33 -0500 hseigel 8215398: -Xlog option usage => Invalid decorator '\temp\app_cds.log'.
Tue, 05 Mar 2019 09:12:48 -0500 hseigel 8079353: [TESTBUG] runtime/CompressedOops/UseCompressedOops.java failed on Windows when getting disjoint instead of zero based coops
Tue, 29 Jan 2019 07:46:50 -0800 naoto 8217609: New era placeholder not recognized by java.text.SimpleDateFormat
Thu, 28 Feb 2019 08:44:09 -0500 zgu 8219857: Shenandoah GC may initialize thread's gclab twice
Tue, 26 Feb 2019 05:46:02 -0800 rschmelter 8219712: code_size2 (defined in stub_routines_x86.hpp) is too small on new Skylake CPUs
Tue, 05 Feb 2019 08:20:09 -0800 manc 8218192: Remove copy constructor for MemRegion
Wed, 20 Feb 2019 16:29:29 +0100 rkennke 8203232: Shenandoah: Resolve oops in SATB filter
Mon, 25 Feb 2019 17:08:41 -0800 robm Merge
Fri, 01 Feb 2019 13:33:02 -0800 iignatyev 8218178: vmTestbase/vm/mlvm/mixed/stress/regression/b6969574/INDIFY_Test.java fails with -Xcomp
Fri, 01 Feb 2019 09:25:31 -0800 amenkov 8218025: disable pop_frame and force_early_return caps for Graal
Fri, 01 Feb 2019 08:59:03 -0800 naoto 8216546: Support new Japanese era in java.lang.Character for Java SE 11
Thu, 31 Jan 2019 22:17:14 -0800 iignatyev 8218162: problem list j/u/s/t/o/o/t/java/util/stream/StreamLinkTest.java on solaris w/ Xcomp
Thu, 31 Jan 2019 22:17:09 -0800 iignatyev 8218168: clean up hotspot ProblemList
Fri, 01 Feb 2019 09:11:13 +0530 pmuthuswamy 8218134: Modify the jQuery.md file to reflect the exact jQuery license content
Thu, 31 Jan 2019 12:43:59 -0800 naoto 8217892: Clarify the support for the new Japanese era in java.time.chrono.JapaneseEra
Thu, 31 Jan 2019 13:05:24 +0530 nishjain 8214935: Upgrade IANA LSR data
Wed, 30 Jan 2019 17:35:20 -0800 iignatyev 8178798: Two compiler/aot/verification/vmflags tests fail by timeout with UseAVX=3
Thu, 31 Jan 2019 01:12:11 +0100 jwilhelm Added tag jdk-12+30 for changeset 6c377af36a5c
Wed, 30 Jan 2019 14:03:08 -0800 prr 8218020: Fix version number in mesa.md 3rd party legal file
Wed, 30 Jan 2019 13:11:16 -0800 iignatyev 8218079: cleanup hotspot ProblemList files
Wed, 30 Jan 2019 15:42:47 -0500 mullan 8217579: TLS_EMPTY_RENEGOTIATION_INFO_SCSV is disabled after 8211883jdk-12+30
Wed, 30 Jan 2019 09:30:40 -0800 iignatyev 8207922: ctw of jdk.security.auth failed with "Unexpected zero exit codebefore finishing all compilations"
Wed, 30 Jan 2019 15:02:05 +0530 kaddepalli 8215921: There is no change when select different Foreground and Background by mouse.
Wed, 20 Feb 2019 19:41:43 -0500 dholmes 8217765: Internal Error (javaCalls.cpp:61) guarantee(thread->can_call_java()) failed
Mon, 11 Feb 2019 16:49:08 +0100 rkennke 8217874: Shenandoah: Clobbered register in ShenandoahBarrierSetAssembler::cmpxchg_oop()
Sat, 26 Jan 2019 01:21:33 +0100 rkennke 8217016: Shenandoah: Streamline generation of CAS barriers
Fri, 15 Feb 2019 11:46:15 -0300 mbalao 8219011: Implement MacroAssembler::warn method on AArch64
Thu, 21 Feb 2019 15:52:42 +0100 shade 8219524: Shenandoah misreports "committed" size in MemoryMXBean
Sun, 06 Jan 2019 19:28:21 -0800 itakiguchi 8211267: StackOverflowError happened by TextField.setFont(...)
Sat, 16 Feb 2019 21:15:33 +0100 shade 8216049: stringTable::intern creates redundant String when looking up existing one
Wed, 16 Jan 2019 13:38:19 -0500 stooke 8216578: Remove unused/obsolete method in JFR code
Thu, 31 Jan 2019 23:56:37 +0800 aoqi 8217597: [TESTBUG] old version docker does not support --cpus
Fri, 21 Dec 2018 16:56:40 +0100 mgronlun 8215727: Restore JFR thread sampler loop to old / previous behavior
Fri, 18 Jan 2019 17:05:41 +0100 shade 8217315: Proper units should print more significant digits
Wed, 30 Jan 2019 19:45:10 +0100 shade 8217994: os::print_hex_dump should be more resilient against unreadable memory
Fri, 01 Feb 2019 21:43:37 +0900 ysuenaga 8217432: MetaspaceGC::_capacity_until_GC exceeds MaxMetaspaceSize
Fri, 04 Jan 2019 17:46:56 +0100 mbaesken 8215962: Support ThreadPriorityPolicy mode 1 for non-root users on linux/bsd
Fri, 11 Jan 2019 13:34:57 +0100 sgehwolf 8216559: [JFR] Native libraries not correctly parsed from /proc/self/maps
Fri, 11 Jan 2019 23:32:52 +0900 ysuenaga 8216486: Possibility of integer overflow in JfrThreadSampler::run()
Wed, 16 Jan 2019 19:09:16 +0000 dfuchs 8217094: HttpClient SSL race if a socket IOException is raised before ALPN is available
Sun, 20 Jan 2019 12:20:37 -0500 zgu 8217342: Build failed with excluding JFR
Sat, 19 Jan 2019 11:20:01 +0100 shade 8217343: Shenandoah control thread should be able to run at critical priority
Fri, 25 Jan 2019 16:57:50 +0100 shade 8217471: [TESTBUG] gc/epsilon/TestClasses.java fails on some platforms - OOME Metaspace
Fri, 18 Jan 2019 16:40:24 +0100 shade 8217014: Epsilon should not ignore Metadata GC causes
Mon, 14 Jan 2019 17:20:20 +0100 shade 8216308: StackTraceElement::fill_in can use injected Class source-file
Wed, 09 Jan 2019 20:28:16 +0100 shade 8216302: StackTraceElement::fill_in can use cached Class.name
Sat, 19 Jan 2019 11:19:55 +0100 shade 8217378: UseCriticalCMSThreadPriority is broken
Mon, 11 Feb 2019 13:23:20 -0800 ascarpino 8201633: Problems with AES-GCM native acceleration
Fri, 18 Jan 2019 09:10:49 -0500 zgu 8217319: Cleanup Shenandoah includes
Mon, 14 Jan 2019 12:51:45 -0500 zgu 8215549: Shenandoah deduplication cleans up table/queue twice
Mon, 14 Jan 2019 12:49:12 +0100 rkennke 8216973: Kick up cleanup phases in the right places
Fri, 18 Jan 2019 17:34:36 -0800 vlivanov 8217400: Optimized build is broken by Shenandoah changes
Thu, 17 Jan 2019 08:48:56 -0500 zgu 8217213: shenandoahTaskQueue.hpp includes .inline.hpp file
Thu, 17 Jan 2019 17:28:47 +0100 shade 8217321: [TESTBUG] utilities/test_globalDefinitions.cpp should use _LP64, not LP64
Tue, 29 Jan 2019 11:21:43 -0800 sangheki 8217666: gc/nvdimm/* should not be included any tiers
Mon, 28 Jan 2019 10:24:23 +0100 shade 8217854: [TESTBUG] runtime/CompressedOops/UseCompressedOops.java fails with Shenandoah
Mon, 28 Jan 2019 08:58:42 +0100 pliden 8217717: ZGC: Broken oop map in C1 load barrier stub
Sat, 26 Jan 2019 12:51:27 -0800 iignatyev 8217852: problem-list ctw of jdk.jconsole and java.desktop on windows
Fri, 25 Jan 2019 14:50:25 -0800 iveresov 8217828: Un-ProblemList LongMulOverflowTest.java
Fri, 25 Jan 2019 17:54:02 +0100 jwilhelm 8217797: ProblemList LongMulOverflowTest.java
Fri, 25 Jan 2019 08:52:32 -0800 iignatyev 8067250: [mlvm] vm/mlvm/mixed/stress/regression/b6969574 fails and perf regression
Wed, 23 Jan 2019 13:40:09 +0100 ehelin 8213231: ThreadSnapshot::_threadObj can become stale
Fri, 25 Jan 2019 10:59:07 +0000 clanger 8217657: Move the test for default value of jdk.includeInExceptions into own test
Thu, 24 Jan 2019 23:52:55 -0800 iignatyev 8217770: problem list org.graalvm.compiler.debug.test.DebugContextTest
Fri, 25 Jan 2019 00:23:52 +0100 jwilhelm 8217580: Remove tests from problemList as bugs has been closed
Thu, 24 Jan 2019 12:23:01 +0100 pliden 8217309: ZGC: Fix ZNMethodTable corruption
Wed, 23 Jan 2019 23:24:10 -0800 jcm 8213825: assert(false) failed: Non-balanced monitor enter/exit! Likely JNI locking
Wed, 23 Jan 2019 20:25:30 -0800 iignatyev 8217699: add java/util/concurrent/CountDownLatch/Basic.java to ProblemList-Xcomp
Tue, 30 Jan 2018 16:48:53 -0800 iignatyev 8167276: jvmci/compilerToVM/MaterializeVirtualObjectTest.java fails with -XX:-EliminateAllocations
Wed, 23 Jan 2019 18:45:34 -0800 iignatyev 8150757: [TESTBUG] compiler/ciReplay/TestVM.sh and compiler/ciReplay/TestVM_no_comp_level.sh fail when no compilations are happening
Wed, 23 Jan 2019 16:57:01 -0800 iveresov 8217678: [AOT] jck Math/IncrementExact and Math/DecrementExact tests fail when test classes are AOTed
Wed, 23 Jan 2019 16:36:45 -0800 iignatyev 8216180: [AOT] compiler/intrinsics/bigInteger/TestMulAdd.java crashed with AOT enabled
Wed, 23 Jan 2019 16:25:40 -0800 iignatyev 8158646: [jittester] generated tests may not compile by javac
Thu, 24 Jan 2019 00:43:22 +0100 jwilhelm Added tag jdk-12+29 for changeset 44f41693631f
Mon, 21 Jan 2019 13:31:42 +0800 fyang 8217359: C2 compiler triggers SIGSEGV after transformation in ConvI2LNode::Idealjdk-12+29
Mon, 21 Jan 2019 10:17:28 +0100 goetz 8217438: Adapt tools/launcher/Test7029048.java for Aix.
Tue, 22 Jan 2019 17:31:19 -0800 prr 8216965: crash in freetypeScaler.c CopyBW2Grey8
Tue, 22 Jan 2019 16:35:57 -0800 mikael 8217349: Problem list java/lang/invoke/LFCaching/LFMultiThreadCachingTest.java
Tue, 22 Jan 2019 21:18:25 +0100 shade 8217467: Access barriers are missing in C2 intrinsic for Base64
Tue, 22 Jan 2019 11:42:13 -0800 sangheki 8213695: gc/TestAllocateHeapAtMultiple.java is slow in some configs
Tue, 22 Jan 2019 18:25:56 +0100 thartmann 8217230: assert(t == t_no_spec) failure in NodeHash::check_no_speculative_types()
Tue, 22 Jan 2019 09:27:19 -0500 mullan 8216280: Allow later Symantec Policy distrust date for two Apple SubCAs
Tue, 22 Jan 2019 10:25:22 +0800 ngasson 8217427: (dc) nio/channels/DatagramChannel/UseDGWithIPv6.java fails without IPv6
Mon, 21 Jan 2019 06:55:59 +0000 clanger 8207404: MulticastSocket tests failing on AIX
Sun, 20 Jan 2019 14:57:22 +0100 dnsimon 8215375: [Graal] jck:vm/jvmti/Exception/excp001/excp00101 fails in Graal as JIT mode and -Xcomp mode
Fri, 18 Jan 2019 16:11:36 -0800 dlong 8217394: Remove org.graalvm.compiler.debug.test.TimerKeyTest from problem list
Fri, 18 Jan 2019 14:25:34 +0800 jjiang 8203687: javax/net/ssl/compatibility/Compatibility.java supports TLS 1.3
Wed, 16 Jan 2019 16:27:21 -0800 mr 8216532: tools/launcher/Test7029048.java fails (Solaris)
Thu, 17 Jan 2019 00:55:19 +0100 jwilhelm Added tag jdk-12+28 for changeset 659b004b6a1b
Wed, 16 Jan 2019 11:19:43 -0800 xuelei 8216045: The size of key_exchange may be wrong on FFDHE
Wed, 16 Jan 2019 23:56:32 +0530 mhalder 8215280: Double click on titlebar not working for Frame with extended state set to MAXIMIZED_BOTHjdk-12+28
Tue, 15 Jan 2019 16:41:17 -0800 vlivanov 8215757: C2: PhaseIdealLoop::create_new_if_for_predicate() computes wrong IDOM
Fri, 11 Jan 2019 14:27:22 +0100 roland 8217042: Shenandoah: write barrier on backedge of strip mined loop causes c2 crash at expansion time
Mon, 14 Jan 2019 13:53:42 +0100 roland 8217043: Shenandoah: SIGSEGV in Type::meet_helper() at barrier expansion time
Wed, 16 Jan 2019 11:43:51 +0100 tschatzl 8216490: Spammy periodic GC log message contains random time stamp with periodic gc disabled
Wed, 16 Jan 2019 09:48:35 +0100 lucy 8216314: SIGILL in CodeHeapState::print_names()
Tue, 15 Jan 2019 22:59:33 -0800 never 8215748: Application fails when executed with Graal
Wed, 16 Jan 2019 11:25:55 +0800 weijun 8215694: keytool cannot generate RSASSA-PSS certificates
Fri, 07 Dec 2018 16:56:53 -0800 cushon 8198526: getAnnotatedOwnerType does not handle static nested classes correctly
Tue, 15 Jan 2019 11:19:14 -0800 vdeshpande 8216050: Superword optimization fails with assert(0 <= i && i < _len) failed: illegal index
Tue, 15 Jan 2019 10:55:26 -0800 henryjen Merge
Thu, 13 Dec 2018 11:51:06 -0800 henryjen Merge
Thu, 13 Dec 2018 11:47:35 -0800 henryjen Merge
Thu, 13 Sep 2018 01:49:48 +0200 jwilhelm 8199552: Update to build scripts
Mon, 08 Oct 2018 12:53:53 -0700 prr 8210866: Improve JPEG processing
Mon, 08 Oct 2018 12:55:04 +0800 weijun 8210870: Libsunmscapi improved interactions
Fri, 05 Oct 2018 11:36:30 -0700 prr 8210606: Improved data set handling
Fri, 05 Oct 2018 08:54:10 +0100 michaelm 8209094: Improve web server connections
Wed, 22 Aug 2018 15:55:04 -0700 bpb 8200659: Improve BigDecimal support
Sat, 29 Sep 2018 10:08:42 +0800 weijun 8210610: Improved LSA authentication
Thu, 27 Sep 2018 12:54:50 -0700 serb 8210598: Strengthen Windows Access Bridge Support
Tue, 25 Sep 2018 16:49:51 -0700 bpb 8206290: Better FileChannel transfer performance
Wed, 12 Sep 2018 08:26:31 -0400 coleenp 8210624: Clean up better loading tests
Mon, 10 Sep 2018 16:49:01 -0400 coleenp 8210094: Better loading of classloader classes
Tue, 28 Aug 2018 13:22:57 +0530 sdama 8203688: [testbug] Nashorn test test/nashorn/script/nosecurity/treeapi/diagnostic.js fails
Tue, 21 Aug 2018 13:57:18 -0700 serb 8203955: Improve robot support
Thu, 16 Aug 2018 10:22:25 -0700 serb 8204895: Better icon support
Wed, 15 Aug 2018 09:36:32 -0700 jnimeh 8206295: More reliable p11 transactions
Fri, 10 Aug 2018 15:02:30 +0100 chegar 8199156: Better route routing
Fri, 10 Aug 2018 14:35:44 +0100 chegar 8199166: Better interface lists
Sun, 12 Aug 2018 18:05:16 -0400 dholmes 8205714: Initial class initialization
Tue, 31 Jul 2018 11:43:24 +0530 psadhukhan 8205360: Choose printer defaults
Thu, 19 Jul 2018 15:23:06 -0700 dtitov 8205709: Proper allocation handling
Thu, 19 Jul 2018 07:02:42 -0700 bpb 8206301: Improve NIO stability
Thu, 14 Jun 2018 23:47:05 +0000 valeriep 8203654: Improve cypher state updates
Tue, 15 Jan 2019 11:05:25 -0800 jjg 8212233: javadoc fails on jdk12 with "The code being documented uses modules but the packages defined in $URL are in the unnamed module."
Tue, 15 Jan 2019 10:40:32 -0800 iveresov 8196568: [Graal] LongMulOverflowTest.java fails with "runTestOverflow() did not overflow"
Tue, 18 Dec 2018 10:12:28 +0100 phedlin 8210392: assert(Compile::current()->live_nodes() < Compile::current()->max_node_limit()) failed: Live Node limit exceeded limit
Tue, 15 Jan 2019 09:44:18 +0100 eosterlund 8216427: ciMethodData::load_extra_data() does not always unpack the last entry
Mon, 14 Jan 2019 15:07:22 +0100 roland 8216135: C2 assert(!had_error) failed: bad dominance
Mon, 14 Jan 2019 13:45:19 -0800 kvn 8216151: [Graal] Module jdk.internal.vm.compiler.management has not been granted accessClassInPackage.org.graalvm.compiler.debug
Mon, 14 Jan 2019 16:35:16 -0500 lancea 8216362: Better error message handling when there is an invalid Manifest
Mon, 14 Jan 2019 21:34:39 +0100 dnsimon 8215313: [AOT] java/lang/String/Split.java fails with AOTed java.base
Mon, 14 Jan 2019 10:00:45 -0800 xuelei 8214418: half-closed SSLEngine status may cause application dead loop
Fri, 11 Jan 2019 10:03:00 +0100 roland 8216549: Mismatched unsafe access to non escaping object fails
Fri, 11 Jan 2019 11:42:23 -0800 jjg Merge
Fri, 11 Jan 2019 11:32:00 -0800 jjg 8210561: Command-line help wrong for javac --module
Fri, 11 Jan 2019 08:32:44 -0800 darcy 8213299: runtime/appcds/jigsaw/classpathtests/EmptyClassInBootClassPath.java failed with java.lang.NoSuchMethodException
Fri, 11 Jan 2019 09:02:44 -0500 vromero 8215648: remove equals and hashCode implementations from j.l.i.VarHandle
Thu, 10 Jan 2019 13:54:09 +0100 roland 8216482: Shenandoah: typo in ShenandoahBarrierSetC2::clone_barrier_at_expansion() causes failed compilations
Fri, 11 Jan 2019 13:15:37 +0100 eosterlund 8215754: ZGC: nmethod is not unlinked from Method before rendezvous handshake
Fri, 11 Jan 2019 11:02:00 +0100 mdoerr 8216376: [PPC64] Possibly unreliable stack frame resizing in template interpreter
Fri, 11 Jan 2019 10:46:29 +0100 jlahoda 8215244: jdk/jshell/ToolBasicTest.java testHistoryReference failed
Fri, 11 Jan 2019 09:37:31 +0100 itakiguchi 8211841: [testbug] sun/nio/cs/OLD/TestIBMDB.java does not compile (aix)
Thu, 10 Jan 2019 18:10:15 +0100 eosterlund 8215889: assert(!_unloading) failed: This oop is not available to unloading class loader data with ZGC
Wed, 09 Jan 2019 15:53:56 +0100 shade 8215724: Epsilon: ArrayStoreExceptionTest.java fails; missing arraycopy check
Thu, 10 Jan 2019 13:03:34 -0500 jiangli 8214827: Incorrect call ClassLoaders.toFileURL("jrt:/java.compiler")
Thu, 10 Jan 2019 07:54:16 -0800 robm 8214440: ldap over a TLS connection negotiate failed with "javax.net.ssl.SSLPeerUnverifiedException: hostname of the server '' does not match the hostname in the server's certificate"
Thu, 10 Jan 2019 12:14:12 +0100 tschatzl 8216316: Tests fail due to too low specified TLAB size
Thu, 10 Jan 2019 02:47:26 +0100 jwilhelm Added tag jdk-12+27 for changeset f15d443f9731
Wed, 09 Jan 2019 18:17:36 -0400 jlaskey 8215493: String::indent inconsistency with blank lines
Wed, 09 Jan 2019 16:41:16 -0400 jlaskey 8215489: Remove String::align
Wed, 09 Jan 2019 15:23:11 -0400 jlaskey 8215112: String::transform spec clarification
Wed, 09 Jan 2019 08:52:47 -0800 mr 8210669: Some launcher tests assume a pre-JDK 9 run-time image layout
Wed, 09 Jan 2019 08:49:26 -0800 jjg 8215308: pandoc-html-manpage-filter.js does not work for [un]pack200
Wed, 09 Jan 2019 11:13:00 -0400 jlaskey 8215681: Remove compiler support for Raw String Literals from JDK 12jdk-12+27
Wed, 09 Jan 2019 15:36:20 +0100 neliasso 8215755: ZGC: split_barrier_thru_phi: check number of inputs of phi
Wed, 09 Jan 2019 07:52:45 -0500 coleenp 8215575: C2 crash: assert(get_instanceKlass()->is_loaded()) failed: must be at least loaded
Wed, 09 Jan 2019 08:07:23 -0500 vromero 8215510: j.l.c.ClassDesc is accepting descriptors not allowed by the spec
Wed, 09 Jan 2019 13:31:34 +0100 pliden 8215708: ZGC: Add missing LoadBarrierNode::size_of()
Wed, 19 Dec 2018 11:45:54 +0000 adinn 8209414: AArch64: method handle invocation does not respect JVMTI interp_only mode
Wed, 09 Jan 2019 10:18:37 +0100 pliden 8216385: ZGC: Fix building without C2
Fri, 07 Dec 2018 17:56:51 +0100 roland 8214862: assert(proj != __null) at compile.cpp:3251
Wed, 09 Jan 2019 00:25:41 -0800 ljiang 8215994: JDK 12 l10n resource file update - msg drop 10
Tue, 08 Jan 2019 16:26:46 -0800 darcy 8216322: Missing since information in deprecation of constructor visitors
Sat, 05 Jan 2019 10:48:54 +0800 fyang 8215951: AArch64: jtreg test vmTestbase/nsk/jvmti/PopFrame/popframe005 segfaults
Tue, 08 Jan 2019 10:05:42 -0800 naoto 8216176: Clarify the singleton description in j.t.c.JapaneseEra class
Tue, 08 Jan 2019 16:31:27 +0100 jlahoda 8215438: jshell tool: Ctrl-D causes EOF
Tue, 08 Jan 2019 09:29:36 +0100 goetz 8216271: Make AllocateOldGenAt an unsupported option on AIX.
Mon, 07 Jan 2019 12:22:31 +0100 eosterlund 8215773: applications/kitchensink/Kitchensink.java crash with "assert(ZAddress::is_marked(addr)) failed: Should be marked"
Mon, 07 Jan 2019 13:04:32 +0100 jwilhelm 8216266: ProblemList PeelingZeroTripCount.java
Mon, 07 Jan 2019 10:00:41 +0100 erikj 8215400: Warn on usage of trampolines with gcc
Fri, 04 Jan 2019 15:17:40 -0800 mseledtsov 8215583: Exclude runtime/handshake/HandshakeWalkSuspendExitTest.java
Fri, 04 Jan 2019 11:00:29 +0100 erikj 8216021: RunTest.gmk might set concurrency level to 1 on Windows
Thu, 03 Jan 2019 14:55:13 -0800 sviswanathan 8215888: Register to register spill may use AVX 512 move instruction on unsupported platform.
Thu, 03 Jan 2019 14:33:58 -0800 ccheung 8215947: JVM crash with -XX:+DumpSharedSpaces
Fri, 14 Dec 2018 11:22:26 +0100 roland 8215265: C2: range check elimination may allow illegal out of bound access
Mon, 31 Dec 2018 14:38:16 +0100 goetz 8215975: [testbug] Adapt nsk tests to the PPC, S390 and AIX platforms.
Thu, 13 Dec 2018 17:57:11 +0100 roland 8215044: C2 crash in loopTransform.cpp with assert(cl->trip_count() > 0) failed: peeling a fully unrolled loop
Thu, 03 Jan 2019 11:21:11 +0530 sdama 8208184: IllegalArgumentException while invoking code completion on netbeans IDE
Thu, 03 Jan 2019 02:22:30 +0100 jwilhelm Added tag jdk-12+26 for changeset de9fd809bb47
Wed, 26 Dec 2018 17:09:19 +0530 rpatil 8214567: Use {@systemProperty} for definitions of system propertiesjdk-12+26
Sat, 22 Dec 2018 15:47:10 +0100 sjohanss 8215898: Build broken on 32-bit after JDK-8211425
Sat, 22 Dec 2018 15:46:54 +0100 sjohanss 8215897: Build broken on zero after JDK-8211424
Fri, 21 Dec 2018 08:23:55 -0800 sangheki 8211424: Allocation of old generation of java heap on alternate memory devices - Parallel GC
Fri, 21 Dec 2018 08:18:59 -0800 sangheki 8211425: Allocation of old generation of java heap on alternate memory devices - G1 GC
Fri, 21 Dec 2018 18:26:55 +0000 aph 8215879: AArch64: ReservedStackAccess may leave stack guard in inconsistent state
Fri, 21 Dec 2018 17:14:46 +0000 aph 8215202: AArch64: jtreg test test/jdk/sun/nio/cs/FindEncoderBugs.java fails
Fri, 21 Dec 2018 11:02:36 +0100 hannesw 8215291: Broken links when generating from project without modules
Fri, 21 Dec 2018 11:43:04 +0530 pbansal 8215364: JavaFX crashes on Ubuntu 18.04 with Wayland while using Swing-FX interop
Thu, 20 Dec 2018 19:44:08 +0100 redestad 8215555: TieredCompilation C2 threads can excessively block handshakes
Thu, 20 Dec 2018 19:44:33 +0100 tschatzl 8215548: G1PeriodicGCSystemLoadThreshold needs to be a double
Thu, 20 Dec 2018 17:07:07 +0000 aph 8215100: AArch64: fix compareTo intrinsic with four-character Latin/Unicode
Thu, 20 Dec 2018 17:29:59 +0100 lucy 8215551: Missing case label in nmethod::reloc_string_for()
Thu, 20 Dec 2018 05:27:42 -0800 erikj 8215635: Pandoc check in Docs.gmk does not work on Windows
Thu, 20 Dec 2018 11:43:04 +0100 pliden 8215547: ZGC: Fix incorrect match rule for loadBarrierWeakSlowRegNoVec
Thu, 20 Dec 2018 10:41:45 +0100 eosterlund 8215491: ICStubInterface::finalize finds zombie nmethod with ZGC concurrent class unloading
Thu, 20 Dec 2018 10:41:45 +0100 eosterlund 8215500: ICRefillVerifierMark does not set the provided verfier as current
Thu, 20 Dec 2018 02:54:16 +0100 jwilhelm Added tag jdk-12+25 for changeset 7496df94b3b7
Wed, 19 Dec 2018 18:21:38 +0000 coffeys 8214532: Update RFC 2459 references in javadoc to RFC 5280
Wed, 19 Dec 2018 08:32:48 +0100 pliden 8215487: ZGC: ZRuntimeWorkers incorrectly identify themselves as ZWorkers
Tue, 18 Dec 2018 13:37:06 -0800 iignatyev 8215322: add @file support to jaotc
Wed, 19 Dec 2018 11:08:08 +0530 pmuthuswamy 8214570: Use {@systemProperty} for definitions of system properties
Wed, 19 Dec 2018 02:27:44 +0000 valeriep 8214096: sun.security.util.SignatureUtil passes null parameter, so JCE validation fails
Tue, 18 Dec 2018 16:36:26 -0800 dlong 8214583: AccessController.getContext may return wrong value after JDK-8212605jdk-12+25
Tue, 18 Dec 2018 15:18:44 -0800 xuelei 8209333: Socket reset issue for TLS 1.3 socket close
Tue, 18 Dec 2018 12:45:07 -0800 dlong 8214329: SwingMark SubMenus 9% regression in 12-b19 on Linux client
Tue, 18 Dec 2018 12:36:27 -0800 dlong 8215205: javaVFrame much slower than vframeStream
Tue, 18 Dec 2018 12:08:51 -0800 xuelei 8215443: The use of TransportContext.fatal() leads to bad coding style
Tue, 18 Dec 2018 19:13:54 +0530 rraghavan 8211698: Crash in C2 compiled code during execution of double array heavy processing code
Tue, 18 Dec 2018 12:59:39 +0530 mchinnathamb 8215397: jsig.c missing classpath exception
Mon, 17 Dec 2018 10:36:07 -0800 dlong 8214512: ARM32: Jtreg test compiler/c2/Test8062950.java fails on ARM
Mon, 17 Dec 2018 16:55:17 +0100 pliden 8215451: JNI IsSameObject should not keep objects alive
Mon, 17 Dec 2018 08:25:57 +0100 thartmann 8215410: Regression test for JDK-8214994
Sat, 15 Dec 2018 17:13:39 -0800 rfield 8215099: jshell tool: /help representation of ctrl/meta characters inconsistent
Sat, 15 Dec 2018 20:03:06 +0100 pliden 8215395: Allow null oops in Dictionary and JNIHandle verification
Fri, 14 Dec 2018 19:39:39 -0800 xuelei 8214339: SSLSocketImpl erroneously wraps SocketException
Fri, 14 Dec 2018 17:51:02 -0800 xuelei 8213782: NullPointerException in sun.security.ssl.OutputRecord.changeWriteCiphers
Fri, 14 Dec 2018 17:32:16 -0800 dnsimon 8215319: jck lang/INTF/intf049/intf04901 fails in Graal as JIT mode with -Xcomp and AOTed Graal
Fri, 14 Dec 2018 19:49:03 +0000 prappo 8215292: Back out changes for node- and link- local ipv6 multicast address
Wed, 28 Nov 2018 16:22:03 +0800 yzhang 8213134: AArch64: vector shift failed with MaxVectorSize=8
Fri, 14 Dec 2018 12:56:59 +0100 shade 8215374: 32-bit build failures after JDK-8181143 (Introduce diagnostic flag to abort VM on too long VM operations)
Fri, 14 Dec 2018 12:56:57 +0100 shade 8215353: x86_32 build failures after JDK-8214751 (X86: Support for VNNI Instructions)
Fri, 14 Dec 2018 12:02:39 +0100 redestad 8215380: Backout accidental change to String::length
Fri, 14 Dec 2018 06:39:14 +0100 jwilhelm Added tag jdk-12+24 for changeset 7d4397b43fa3
Thu, 13 Dec 2018 23:25:00 +0100 egahlin 8215362: JFR GTest JfrTestNetworkUtilization failsjdk-12+24
Thu, 13 Dec 2018 14:16:21 -0800 lmesnik 8215369: Jcstress pollute /var/tmp with temporary files.
Thu, 13 Dec 2018 16:45:26 +0100 shade 8215356: Disable x86_32 Shenandoah build to avoid hotspot/tier1 failures
Thu, 13 Dec 2018 16:45:24 +0100 shade 8181143: Introduce diagnostic flag to abort VM on too long VM operations
Thu, 13 Dec 2018 10:35:09 -0500 vromero 8215300: additional changes to constants API
Thu, 13 Dec 2018 15:31:05 +0100 redestad 8215281: Use String.isEmpty() when applicable in java.base
Thu, 13 Dec 2018 16:14:07 +0100 shade 8215354: x86_32 build failures after JDK-8214074 (Ghash optimization using AVX instructions)
Thu, 13 Dec 2018 15:40:11 +0100 egahlin 8215237: jdk.jfr.Recording javadoc does not compile
Wed, 12 Dec 2018 13:50:57 -0500 zgu 8215220: Simplify Shenandoah task termination in aborted paths
Thu, 13 Dec 2018 14:36:54 +0100 mgronlun 8215284: Reduce noise induced by periodic task getFileSize()
Thu, 13 Dec 2018 14:21:04 +0100 egahlin 8215175: Inconsistencies in JFR event metadata
Thu, 13 Dec 2018 10:25:50 +0100 sgehwolf 8215342: [Zero] Build fails after JDK-8200613
Wed, 12 Dec 2018 12:36:53 -0500 mhorie 8215262: PPC64: FMA Vectorization on PPC64
Thu, 13 Dec 2018 08:36:10 +0100 goetz 8215534: [testbug] some jfr test don't check @requires vm.hasJFR
Thu, 13 Dec 2018 11:27:37 +0000 dfuchs 8211093: Default logging.properties sets log level for com.xyz.foo
Thu, 13 Dec 2018 15:11:25 +0530 jgeorge 8214226: Incorrect BCI and Line Number with jstack if the top frame is in the interpreter
Thu, 13 Dec 2018 17:28:30 +0800 weijun 8213010: Supporting keys created with certmgr.exe
Thu, 13 Dec 2018 17:28:19 +0800 weijun 8213009: Refactoring existing SunMSCAPI classes
Thu, 13 Dec 2018 09:02:52 +0000 alanb 8214696: Module class should be filtered by core reflection
Thu, 13 Dec 2018 13:03:26 +0530 jgeorge 8202884: SA: Attach/detach might fail on Linux if debugee application create/destroy threads during attaching
Thu, 13 Dec 2018 08:26:07 +0100 jlahoda 8215243: JShell tests failing intermitently with \"Problem cleaning up the following threads:\"
Wed, 12 Dec 2018 23:08:01 -0800 jcm 8211034: OnStackReplacePercentage option checking has bugs
Wed, 12 Dec 2018 22:23:48 -0800 epavlova 8215314: [Graal] Enable org.graalvm.compiler.core.test.CountedLoopTest