log

age author description
Thu, 07 Dec 2017 08:56:04 -0800 bpb 8191872: (fs) UnixNativeDispatcher conditionally compiles in support for high precision timestamps
Thu, 07 Dec 2017 16:45:19 +0000 alanb 8191867: Module attribute in 54.0+ class file cannot contains a requires java.base with ACC_TRANSITIVE or ACC_STATIC_PHASE
Fri, 08 Dec 2017 15:14:08 -0800 ccheung 8192989: runtime/appcds/javaldr/ArrayTest.java crashes with assert(k->is_instance_klass())
Fri, 08 Dec 2017 15:24:47 -0500 dcubed 8193135: get rid of redundant _smr_ prefix/infix in ThreadSMRSupport stuff
Fri, 08 Dec 2017 15:41:11 +0530 sballal 8193124: SA: Testcases for clhsdb jdis and findpc commands
Thu, 07 Dec 2017 20:08:10 -0500 dcubed 8193225: [BACKOUT] fix for 8182307 Error during JRMP connection establishment
Thu, 07 Dec 2017 15:26:49 -0500 dcubed 8182307: Error during JRMP connection establishment
Thu, 07 Dec 2017 10:21:13 -0800 sangheki 8193105: Print error code when map_memory_to_file() fails
Thu, 07 Dec 2017 15:52:46 +0100 roland 8192908: -XX:+UseCountedLoopSafepoints alone doesn't disable strip mining with G1
Thu, 07 Dec 2017 10:18:31 +0100 jwilhelm Merge
Tue, 05 Dec 2017 16:34:03 +0100 sjohanss 8193068: Add gc/g1/TestVerifyGCType.java to problem list
Wed, 06 Dec 2017 20:06:43 -0500 jiangli 8193065: [TESTBUG] [TESTBUG]GCSharedStringsDuringDump.java: Exception in thread "main" java.lang.RuntimeException: String is not shared.
Wed, 06 Dec 2017 18:37:57 -0800 dlong 8193009: compiler/c2/Test7029152.java crashes with SIGILL in java.lang.StringLatin1.indexOf with -XX:+UseJVMCICompiler
Tue, 05 Dec 2017 13:58:55 +0100 sjohanss 8192983: gc/g1/TestVerifyGCType.java might fail on loaded machines
Tue, 05 Dec 2017 21:26:11 +0530 hb 8192909: Invalid username or password in HashedPasswordFileTest.java
Sat, 02 Dec 2017 13:50:04 +0100 roland 8191950: assertion failed: no insertions allowed
Sat, 02 Dec 2017 06:51:10 +0100 jwilhelm Merge
Wed, 06 Dec 2017 15:14:13 -0800 ksrini 8192933: Wrong generic type parameter in serialized form javadoc
Wed, 06 Dec 2017 14:39:15 -0800 bpb 8191706: Add Reader::transferTo(Writer)
Wed, 06 Dec 2017 11:43:50 -0800 ksrini 8191078: Wrong "Package not found" warning
Wed, 06 Dec 2017 19:17:07 +0000 chegar Merge
Wed, 06 Dec 2017 11:11:59 -0800 chegar 8191494: Refresh incubating HTTP Client
Wed, 06 Dec 2017 13:36:34 -0500 vromero 8192885: Compiler in JDK 10-ea+33 misses to include entry in LineNumberTable for goto instruction of foreach loopjdk-10+35
Fri, 03 Nov 2017 10:01:08 -0700 psandoz 8188870: Bump classfile version number to 54
Wed, 06 Dec 2017 14:33:33 +0000 coffeys 8185855: Debug exception stacks should be clearer
Wed, 06 Dec 2017 13:47:35 +0100 ihse 8193060: Set MAKE env variable in jib profile for gnumake
Wed, 06 Dec 2017 13:45:46 +0100 ihse 8193061: Add run-test-prebuilt functionality
Wed, 06 Dec 2017 02:09:08 -0800 sspitsyn 8182413: jdwp-protocol is generated without a DOCTYPE directive
Wed, 06 Dec 2017 08:36:09 +0000 alanb 8182742: ClassLoader.getResourceXXX throws NPE when ClassLoader created by defineModulesWithXXX
Wed, 06 Dec 2017 08:33:04 +0000 alanb 8186736: Spec clarifications for IllegalArgumentException throwing - ModuleLayer.defineX methods
Wed, 06 Dec 2017 08:28:46 +0000 alanb 8192973: Adding "Module Resolution" to javadoc search index
Wed, 06 Dec 2017 12:05:46 +0530 akolarkunnu 8192958: TEST.groups, group jdk_util_other:file not found: jdk/internal/uti
Wed, 06 Dec 2017 11:21:04 +0530 nishjain 8187551: MessageFormat.setFormat(int, Format) AIOOBE not thrown when documented
Wed, 06 Dec 2017 08:04:35 +0530 sundar 8185130: jlink should throw error if target image and current JDK versions don't match
Tue, 05 Dec 2017 15:31:50 -0800 psandoz 8015667: Stream.toArray(IntFunction) ArrayStoreException should refer to component type of array
Tue, 05 Dec 2017 23:14:35 +0100 erikj 8192771: Boot JDK jar tool used to construct the modular JAR for java.jnlp
Tue, 05 Dec 2017 23:11:27 +0100 erikj 8191439: Race in building jdk.rmic.interim
Tue, 05 Dec 2017 22:26:17 +0100 redestad 8193064: JarFile::getEntry0 method reference use cause for startup regression
Tue, 05 Dec 2017 09:44:32 -0800 bchristi 8187222: ClassLoader.getSystemClassLoader not clear if recursive initialization leads to ISE or unspecified error
Tue, 05 Dec 2017 14:25:16 +0100 redestad 8176188: jdk/internal/misc/JavaLangAccess/NewUnsafeString.java failing since 9-b93
Tue, 05 Dec 2017 14:10:11 +0100 ihse 8193055: ADD_JVM_ARG_IF_OK always fails
Tue, 21 Nov 2017 17:39:04 +0100 goetz 8191678: [TESTBUG] Add keyword headful in java/awt and javax tests.
Tue, 05 Dec 2017 17:19:48 +0800 weijun 8190674: sun/security/tools/jarsigner/TimestampCheck.java failed with java.nio.file.NoSuchFileException: ts2.cert
Mon, 04 Dec 2017 22:31:13 +0100 ihse 8193014: Add "special" tests to run-test to cover odd cases
Mon, 04 Dec 2017 10:04:51 -0800 ksrini 8184683: Add @since and default methods of Compiler Tree API methods
Mon, 04 Dec 2017 11:50:04 -0800 smarks 8177290: add copy factory methods for unmodifiable List, Set, Map
Mon, 04 Dec 2017 19:49:01 +0100 ihse 8192995: run-test gtest should use all jvm variants, not just "server"
Mon, 04 Dec 2017 19:12:57 +0100 ihse 8146977: Move the output "Building configuration X (matching Y)" to lower log level
Mon, 04 Dec 2017 19:10:15 +0100 ihse 8175795: configure should verify that system zlib contains needed functionality
Mon, 04 Dec 2017 19:08:56 +0100 ihse 8192854: FONTCONFIG_CFLAGS missing from spec.gmk.in
Mon, 04 Dec 2017 17:54:49 +0000 mcimadamore 8189749: Devise strategy for making source level checks more uniform
Mon, 04 Dec 2017 10:13:58 +0100 clanger 8192961: Remove some double semicolons
Mon, 04 Dec 2017 09:59:33 +0100 njian 8191955: AArch64: incorrect prefetch distance causes an internal error
Mon, 04 Dec 2017 13:24:00 +0530 vtewari 8190843: can not set/get extendedOptions to ServerSocket
Sun, 03 Dec 2017 01:47:23 -0800 igerasim 8187985: Broken certificate number in debug output
Sat, 02 Dec 2017 18:37:45 -0800 igerasim 8187497: Redundant variable assignment in Java_sun_security_jgss_wrapper_GSSLibStub_getMic
Sat, 02 Dec 2017 10:13:18 -0800 dl 8191069: Miscellaneous changes imported from jsr166 CVS 2017-12
Sat, 02 Dec 2017 10:08:55 -0800 dl 8187947: A race condition in SubmissionPublisher
Sat, 02 Dec 2017 10:03:41 -0800 dl 8191937: Lost interrupt in AbstractQueuedSynchronizer when tryAcquire methods throw
Fri, 01 Dec 2017 22:04:03 -0800 sherman 8191918: tomcat gzip-compressed response bodies appear to be broken in update 151
Fri, 01 Dec 2017 17:06:09 -0800 psandoz 8186961: Class.getFields() does not return fields of previously visited super interfaces/classes.
Fri, 01 Dec 2017 16:58:11 -0800 jjg 8034252: Fix non ASCII text file T6302184.java
Wed, 06 Dec 2017 18:37:57 -0800 dlong 8193009: compiler/c2/Test7029152.java crashes with SIGILL in java.lang.StringLatin1.indexOf with -XX:+UseJVMCICompiler
Wed, 06 Dec 2017 20:06:43 -0500 jiangli 8193065: [TESTBUG] [TESTBUG]GCSharedStringsDuringDump.java: Exception in thread "main" java.lang.RuntimeException: String is not shared.
Wed, 06 Dec 2017 15:19:30 -0500 dcubed 8191789: migrate more Thread-SMR stuff from thread.[ch]pp -> threadSMR.[ch]pp
Tue, 05 Dec 2017 11:16:03 -0800 dlong 8192870: [Testbug] runtime/handshake/HandshakeTransitionTest throws NPE
Tue, 05 Dec 2017 10:38:31 -0800 dlong 8145579: SimpleThresholdPolicy assumes non-trivial methods to be trivial
Tue, 05 Dec 2017 09:49:23 -0800 kvn 8192846: Support cmov vectorization for float
Tue, 05 Dec 2017 21:26:11 +0530 hb 8192909: Invalid username or password in HashedPasswordFileTest.java
Tue, 05 Dec 2017 16:34:03 +0100 sjohanss 8193068: Add gc/g1/TestVerifyGCType.java to problem list
Tue, 05 Dec 2017 13:58:55 +0100 sjohanss 8192983: gc/g1/TestVerifyGCType.java might fail on loaded machines
Tue, 05 Dec 2017 11:23:27 +0100 ihse 8193045: JDK-8190484 breaks build on Windows
Thu, 30 Nov 2017 15:54:45 +0100 phedlin 8191232: compiler/intrinsics/bigInteger/TestMultiplyToLen.java fails with java.lang.Exception: Failed
Tue, 05 Dec 2017 02:55:44 -0500 dholmes 8192950: Missing -nativepath for svc tests
Tue, 05 Dec 2017 08:27:54 +0100 thartmann 8191360: Lookup of critical JNI method causes duplicate library loading with leaking handler
Mon, 04 Dec 2017 10:23:08 +0900 ysuenaga 8192897: NPE occurs on clhsdb jstack
Mon, 04 Dec 2017 23:55:52 +0100 ihse 8190484: Move jvm.h, jmm.h et al to hotspot/*/include
Mon, 04 Dec 2017 13:13:44 -0800 never 8191052: [Graal] java/lang/invoke/CallSiteTest.java intermittently fails with "Failed dependency of type call_site_target_value" when running with Graal as JIT
Sat, 02 Dec 2017 13:50:04 +0100 roland 8191950: assertion failed: no insertions allowed
Sat, 02 Dec 2017 06:51:10 +0100 jwilhelm Merge
Fri, 01 Dec 2017 21:52:54 +0100 ihse 8192816: Let run-test save exit code
Fri, 01 Dec 2017 10:02:25 -0800 joehw 8191938: Fix lint warnings in JAXP repo: a few Deprecation warrnings and enable -Xlint:all
Fri, 01 Dec 2017 09:46:36 -0800 erikj 8192876: MacOS build fails intermittently after JDK-8139653
Fri, 01 Dec 2017 17:00:34 +0100 redestad 8192892: Improve JrtPath::getResolved fast-path test
Fri, 01 Dec 2017 05:27:44 +0000 lana Merge
Fri, 01 Dec 2017 05:26:38 +0000 lana Added tag jdk-10+34 for changeset 89deac44e515
Thu, 30 Nov 2017 19:58:20 -0800 mchung 8192879: jdk.internal.util.jar.VersionedStream is no longer needed
Thu, 30 Nov 2017 17:28:21 -0800 erikj 8190464: OpenJDK on macosx needs to bundle freetype
Thu, 30 Nov 2017 14:49:36 -0800 smarks 8160406: Collection.toArray() spec should be explicit about returning precisely an Object[]
Thu, 30 Nov 2017 16:38:31 -0500 rriggs 8189331: java/io/Serializable/maskSyntheticModifier/MaskSyntheticModifierTest.java failed incorrect serialVersionUID
Thu, 30 Nov 2017 13:29:50 -0800 erikj 8139653: Freetype bundled on macosx, but not correctly linked
Thu, 30 Nov 2017 11:19:14 -0800 sherman 8187910: Charset MS950_HKSCS not supported in JDK 9
Thu, 30 Nov 2017 18:07:41 +0000 aefimov 8186441: Change of behavior in the getMessage () method of the SOAPMessageContextImpl class
Thu, 30 Nov 2017 06:14:25 -0800 ksrini 8185985: Html files in doc-files directories should be wrapped with standard header and footer
Thu, 30 Nov 2017 04:43:09 -0800 ksrini 8190552: Augment the Compiler API tree with APIs to represent HTML content
Thu, 30 Nov 2017 07:54:28 -0500 mullan 8186535: Remove deprecated pre-1.2 SecurityManager methods and fields
Thu, 30 Nov 2017 13:31:30 +0530 nishjain 6354947: [Fmt-*] Clarify DecimalFormat description of FieldPosition usejdk-10+34
Fri, 24 Nov 2017 14:07:59 +0100 dholmes 8191707: Options with invalid values are incorrectly treated as obsolete and ignored
Wed, 22 Nov 2017 09:27:06 -0800 dlong 8191688: Assert failed in > 200 tests: failed dependencies, but counter didn't change
Wed, 22 Nov 2017 16:08:39 -0800 ccheung 8191653: Test failures in BootAppendTests - missing jdk.internal.vm.compiler module
Sun, 26 Nov 2017 09:05:13 -0800 rraghavan 8191313: compiler/runtime/SpreadNullArg.java fails in tier1
Sat, 25 Nov 2017 04:36:43 +0100 jwilhelm Merge
Wed, 29 Nov 2017 21:01:55 -0800 sherman 8192781: tools/jar/multiRelease/Basic.java test Basic.test09(): failure after change d34958
Wed, 29 Nov 2017 20:42:18 -0800 mchung 8191942: Replace jdeps use of jdk.internal.util.jar.VersionedStream with new public API
Wed, 29 Nov 2017 15:27:47 -0800 ksrini 8182108: javadoc makes up type variables for grandparent types
Wed, 29 Nov 2017 15:01:16 -0800 sherman 8189611: JarFile versioned stream and real name support
Wed, 29 Nov 2017 22:23:21 +0100 ihse 8191933: Use failure handler in run-test
Wed, 29 Nov 2017 12:39:59 -0800 psandoz 8187237: Need to define the behaviour for 0 and 1 argument method type in StringConcatFactory.makeConcat
Wed, 29 Nov 2017 21:23:57 +0100 ihse 8192067: Add fixpath to test image
Wed, 29 Nov 2017 10:35:50 -0800 psandoz 8181175: Stream.concat behaves like terminal operation
Wed, 29 Nov 2017 09:47:02 -0800 prr Merge
Wed, 29 Nov 2017 09:07:01 -0800 prr Merge
Tue, 28 Nov 2017 15:01:00 -0800 serb 8043334: Typo in javax/swing/JComponent.html
Tue, 28 Nov 2017 17:30:43 +0530 mhalder 8158366: [macosx] Regression: closed/java/awt/dnd/RecognizedActionTest/RecognizedActionTest.html fails
Tue, 28 Nov 2017 16:27:23 +0530 pbansal 8190861: [TESTBUG] javax/swing/JWindow/ShapedAndTranslucentWindows/PerPixelTranslucentSwing.java is wrong
Mon, 27 Nov 2017 15:28:29 -0800 ssadetsky 8187367: Numerous swing display problems with scaled displays on Windows
Mon, 27 Nov 2017 10:35:05 -0800 prr Merge
Fri, 24 Nov 2017 16:55:18 -0800 rfield 8190939: JShell: gives a compiler error evaluating an expression of inaccessible type
Fri, 24 Nov 2017 13:18:36 +0530 ssreedharan 8176072: READING attributes are not available on TSF
Thu, 23 Nov 2017 23:05:52 -0800 serb 8191384: WaveFloatFileReader never closes the data stream