log

age author description
Thu, 23 May 2019 09:46:49 +0200 thartmann 8223581: C2 compilation failed with assert(!q->is_MergeMem())
Thu, 23 May 2019 08:57:37 +0200 thartmann 8224539: C2 compilation fails during ArrayCopyNode optimizations with assert(i < _max) failed: oob: i=1, _max=1
Thu, 23 May 2019 08:09:29 +0200 pliden 8224185: ZGC: Introduce "High Usage" rule
Wed, 22 May 2019 21:49:31 -0700 darcy 8224628: Note that type parameters are not visited by ElementScanners
Wed, 22 May 2019 21:45:47 -0700 henryjen 8215156: Deprecate the -Xfuture option
Wed, 22 May 2019 21:50:16 -0400 dholmes 8224087: Compile C code for at least C99 Standard compliance
Thu, 23 May 2019 02:36:15 +0200 jwilhelm Added tag jdk-13+22 for changeset 181986c54764
Mon, 20 May 2019 16:47:08 -0700 aeubanks 8224256: test/jdk/java/security/SecureClassLoader/DefineClass.java hardcodes 127.0.0.1
Wed, 22 May 2019 21:38:16 +0000 valeriep 7107615: scalability bloker in javax.crypto.JceSecurity
Wed, 22 May 2019 21:40:58 +0200 shade 8224522: Shenandoah should apply barriers on deoptimizationjdk-13+22
Thu, 23 May 2019 00:21:39 +0800 aoqi 8224568: minimal and zero build fails after JDK-8213084
Wed, 22 May 2019 21:33:58 +0300 dchuyko 8220072: GCC 8.3 reports errors in java.base
Wed, 22 May 2019 10:51:30 -0700 mseledtsov 8224529: [TESTBUG] JFR TestShenandoahHeapRegion* tests fail on build w/o Shenandoah
Wed, 22 May 2019 20:39:04 +0300 dpochepk 8218966: AArch64: String.compareTo() can read memory after string
Wed, 22 May 2019 20:12:19 +0300 dpochepk 8215792: AArch64: String.indexOf generates incorrect result
Mon, 20 May 2019 14:19:19 -0700 aeubanks 8224248: test/jdk/java/net/InetAddress/CheckJNI.java assumes 127.0.0.1 is available
Wed, 22 May 2019 09:32:02 -0700 jcbeyler 8224500: Put HeapMonitorStatArrayCorrectnessTest in the problem list
Wed, 22 May 2019 09:06:24 -0700 dtitov 8214545: sun/management/jmxremote/bootstrap tests hang in revokeall.exe on Windows
Wed, 22 May 2019 09:26:48 -0400 vromero 8223914: specification of j.l.c.MethodTypeDesc::of should document better the exceptions thrown
Wed, 22 May 2019 09:10:07 -0400 zgu 8224525: Shenandoah: Eliminate shenandoah verifier's side-effects
Wed, 22 May 2019 13:58:19 +0100 dfuchs 8224204: Replace wildcard address with loopback or local host in tests - part 10
Wed, 22 May 2019 13:06:31 +0200 stefank 8224203: Remove need to specify type when using FLAG_SET macros
Wed, 22 May 2019 13:05:37 +0200 stefank 8224201: Simplify JVM flag macro expansions
Wed, 22 May 2019 07:12:18 -0400 zgu 8224508: Shenandoah: Need to update thread roots in final mark for piggyback ref update cycle
Wed, 22 May 2019 13:19:04 +0200 redestad 8224589: Improve startup behavior of SecurityProperties
Wed, 22 May 2019 06:29:08 -0400 smonteith 8224187: Refactor arraycopy_prologue to allow ZGC read barriers on arraycopy
Wed, 22 May 2019 06:13:53 -0400 dholmes 8224570: Update ProblemList-graal.txt
Wed, 22 May 2019 11:19:14 +0200 tschatzl 8224160: Move G1RemSetScanClosure into g1RemSet.cpp file
Wed, 22 May 2019 10:48:46 +0200 shade 8224579: ResourceMark not declared in shenandoahRootProcessor.inline.hpp with --disable-precompiled-headers
Wed, 22 May 2019 08:42:00 +0100 clanger 8224573: Fix windows build after JDK-8221507
Wed, 22 May 2019 09:33:22 +0200 stuefe 8224193: stringStream should not use Resouce Area
Wed, 22 May 2019 07:10:54 +0200 stuefe 8224487: outputStream should not be copyable
Tue, 21 May 2019 20:14:30 -0700 henryjen 8218997: Xusage text, man help, etc doesn't mention -Xlog option.
Tue, 21 May 2019 18:40:29 -0700 igerasim 8223593: Refactor code for reallocating storage
Tue, 21 May 2019 19:19:44 -0400 kbarrett 8224167: Refactor PtrQueue completed buffer processing
Tue, 21 May 2019 14:55:30 -0700 joehw 8219692: DOM and SAX parsers ignore namespace
Tue, 21 May 2019 13:40:56 -0700 naoto 8224105: Cannot parse JapaneseDate string on some specified locales
Tue, 21 May 2019 15:59:46 -0400 vromero 8223725: j.l.c.MethodHandleDesc::of throws undocumented exception IllegalArgumentException
Tue, 21 May 2019 12:29:47 -0700 epavlova 8222482: [Graal] Update java-allocation-instrumenter.jar handling in graalunit README.md
Tue, 21 May 2019 15:44:00 -0400 vromero 8223723: j.l.c.MethodTypeDesc.dropParameterTypes? throws the undocumented exception: IllegalArgumentException
Tue, 21 May 2019 20:53:27 +0200 mgronlun 8220293: Deadlock in JFR string pool
Tue, 21 May 2019 13:06:52 -0400 zgu 8224495: Shenandoah: Do not rescan code roots in final mark pause if it is not degenerated GC
Tue, 21 May 2019 18:22:54 +0200 stuefe 8224034: [TESTBUG] runtime/ErrorHandlerTest/ErrorHandler fails intermittently for case 13 on Windows
Tue, 21 May 2019 09:53:16 -0400 coleenp 8224119: Safepoint cleanup logging logs times for things it doesn't do
Tue, 21 May 2019 15:51:35 +0200 lucy 8213084: Rework and enhance Print[Opto]Assembly output
Tue, 21 May 2019 11:45:37 +0200 mdoerr 8224230: [PPC64, s390] Support AsyncGetCallTrace
Tue, 21 May 2019 15:02:18 +0530 pmuthuswamy 8223733: "Detail" in headings should be "Details"
Tue, 21 May 2019 10:46:08 +0200 rehn 8223313: Use handshakes for CountStackFrames.
Tue, 21 May 2019 10:36:23 +0200 kdobson 8221507: Implement JFR Events for Shenandoah
Tue, 21 May 2019 10:34:57 +0200 rehn 8223306: Remove threads linked list (use ThreadsList's array in SA)
Tue, 21 May 2019 00:52:04 -0700 sspitsyn 8183273: Clarify Instrumentation interface should not be implemented outside java.instrument module
Mon, 20 May 2019 18:18:42 -0700 jjg 8224166: Create a taglet to better handle @jls and @jvms tags
Mon, 20 May 2019 17:29:44 -0700 darcy 8224175: Fix inconsistencies in @jls and @jvms tags
Mon, 20 May 2019 15:18:00 -0700 mseledtsov 8220672: [TESTBUG] TestCPUSets should check that cpuset does not exceed available cores
Mon, 20 May 2019 10:57:57 -0700 jjg 8223663: Update links for tool guides
Mon, 20 May 2019 10:32:10 -0700 jiangli Merge
Wed, 15 May 2019 16:21:51 -0700 aeubanks 8224014: Don't run test/jdk/java/net/NetworkInterface/IPv4Only.java in IPv6 only environment
Wed, 15 May 2019 17:21:18 -0700 aeubanks 8224019: test/jdk/java/nio/channels/DatagramChannel/BasicMulticastTests.java assumes IPv4 is always available
Mon, 20 May 2019 10:16:45 -0700 darcy 8224174: java.lang.Number has a default constructor
Wed, 15 May 2019 09:15:59 -0700 aeubanks 8223214: Inet6AddressImpl.loopbackAddress() should choose loopback address that is available
Mon, 20 May 2019 12:24:05 -0400 lancea 8222807: Address iteration with invalid ZIP header entries
Mon, 20 May 2019 17:44:29 +0200 lucy 8223444: Improve CodeHeap Free Space Management
Mon, 20 May 2019 10:06:07 -0400 coleenp 8221967: InternTest.java timed out
Mon, 20 May 2019 09:43:46 -0400 zgu 8224179: Shenandoah: CTW test failures with traversal GC
Mon, 20 May 2019 09:42:37 -0400 zgu 8224210: Shenandoah: Refactor ShenandoahRootScanner to support scanning CSet codecache roots
Thu, 16 May 2019 12:14:37 +0530 dkejriwal 8206879: Currency decimal marker incorrect for Peru
Mon, 20 May 2019 12:37:40 +0100 dfuchs 8223856: Replace wildcard address with loopback or local host in tests - part 8
Tue, 14 May 2019 10:21:55 +0200 mbaesken 8130017: use _FORTIFY_SOURCE in gcc fastdebug builds
Mon, 20 May 2019 14:42:32 +0530 pmuthuswamy 8219313: Support module specific stylesheets
Sun, 19 May 2019 22:14:09 +0800 ljiang 8219781: Localized names for Japanese era Reiwa in COMPAT provider
Sat, 18 May 2019 22:11:25 +0200 tschatzl 8222492: G1 unnecessarily scans remembered set cards for regions that already have been evacuated
Sat, 18 May 2019 12:13:38 -0700 jiefu 8222302: [TESTBUG]test/hotspot/jtreg/compiler/intrinsics/sha/cli/TestUseSHAOptionOnUnsupportedCPU.java fails on any other CPU
Sat, 18 May 2019 18:49:39 +0200 shade 8224170: Build failures after JDK-8207812 (Implement Dynamic CDS Archive)
Sat, 18 May 2019 15:42:21 +0900 ysuenaga 8163805: hotspot/test/serviceability/sa/sadebugd/SADebugDTest.java failed with timed out
Fri, 17 May 2019 12:52:46 -0700 rfield 8223595: Consider updating jdk.jshell module description
Fri, 17 May 2019 13:16:07 -0400 vromero 8223803: j.l.c.MethodTypeDesc::insertParameterTypes? doesn't control type of parameters
Fri, 17 May 2019 11:47:06 -0400 zgu 8223951: Shenandoah: Only need to update thread roots during final update refs
Fri, 17 May 2019 08:29:55 -0700 ccheung 8207812: Implement Dynamic CDS Archive
Fri, 17 May 2019 10:48:02 -0400 rriggs 8220166: Performance regression in deserialization (4-6% in SPECjbb)
Thu, 16 May 2019 21:25:53 +0800 aoqi 8224028: loop initial declarations introduced by JDK-8184770
Fri, 17 May 2019 09:52:35 -0400 zgu 8223774: Shenandoah: Refactor ShenandoahRootProcessor and family
Fri, 17 May 2019 12:33:37 +0200 tschatzl 8224038: Fix remaining InCSetState mentions
Fri, 17 May 2019 12:06:03 +0200 pliden 8223961: ZGC: Unexpected behaviour due to ZMetronome::wait_for_tick() oversleeping
Fri, 17 May 2019 11:44:44 +0200 bulasevich 8223472: volatile long field corruption on x86_32
Fri, 17 May 2019 09:00:39 +0100 clanger 8222276: (zipfs) Refactoring and cleanups to prepare for JDK-8213031
Fri, 17 May 2019 03:01:21 -0400 bulasevich 8220656: ARM32: -XX:MaxVectorSize=16 makes SIGILL
Thu, 16 May 2019 13:21:41 +0200 mbaesken 8223944: fix zlib related building docu and comments
Fri, 17 May 2019 14:14:15 +0900 ysuenaga 8223665: SA: debugd options should follow jhsdb style
Thu, 16 May 2019 20:14:54 -0400 kbarrett 8160539: Stack frame scanning acquires DerivedPointerTableGC_lock mutex
Thu, 16 May 2019 18:45:30 -0400 bulasevich 8222825: ARM32 SIGILL issue on single core CPU (not supported PLDW instruction)
Fri, 17 May 2019 00:21:10 +0200 jwilhelm 8223346: Update Graal
Thu, 16 May 2019 12:16:47 -0700 iignatyev 8222154: upgrade gtest to 1.8.1
Thu, 16 May 2019 12:33:44 -0700 epavlova 8224017: [Graal] gc/z/TestUncommit.java fails with Graal
Thu, 16 May 2019 12:48:21 -0700 jcbeyler 8224020: AsyncGetCallTrace test should not run on PPC64 or IA64
Thu, 16 May 2019 21:32:24 +0200 shade 8224033: os::snprintf should be used in virtualizationSupport.cpp
Thu, 16 May 2019 12:36:08 -0700 rhalade 8223499: Remove two DocuSign root certificates that are expiring
Thu, 16 May 2019 11:30:32 -0700 epavlova 8223910: TestFloatJNIArgs and TestTrichotomyExpressions time out with Graal as JIT
Thu, 16 May 2019 11:37:26 -0700 dtitov 8222422: vmTestbase/nsk/jdi/ClassLoaderReference/definedClasses tests failed with Unexpected Exception: null
Thu, 16 May 2019 13:34:33 -0400 vromero 8223726: j.l.c.MethodTypeDesc spec should contain precise assertions for one parameter's methods
Thu, 16 May 2019 19:07:31 +0200 rkennke 8224043: Shenandoah: Remove clear_claimed_marks() from start of concurrent_traversal()
Thu, 16 May 2019 15:45:46 +0100 adinn 8224042: Add private alignDown method to MappedByteBuffer
Wed, 15 May 2019 17:13:57 -0700 aeubanks 8224018: test/jdk/java/net/ipv6tests/{Tcp,Udp}Test.java assume IPv4 is available
Thu, 16 May 2019 17:06:53 +0100 alanb 8223442: java/nio/channels/SocketChannel/AdaptorStreams.java testConcurrentTimedReadWrite3(): failure
Thu, 16 May 2019 11:07:09 -0400 coleenp 8223585: vmTestbase/runtime/pcl/* get SEGV in MetadataOnStackClosure::do_metadata(Metadata*)+0x0
Thu, 16 May 2019 16:42:14 +0200 jlahoda 8224031: Cannot parse switch expressions after type cast
Thu, 16 May 2019 09:21:49 +0200 mbaesken 8223438: add VirtualizationInformation JFR event
Wed, 15 May 2019 12:30:02 +0200 rrich 8223572: ~ThreadInVMForHandshake() should call handle_special_runtime_exit_condition()
Thu, 16 May 2019 13:57:35 +0200 stuefe 8224023: Redo the fix for ErrorFile option does not handle pre-existing error files of the same name
Thu, 16 May 2019 07:09:17 -0400 coleenp 8223956: Make SymbolTable and StringTable AllStatic
Thu, 16 May 2019 16:40:48 +0530 pmuthuswamy 8222548: Upgrading JDK 13 with the latest available jQuery 3.4.1
Thu, 16 May 2019 10:52:36 +0200 jlahoda 8222169: java.lang.AssertionError switch expression in ternary operator - ?
Mon, 13 May 2019 07:41:32 -0700 rschmelter 8223770: code_size2 still too small in some compressed oops configurations
Wed, 15 May 2019 20:33:17 -0400 coleenp 8224010: Incorrect string interning
Thu, 16 May 2019 02:34:53 +0200 jwilhelm Added tag jdk-13+21 for changeset f2f11d7f7f4e
Wed, 15 May 2019 22:45:54 +0200 shade 8223980: Shenandoah: Refactor and fix ObjArrayChunkedTask verificationjdk-13+21
Tue, 07 May 2019 16:18:21 -0700 aeubanks 8223532: Don't try creating IPv4 sockets in NetworkInterface.c if IPv4 is not supported
Wed, 15 May 2019 13:22:29 -0700 rhalade 8222136: Remove two Comodo root CA certificates that are expiring
Wed, 15 May 2019 19:47:28 +0100 aefimov 8223798: Replace wildcard address with loopback or local host in tests - part 7
Wed, 15 May 2019 19:34:34 +0100 dfuchs 8223880: Update sun/net/ftp/FtpURL.java and sun/net/ftp/FtpURLConnectionLeak.java to work with IPv6 addresses
Wed, 15 May 2019 19:09:54 +0100 dfuchs 8223716: sun/net/www/http/HttpClient/MultiThreadTest.java should be more resilient to unexpected traffic
Wed, 15 May 2019 11:06:33 -0700 amenkov 8184770: JDWP support for IPv6
Fri, 10 May 2019 17:13:02 -0700 aeubanks 8223737: Fix HostsFileNameService for IPv6 literal addresses
Wed, 15 May 2019 08:58:23 -0400 zgu 8223215: Shenandoah: Support verifying subset of roots
Wed, 15 May 2019 14:30:22 +0200 thartmann 8223885: hs_err and replay file may contain garbage when overwriting existing file
Wed, 15 May 2019 11:53:47 +0200 shade 8223911: Disable bad node budget verification until the fix
Wed, 15 May 2019 13:54:43 +0530 psadhukhan Merge
Tue, 14 May 2019 11:23:08 +0530 psadhukhan Merge
Fri, 10 May 2019 16:22:35 -0700 prr 8212700: Change the mechanism by which JDK loads the platform-specific AWT Toolkit
Thu, 09 May 2019 16:09:39 -0700 prr 8222362: Upgrade to Freetype 2.10.0
Wed, 08 May 2019 22:59:20 -0700 itakiguchi 8211826: StringIndexOutOfBoundsException happens via GetStringUTFRegion()
Wed, 08 May 2019 16:19:22 -0700 serb 8144125: [macOS] java/awt/event/ComponentEvent/MovedResizedTwiceTest/MovedResizedTwiceTest.java failed automatically
Wed, 08 May 2019 14:34:21 -0700 serb 7141393: [macosx] CARemoteLayer code refactoring and unit test
Wed, 08 May 2019 11:59:18 +0530 jdv Merge
Tue, 07 May 2019 18:18:54 -0700 serb 8223237: Replace use of string.equals("") with isEmpty() in java.desktop
Tue, 07 May 2019 11:52:28 -0700 prr Merge
Fri, 03 May 2019 17:06:42 -0700 prr 8222819: Remove setting of headless property on MacOS from launcher code.
Thu, 02 May 2019 10:48:56 -0700 prr Merge
Tue, 30 Apr 2019 14:30:17 -0700 itakiguchi 8213232: Unix/X11 setCompositionEnableNative issue
Tue, 30 Apr 2019 04:15:31 -0700 vagarwal 8222519: ButtonDemoScreenshotTest fails randomly with "still state to be reached"
Mon, 29 Apr 2019 10:16:58 -0700 prr 8130266: Change the mechanism by which JDK loads the platform-specific GraphicsEnvironment class
Sun, 28 Apr 2019 12:34:49 +0530 psadhukhan 8222830: PIT: java/awt/Window/AlwaysOnTop/AutoTestOnTop.java listed twice in ProblemList
Fri, 26 Apr 2019 12:31:37 -0700 prr 8208179: Devanagari not shown with logical fonts on Windows after removal of Lucida Sans from JDK
Thu, 25 Apr 2019 15:18:59 -0700 serb 8222799: java.beans.Introspector uses an obsolete methods cache
Thu, 25 Apr 2019 15:15:53 -0700 serb 8214046: [macosx] Undecorated Frame does not Iconify when set to
Thu, 25 Apr 2019 15:13:36 -0700 serb 8222438: Drop of outdated logging in the com.sun.media.sound package
Thu, 25 Apr 2019 15:19:09 +0530 kaddepalli 8219914: Change the environment variable for Java Access Bridge logging to have a directory.
Wed, 24 Apr 2019 09:21:02 -0700 prr 8212701: remove sun.desktop property from launcher code
Tue, 23 Apr 2019 14:22:34 +0530 psadhukhan Merge
Mon, 22 Apr 2019 12:40:55 -0700 serb 8222789: Replace the usage of "Sun's Xinerama API" by the "XFree86's Xinerama API" on Solaris
Mon, 22 Apr 2019 12:35:30 -0700 serb 8216008: -Djavax.accessibility.assistive_technologies empty list leads to exception
Mon, 22 Apr 2019 18:54:19 -0700 itakiguchi 8212676: AWT SystemColor setting on CDE
Mon, 22 Apr 2019 17:02:51 +0530 kaddepalli 8218917: KeyEvent.getModifiers() returns inconsistent values for ALT keys
Fri, 10 May 2019 10:18:16 +0200 mbaesken 8222720: Provide extended VMWare/vSphere virtualization related info in the hs_error file on linux/windows x86_64
Tue, 14 May 2019 20:29:40 -0400 dholmes 8223810: HotSpot compile warnings from VS2017
Tue, 14 May 2019 15:09:31 -0700 skuksenko 8223921: Update SocketReadWrite benchmark
Tue, 14 May 2019 22:31:52 +0200 jwilhelm 8223917: Problemlist compiler/ciReplay/TestServerVM.java
Tue, 14 May 2019 21:36:09 +0300 dsamersoff 8223767: Shenandoah fails to build on Solaris x86_64
Tue, 14 May 2019 11:29:18 -0400 coleenp 8223657: Remove unused THREAD argument from SymbolTable functions
Tue, 14 May 2019 11:28:44 -0400 vromero 8215470: Bad EnclosingMethod attribute on classes declared in lambdas
Sun, 07 Apr 2019 09:13:17 +0200 stuefe 8221738: ErrorFile option does not handle pre-existing error files of the same name
Tue, 14 May 2019 15:36:26 +0200 tschatzl 8223018: Rename G1RemSet::*oops_into_collection_set_do methods
Tue, 14 May 2019 15:36:26 +0200 tschatzl 8200545: Improve filter for enqueued deferred cards
Tue, 14 May 2019 08:52:51 -0400 coleenp 8219459: oopDesc::is_valid() is broken
Tue, 14 May 2019 13:34:49 +0100 aefimov 8223638: Replace wildcard address with loopback or local host in tests - part 6
Tue, 14 May 2019 10:54:23 +0200 stefank 8223822: Add gc IDs in the log of gc verification
Tue, 14 May 2019 12:07:24 +0200 eosterlund 8222841: Incorrect static call stub interactions with class unloading
Tue, 14 May 2019 12:00:49 +0200 redestad 8221478: Disable VerifySharedSpaces by default
Tue, 14 May 2019 11:06:23 +0800 yzhou 8222969: Migrate RuleBasedCollatorTest to JDK Repo
Tue, 14 May 2019 02:07:13 -0700 sspitsyn 8219023: Investigate syncing JVMTI spec version with JDK version
Tue, 14 May 2019 09:25:58 +0100 clanger 8223597: jdk/nio/zipfs/ZipFSTester.java RuntimeException: CHECK_FAILED! (getAttribute.crc <entries20> failed 6af4413c vs 0 ...)
Tue, 14 May 2019 09:55:02 +0200 pliden 8222480: Implementation: JEP 351: ZGC: Uncommit Unused Memory
Tue, 14 May 2019 09:12:06 +0200 shade 8223762: Shenandoah: overflows in calculations involving heap capacity
Tue, 14 May 2019 09:12:00 +0200 shade 8223759: Shenandoah should allow arbitrarily low initial heap size
Tue, 14 May 2019 09:14:36 +0200 mbaesken 8223685: used bundled zlib on AIX by default
Fri, 10 May 2019 09:58:01 +0200 mbaesken 8223574: add more thread-related system settings info to hs_error file on AIX
Mon, 13 May 2019 20:45:03 -0700 jcbeyler 8223779: Build failure after 8223040 (Add a AsyncGetCallTrace test)
Mon, 13 May 2019 18:18:42 -0700 igerasim 8223730: URLClassLoader.findClass() can throw IndexOutOfBoundsException
Tue, 14 May 2019 08:47:13 +0800 weijun 8223063: Support CNG RSA keys
Mon, 13 May 2019 13:32:38 -0700 epavlova 8223235: [Graal] compiler/jsr292/NonInlinedCall/InvokeTest.java failed time out
Sat, 11 May 2019 13:10:24 +0200 stefank 8223637: Fix build breakage after 8223136
Thu, 14 Mar 2019 14:04:39 +0100 sgehwolf 8214796: Create a jlink plugin for stripping debug info symbols from native libraries
Thu, 25 Apr 2019 17:27:37 +0100 adinn 8221696: MappedByteBuffer.force method to specify range
Mon, 13 May 2019 17:31:23 +0100 dfuchs 8223632: Replace wildcard address with loopback or local host in tests - part 5
Mon, 13 May 2019 16:43:47 +0200 hannesw 8219060: -linksource broken with modules
Fri, 05 Apr 2019 11:52:32 +0200 stuefe 8222015: Small VM.metaspace improvements
Fri, 10 May 2019 17:47:42 -0700 aeubanks 8223667: ASAN build broken
Wed, 08 May 2019 15:36:10 -0700 jcbeyler 8223040: Add a AsyncGetCallTrace test
Fri, 10 May 2019 13:37:00 -0700 jjg 8223654: Clean up @jls references in com.sun.source
Fri, 10 May 2019 12:33:40 -0700 xuelei 8221253: TLSv1.3 may generate TLSInnerPlainText longer than 2^14+1 bytes
Fri, 10 May 2019 20:56:37 +0200 cito 8221569: JFR tool produces incorrect output when both --categories and --events are specified
Fri, 10 May 2019 11:18:45 -0400 bobv 8222533: jtreg test jdk/internal/platform/cgroup/TestCgroupMetrics.java fails on SLES12.3 linux ppc64le machine
Fri, 10 May 2019 11:15:34 -0400 bobv 8221340: [TESTBUG] TestCgroupMetrics.java fails after fix for JDK-8219562
Fri, 10 May 2019 10:30:06 -0700 dnsimon 8223531: [Graal] assert(type() == T_INT) failed: type check
Thu, 09 May 2019 10:28:29 -0700 aeubanks 8223652: Rename IPSupport.skipIfCurrentConfigurationIsInvalid() to IPSupport.throwSkippedExceptionIfNonOperational()
Sat, 11 May 2019 01:17:18 +0900 ysuenaga 8223186: HotSpot compile warnings from GCC 9
Fri, 10 May 2019 15:34:17 +0100 aefimov 8223465: Replace wildcard address with loopback or local host in tests - part 3
Fri, 10 May 2019 09:07:53 -0400 coleenp Merge
Fri, 10 May 2019 09:05:29 -0400 coleenp 8223626: move print() functions to cpp files
Fri, 10 May 2019 09:56:20 +0200 shade 8223675: arm32 build failure after 8223136 (Move compressed oops functions to CompressedOops class)
Fri, 10 May 2019 09:55:42 +0200 shade 8223676: Minimal VM build failure after 8223136 (Move compressed oops functions to CompressedOops class)
Thu, 09 May 2019 05:04:42 -0700 rschmelter 8223617: code_size2 needs adjustments
Fri, 10 May 2019 06:31:09 +0100 clanger 8223555: Cleanups in cacerts tests
Fri, 10 May 2019 09:39:49 +0800 weijun 8200400: Restrict Sasl mechanisms
Thu, 09 May 2019 18:38:42 -0700 xliu 8223537: testlibrary_tests/ctw/ClassesListTest.java fails with Agent timeout frequently
Thu, 09 May 2019 18:42:07 -0400 dholmes 8222292: runtime/exceptionMsgs/ArrayIndexOutOfBoundsException/ArrayIndexOutOfBoundsExceptionTest.java timeout but test passed
Thu, 09 May 2019 16:34:20 -0500 gziemski 8223639: [JVMCI] jvmciCompiler.cpp needs to include "oops/objArrayOop.inline.hpp""
Fri, 10 May 2019 01:41:45 +0800 aoqi 8223651: Build fails with --with-jvm-features=-jfr and --disable-precompiled-headers
Fri, 10 May 2019 01:37:09 +0800 aoqi 8223599: minimal build fails after JDK-8185525
Thu, 09 May 2019 13:49:08 -0400 mullan 8191808: Configurable read timeout for CRLs
Thu, 09 May 2019 12:04:20 -0500 gziemski 8189208: Cleanup ancient argument processing code
Thu, 09 May 2019 12:56:15 -0400 aph Merge
Thu, 09 May 2019 12:52:05 -0400 aph 8223645: AArch64 build broken by fix for 8223136
Thu, 09 May 2019 09:23:31 -0700 joehw 8222991: Xerces 2.12.0: Validation
Thu, 09 May 2019 17:28:27 +0200 redestad 8223454: Reduce String concatenation shapes by folding initialLengthCoder into last mixer
Fri, 03 May 2019 14:38:58 +0200 mbaesken 8223307: enable the Stack Execution Disable flag for JDK binaries on AIX
Thu, 09 May 2019 07:33:28 -0700 erikj 8223627: jdk-13+20 bundle name contains null instead of ea
Thu, 09 May 2019 10:04:33 -0400 vromero 8222251: preflow visitor is not visiting lambda expressions
Thu, 09 May 2019 14:23:52 +0100 dfuchs 8223573: Replace wildcard address with loopback or local host in tests - part 4
Thu, 09 May 2019 14:28:30 +0200 stefank 8223624: Cleanup includes of universe.hpp
Thu, 09 May 2019 14:26:52 +0200 stefank 8223623: Move oopFactory function definitions out of oopFactory.hpp
Thu, 09 May 2019 14:26:03 +0200 stefank 8223622: Move Universe usage out of memAllocator.hpp
Thu, 09 May 2019 14:26:03 +0200 stefank 8223621: Move Universe usage out of oopRecorder.hpp
Thu, 09 May 2019 14:26:03 +0200 stefank 8223620: Move IsGCActiveMark implementation out of header
Thu, 09 May 2019 14:26:03 +0200 stefank 8223619: Move VerifyOption out of Universe
Thu, 09 May 2019 14:26:03 +0200 stefank 8223136: Move compressed oops functions to CompressedOops class
Thu, 09 May 2019 07:21:32 -0400 gadams 8042215: javax/management/remote/mandatory/connection/ReconnectTest.java NoSuchObjectException no such object in table
Thu, 09 May 2019 11:58:26 +0200 jlahoda 8221759: Crash when completing \"java.io.File.path\"
Wed, 08 May 2019 09:50:23 +0000 pli 8223427: [TESTBUG] Disable JTReg Shenandoah tests when Graal is enabled
Wed, 08 May 2019 20:28:56 -0700 jcbeyler 8223441: HeapMonitorStatArrayCorrectnessTest fails due to sampling determinism
Thu, 09 May 2019 03:11:56 +0200 jwilhelm Added tag jdk-13+20 for changeset 6ccc7cd7931e
Thu, 09 May 2019 08:49:31 +0800 weijun 8222987: sun/security/tools/keytool/PSS.java times out on Solaris-SPARC
Wed, 08 May 2019 16:47:53 -0700 kvn 8223380: [Graal] compiler/c2/Test8062950.java failed with time out.
Wed, 08 May 2019 16:42:52 -0700 kvn 8223539: compiler/graalunit/HotspotTest.java hotspot.test.CheckGraalIntrinsics AssertionError: found plugins for intrinsics
Wed, 08 May 2019 23:53:24 +0200 shade 8223589: Build failures after JDK-8223534 (add back fixed test_markOop.cpp)
Tue, 16 Apr 2019 13:06:23 -0700 aeubanks 8220673: Add test library support for determining platform IP support
Wed, 08 May 2019 12:45:02 -0700 naoto 8221432: Upgrade CLDR to Version 35.1
Wed, 08 May 2019 21:32:38 +0200 shade 8223583: Build failure after JDK-8223567 (Rename ShenandoahBrooksPointer to ShenandoahForwarding)
Wed, 08 May 2019 11:56:19 -0700 epavlova 8223414: ProblemList java/lang/ref/ReachabilityFenceTest.java when running in Graal as JIT modejdk-13+20
Wed, 08 May 2019 20:45:30 +0200 rkennke 8223567: Rename ShenandoahBrooksPointer to ShenandoahForwarding
Wed, 08 May 2019 13:22:27 -0400 coleenp 8223534: add back fixed test_markOop.cpp
Wed, 08 May 2019 11:11:50 -0500 gziemski 8185525: Add JFR event for DictionarySizes
Wed, 08 May 2019 20:57:12 +0800 aoqi 8222926: Shenandoah build fails with --with-jvm-features=-compiler1
Wed, 08 May 2019 10:10:54 -0400 vromero 8222949: add condy support to javac's pool API
Wed, 08 May 2019 10:08:11 -0400 hseigel 8217846: [Graal] vmTestbase/nsk/jdi/VirtualMachine/instanceCounts/instancecounts003/instancecounts003.java crash
Wed, 08 May 2019 09:38:58 -0400 tonyp 8223397: gc+promotion log lines are missing the GC id
Wed, 08 May 2019 18:05:28 +0530 rraghavan 8223445: compiler/intrinsics/mathexact/LongMulOverflowTest.java java timeout
Wed, 08 May 2019 14:27:14 +0200 shade 8223570: Shenandoah needs to acquire lock before CLDG::clear_claimed_marks
Wed, 08 May 2019 07:56:49 -0400 gadams 8223416: Exclude javax/management/monitor/DerivedGaugeMonitorTest.java until JDK-8042211 is fixed.
Wed, 08 May 2019 06:40:45 -0400 coleenp 8223391: Unsynchronized iteration of ClassLoaderDataGraph
Wed, 08 May 2019 11:59:14 +0200 rkennke 8223244: Fix usage of ARRAYCOPY_DISJOINT decorator
Wed, 08 May 2019 08:15:04 +0100 alanb 8223353: (ch) Change channel close implementation to not wait for I/O threads
Tue, 07 May 2019 18:24:36 -0400 coleenp 8223481: gtest/GTestWrapper.java failed due to "assert(ret == 0) failed: sem_post failed; error='Invalid argument' (errno=EINVAL)"
Tue, 07 May 2019 17:33:19 -0400 dholmes 8223437: Backout JDK-8219974 Restore static callsite resolution for the current class
Tue, 07 May 2019 14:05:09 -0700 erikj 8223464: Improve version string for Oracle CI builds
Tue, 07 May 2019 13:33:27 -0700 sviswanathan 8222074: Enhance auto vectorization for x86
Tue, 07 May 2019 21:53:46 +0200 shade 8223447: Stabilize gc/shenandoah/TestStringDedupStress test
Tue, 07 May 2019 21:53:38 +0200 shade 8223446: Shenandoah breaks alignment with some HumongousThreshold values
Tue, 07 May 2019 12:32:19 -0700 erikj 8223319: Add copyright footer to specs and man pages
Tue, 07 May 2019 18:10:59 +0100 dfuchs 8223463: Replace wildcard address with loopback or local host in tests - part 2
Tue, 07 May 2019 09:37:02 -0700 naoto 8220037: Inconsistencies of generated timezone files between Windows and Linux
Tue, 07 May 2019 07:43:41 -0700 jcbeyler 8223044: Add back exception checking in tests
Tue, 07 May 2019 15:39:33 +0100 michaelm 8223457: java.net.ServerSocket protected constructor should throw NPE if impl null
Tue, 07 May 2019 16:06:10 +0200 shade 8223449: Unprotected UseCompressedOops block in gc/shenandoah/shenandoahBarrierSetC1_x86.cpp
Tue, 07 May 2019 16:05:49 +0200 shade 8223450: Disable Shenandoah C2 barriers verification for x86_32
Tue, 07 May 2019 16:04:36 +0200 shade 8223448: Shenandoah disabled barriers blocks omit LRB
Tue, 07 May 2019 06:58:55 -0700 erikj 8223335: Compare baseline builds on linux are failing
Thu, 02 May 2019 20:47:23 +0200 roland 8222738: Shenandoah: assert(is_Proj()) failed when running cometd benchmarks
Mon, 06 May 2019 13:51:02 +0200 roland 8223389: Shenandoah optimizations fail with assert(!phase->exceeding_node_budget())
Tue, 07 May 2019 09:17:03 +0200 xliu 8222670: pathological case of JIT recompilation and code cache bloat
Tue, 07 May 2019 07:44:15 +0200 pliden 8223308: ZGC: Remove ZGranuleMap::size()
Mon, 06 May 2019 21:31:36 -0700 vlivanov 8223422: [Graal] assert(!m->can_be_statically_bound(InstanceKlass::cast(ctxk))) failed: redundant
Thu, 25 Apr 2019 13:35:34 -0700 dlong 8218700: infinite loop in HotSpotJVMCIMetaAccessContext.fromClass after OutOfMemoryError
Mon, 06 May 2019 20:05:19 -0700 kvn 8223332: Update JVMCI
Tue, 07 May 2019 10:21:04 +0800 weijun 8219013: Update Apache Santuario (XML Signature) to version 2.1.3
Tue, 07 May 2019 00:58:10 +0000 pli 8223054: [TESTBUG] Put graalJarsCP before existing classpath in GraalUnitTestLauncher
Mon, 06 May 2019 21:23:23 -0400 dholmes 8222534: VerifyBeforeExit is not honored when System.exit is called
Mon, 06 May 2019 18:07:55 -0700 igerasim 8222955: Optimize String.replace(CharSequence, CharSequence) for common cases
Mon, 06 May 2019 18:01:01 -0400 coleenp 8223412: tier1 build failure after 8222893
Mon, 06 May 2019 14:19:48 -0700 sangheki 8221509: Refactor assert( G1CollectedHeap::used() == recalculate_used() ) with better message
Mon, 06 May 2019 15:25:57 -0400 coleenp 8222893: markOopDesc::print_on() is a bit confused
Mon, 06 May 2019 21:50:20 +0200 jwilhelm 8222665: Update Graal
Mon, 06 May 2019 12:17:54 -0700 jiefu 8221542: ~15% performance degradation due to less optimized inline decision
Mon, 06 May 2019 12:15:55 -0700 vlivanov 8219902: C2: MemNode::can_see_stored_value() ignores casts which carry control dependency
Mon, 06 May 2019 12:15:49 -0700 vlivanov 8223171: Redundant nmethod dependencies for effectively final methods
Mon, 06 May 2019 14:47:55 -0400 vromero 8219483: j.l.c.ClassDesc::nested(String, String...) doesn't throw NPE if any arg is null
Mon, 06 May 2019 09:58:14 -0700 dtitov 8222667: vmTestbase/nsk/jdi/ThreadStartRequest/addThreadFilter/addthreadfilter002/TestDescription.java failed with "event IS NOT a breakpoint"
Mon, 06 May 2019 08:54:19 -0700 xuelei 8219991: New fix of the deadlock in sun.security.ssl.SSLSocketImpl
Mon, 06 May 2019 09:53:11 -0400 gromero 8223395: PPC64: Improve comments in the JVM signal handler to match ISA text
Thu, 02 May 2019 15:46:34 -0700 manc 8223267: Fix incorrect usage of GCTraceTime in g1FullCollector and g1CollectedHeap
Sun, 05 May 2019 09:10:21 -0400 kbarrett 8223359: JDK-8221359 breaks TestG1ParallelPhases.java
Fri, 03 May 2019 23:00:07 -0700 igerasim 8223174: Pattern.compile() can throw confusing NegativeArraySizeException
Fri, 03 May 2019 23:35:12 -0400 kbarrett 8221359: Eliminate SATBMarkQueueSet::filter_thread_buffers
Fri, 03 May 2019 14:09:19 -0700 darcy 8223178: Improve FileSystems.newFileSystem example with map factory methods
Fri, 03 May 2019 09:34:02 -0700 erikj 8223309: test failing due to self-assign-overloaded
Fri, 03 May 2019 12:33:08 -0400 pchilanomate 8220724: TestBiasedLockRevocationEvents fails while matching revoke events to VMOperation events
Fri, 03 May 2019 09:25:59 -0700 darcy 8223265: Clarify operational semantics of java.util.Objects.equals()
Fri, 03 May 2019 09:07:30 -0700 kvn 8223262: [AOT] jaotc crashes with assert(!(((ThreadShadow*)__the_thread__)->has_pending_exception())) failed: Should not allocate with exception pending
Fri, 03 May 2019 16:31:11 +0200 mdoerr 8223248: [AIX] Remove old xlC 10 workaround for load acquire
Fri, 03 May 2019 07:54:09 -0400 hseigel 8222500: runtime/8176717/TestInheritFD.java failed with java.nio.file.NoSuchFileException: /tmp/communication7071713601211876892.txt
Wed, 17 Apr 2019 14:57:53 +0200 phedlin 8216137: assert failed: Live node limit exceeded.
Wed, 17 Apr 2019 14:56:45 +0200 phedlin 8223143: Restructure/clean-up for 'loopexit_or_null()'.
Wed, 17 Apr 2019 14:55:37 +0200 phedlin 8223142: Clean-up WS and CB.
Wed, 17 Apr 2019 14:55:29 +0200 phedlin 8223141: Change (count) suffix _ct into _cnt.
Wed, 17 Apr 2019 14:55:11 +0200 phedlin 8223140: Clean-up in 'ok_to_convert()'.
Wed, 17 Apr 2019 14:55:01 +0200 phedlin 8223139: Rename mandatory policy-do routines.
Thu, 02 May 2019 11:05:47 +0200 phedlin 8223138: Small clean-up in loop-tree support.
Wed, 17 Apr 2019 14:52:25 +0200 phedlin 8223137: Rename predicate 'do_unroll_only()' to 'is_unroll_only()'.
Fri, 03 May 2019 15:57:41 +0800 jjiang 8204203: Many pkcs11 tests failed in Provider initialization, after compiler on Windows changed
Thu, 02 May 2019 22:52:51 +0100 coffeys 8217364: Custom URLStreamHandler for jrt or file protocol can override default handler
Thu, 02 May 2019 14:21:06 -0700 joehw 8223052: Cleanup: NodeSortRecord
Thu, 02 May 2019 14:15:09 -0700 bpb 8223254: DataOutputStream/WriteUTF.java fails due to "OutOfMemoryError: Java heap space"
Thu, 02 May 2019 17:08:03 -0400 lancea 8218875: Add new FileSystems.newFileSystem methods
Thu, 02 May 2019 13:25:00 -0700 bpb 8220793: (fs) No support for changing modification time of symlink
Thu, 02 May 2019 15:20:06 -0400 zgu 8223258: Shenandoah: SRP::process_all_roots_slow processes JvmtiExport weak oops twice
Wed, 01 May 2019 20:25:31 -0700 manc 8223227: Rename acquire_tag_map() to tag_map_acquire() in jvmtiEnvBase
Thu, 02 May 2019 17:29:10 +0100 michaelm 8216978: Drop support for pre JDK 1.4 SocketImpl implementations
Mon, 29 Apr 2019 17:54:15 -0700 cushon 8219202: Use Unsynchronized StringBuilder in sun.net.www.ParseUtil
Thu, 02 May 2019 09:49:52 -0400 zgu 8222992: Shenandoah: Pre-evacuate all roots
Thu, 02 May 2019 06:33:28 -0700 dl 8219138: Miscellaneous changes imported from jsr166 CVS 2019-05
Thu, 02 May 2019 06:33:28 -0700 dl 8220248: fix headings in java.util.concurrent
Thu, 02 May 2019 06:33:28 -0700 dl 8221892: ThreadPoolExecutor: Thread.isAlive() is not equivalent to not being startable
Thu, 02 May 2019 06:33:28 -0700 dl 8221120: CopyOnWriteArrayList.set should always have volatile write semantics
Thu, 02 May 2019 06:33:28 -0700 dl 8222930: ConcurrentSkipListMap.clone() shares size variable between original and clone
Thu, 02 May 2019 11:55:16 +0100 dfuchs 8223145: Replace wildcard address with loopback or local host in tests - part 1
Thu, 02 May 2019 10:32:28 +0200 stefank 8223064: Minor cleanups in ResolvedMethodTable
Thu, 02 May 2019 10:32:14 +0200 stefank 8222986: Add parameter to skip clearing CHeapBitMaps when resizing
Mon, 15 Apr 2019 11:47:46 +0200 stefank 8198505: Remove CollectorPolicy and its subclasses
Thu, 02 May 2019 10:38:00 +0200 redestad 8222895: StackOverflowError in custom security manager that relies on ClassSpecializer
Wed, 01 May 2019 20:48:19 -0400 coleenp 8223194: runtime/Shutdown/ShutdownTest.java due to "OutOfMemoryError: Java heap too small"
Thu, 02 May 2019 03:20:32 +0200 jwilhelm Added tag jdk-13+19 for changeset a43d6467317d
Tue, 30 Apr 2019 18:44:41 -0700 manc 8223177: Data race on JvmtiEnvBase::_tag_map in double-checked locking
Wed, 01 May 2019 16:47:26 -0700 darcy 8146726: Improve AbstractProcessor to issue warnings for repeated information
Wed, 01 May 2019 14:35:28 -0700 joehw 8220818: Validator does not find missing match for keyref errorjdk-13+19
Wed, 01 May 2019 13:25:54 -0700 mseledtsov 8222769: [TESTBUG] TestJFRNetworkEvents should not rely on hostname command
Wed, 01 May 2019 13:07:30 -0700 bchristi 8221267: Document the jdk.net.URLClassPath.showIgnoredClassPathEntries system property
Wed, 01 May 2019 12:31:29 -0700 kvn 8220623: [JVMCI] Update JVMCI to support JVMCI based Compiler compiled into shared library
Wed, 01 May 2019 12:41:26 -0400 vromero 8222744: add support for generating method handles from a variable symbol
Wed, 01 May 2019 22:02:48 +0530 rraghavan 8202414: Unsafe write after primitive array creation may result in array length change
Wed, 01 May 2019 09:06:12 -0700 martin 8223078: Add microbenchmark for array copying/clearing/resizing
Wed, 01 May 2019 10:54:07 -0400 coleenp 8223190: Test gc/arguments/TestShrinkHeapInSteps.java breaks with change for JDK-8074355
Wed, 01 May 2019 10:12:51 -0400 zgu 8223184: Shenandoah: Missing roots in SRP::process_all_roots_slow
Wed, 01 May 2019 08:56:38 -0400 coleenp 8074355: make MutexLocker smarter about non-JavaThreads
Wed, 01 May 2019 07:12:14 -0400 coleenp 8213399: DecoderLocker is unused
Tue, 30 Apr 2019 20:26:16 -0700 jcbeyler 8223146: [TESTBUG] new test vmTestbase/nsk/share/ExceptionCheckingJniEnv/exceptionjni001/ fails on Windows
Tue, 30 Apr 2019 16:11:42 -0700 dtitov 8222821: com/sun/jdi/ExceptionEvents.java failed
Tue, 30 Apr 2019 15:39:42 -0700 jcbeyler 8215113: Sampling interval not always correct
Tue, 30 Apr 2019 12:53:32 -0700 rhalade 8222137: Remove T-Systems root CA certificate
Tue, 30 Apr 2019 11:04:26 -0700 rhalade 8216577: Add GlobalSign's R6 Root certificate
Tue, 30 Apr 2019 10:24:14 -0700 erikj 8222913: Add Jib support for VERSION_EXTRA*
Tue, 30 Apr 2019 08:45:19 -0700 dtitov 8222749: vmTestbase/nsk/jdi/ThreadStartRequest/addThreadFilter/addthreadfilter001/TestDescription.java failed with "eventSet1.size() != 3 :: 2"
Thu, 18 Apr 2019 13:58:31 +0200 sgehwolf 8221639: [i386] expand_exec_shield_cs_limit workaround is undefined code after JDK-8199717
Tue, 30 Apr 2019 14:49:19 +0200 thartmann 8219807: C2 crash in IfNode::up_one_dom(Node*, bool)
Tue, 30 Apr 2019 12:54:07 +0200 redestad 8222852: Reduce String concat combinator tree shapes by folding constants into prependers
Tue, 30 Apr 2019 01:56:28 -0700 sspitsyn 8222934: mark new VM option AllowRedefinitionToAddOrDeleteMethods as deprecated
Tue, 30 Apr 2019 10:39:22 +0200 jlahoda 8218152: [javac] fails and exits with no error if a bad annotation processor provided
Wed, 17 Apr 2019 01:21:56 -0700 rschmelter 8222529: sun.jdwp.listenerAddress agent property uses wrong encoding
Tue, 30 Apr 2019 11:58:30 +0530 pmuthuswamy 8221991: Improve the HTML for the inheritance tree for a type
Wed, 24 Apr 2019 09:10:45 -0700 dlong 8219403: JVMCIRuntime::adjust_comp_level should be replaced
Fri, 08 Mar 2019 18:21:52 -0800 manc 8220388: Increase -inlinehint-threshold for Clang to avoid G1 pause time regression
Mon, 29 Apr 2019 16:01:52 -0400 coleenp 8222988: Use MonitorLocker rather than MutexLocker when wait/notify used
Mon, 29 Apr 2019 14:34:10 -0400 mullan 8036608: Key.getAlgorithm link to standard algorithm names needs to be updated
Mon, 29 Apr 2019 07:39:16 -0700 bpb 8218280: LineNumberReader throws "Mark invalid" exception if CRLF straddles buffer.
Fri, 26 Apr 2019 16:38:39 +0800 fyang 8223020: aarch64: expand minI_rReg and maxI_rReg patterns into separate instructions
Mon, 29 Apr 2019 10:27:44 +0100 clanger 8223015: Cleanups for zipfs tests
Mon, 29 Apr 2019 09:04:25 +0200 thartmann 8221592: C2 compilation failed with assert(!q->is_MergeMem())
Sat, 27 Apr 2019 18:21:57 +0800 weijun 8223003: SunMSCAPI keys are not cleaned up
Fri, 26 Apr 2019 11:33:32 -0700 lmesnik 8220813: update hotspot tier1_gc tests depending on GC to use @requires vm.gc.X
Fri, 26 Apr 2019 12:49:51 -0400 vromero 8219487: j.l.c.ClassDesc spec should contain precise assertions for one parameter's methods
Fri, 26 Apr 2019 09:09:39 -0700 naoto 8222980: Upgrade IANA Language Subtag Registry to Version 2019-04-03
Fri, 26 Apr 2019 18:56:15 +0300 avoitylov 8221988: add possibility to build with Visual Studio 2019
Fri, 26 Apr 2019 16:25:43 +0100 dfuchs 8129315: java/net/Socket/LingerTest.java and java/net/Socket/ShutdownBoth.java timeout intermittently
Fri, 26 Apr 2019 12:35:26 +0200 jwilhelm 8223026: [BACKOUT] Typo in test/hotspot/jtreg/TEST.groups is causing test harness failures
Fri, 26 Apr 2019 12:05:34 +0200 pliden 8223016: ZGC: Fix misaligned statistics printout
Fri, 26 Apr 2019 10:18:47 +0200 rehn 8222637: Obsolete NeedsDeoptSuspend
Fri, 26 Apr 2019 08:53:29 +0100 clanger 8222440: (zipfs) JarFileSystem does not correctly handle versioned entries if no root entry is present
Fri, 26 Apr 2019 00:57:03 -0400 dholmes 8222518: Remove unnecessary caching of Parker object in java.lang.Thread
Thu, 25 Apr 2019 15:54:21 -0700 joehw 8222743: Xerces 2.12.0: DOM Implementation
Tue, 16 Apr 2019 13:16:49 -0700 aeubanks 8222562: Don't set IPV6_V6ONLY when IPv4 is not available
Thu, 25 Apr 2019 18:41:52 -0400 dholmes 8222970: Update ProblemList for vmTestbase/nsk/jdb/eval/eval001/eval001.java
Thu, 25 Apr 2019 11:45:52 -0700 mseledtsov 8222888: [TESTBUG] docker/TestJFREvents.java fails due to "RuntimeException: JAVA_MAIN_CLASS_ is not defined"
Thu, 25 Apr 2019 12:33:19 -0400 coleenp 8222977: Fix shenandoah broken with JDK-8222811
Thu, 25 Apr 2019 10:56:31 -0400 coleenp 8222811: Consolidate MutexLockerEx and MutexLocker
Thu, 25 Apr 2019 05:54:54 -0700 robm 8139965: Hang seen when using com.sun.jndi.ldap.search.replyQueueSize
Wed, 24 Apr 2019 14:03:20 +0200 rwestberg 8220795: Rework naked_short_nanosleep on Windows to improve time-to-safepoint
Thu, 25 Apr 2019 10:41:49 +0100 alanb 8222774: (ch) Replace uses of stateLock and blockingLock with j.u.c. locks
Thu, 25 Apr 2019 09:12:40 +0200 hannesw 8220497: Improve Javadoc search feature and add test coverage
Thu, 25 Apr 2019 08:55:50 +0200 pliden 8222469: ZGC: Generalize ZPageCache::flush()
Thu, 25 Apr 2019 08:55:50 +0200 pliden 8221786: ZGC: Increase max heap size to 16TB
Thu, 25 Apr 2019 08:55:49 +0200 pliden 8222462: Introduce CollectedHeap::unused()
Thu, 25 Apr 2019 08:55:49 +0200 pliden 8222664: runtime/appcds/sharedStrings/SharedStringsStress.java assert GC active during NoGCVerifier
Wed, 24 Apr 2019 19:51:38 -0700 jcbeyler 8222935: Fix ExceptionCheckingJniEnv system
Thu, 25 Apr 2019 02:23:27 +0200 jwilhelm Added tag jdk-13+18 for changeset bebb82ef3434
Thu, 25 Apr 2019 02:14:22 +0200 jwilhelm 8222952: Typo in test/hotspot/jtreg/TEST.groups is causing test harness failures
Wed, 24 Apr 2019 16:25:41 -0300 mbalao 8222805: sun/security/pkcs11/tls/tls12/TestTLS12.java fails with Unsupported signature algorithm: rsa_pss_rsae_sha256jdk-13+18
Wed, 24 Apr 2019 11:26:44 -0700 jjg 8222669: Create and use new html.Entity class
Wed, 24 Apr 2019 10:20:25 -0400 dcubed 8222295: more baseline cleanups from Async Monitor Deflation project
Wed, 24 Apr 2019 15:37:55 +0200 redestad 8222532: (zipfs) Performance regression when writing ZipFileSystem entries in parallel
Wed, 24 Apr 2019 08:27:00 -0400 hseigel 8221685: -XX:BytecodeVerificationRemote and -XX:BytecodeVerificationLocal should be diagnostic options
Wed, 24 Apr 2019 11:40:04 +0200 shade 8222838: Shenandoah: SEGV on accessing cset bitmap for NULL ptr
Wed, 24 Apr 2019 11:39:56 +0200 shade 8222843: Print Shenandoah cset map addresses in hs_err
Sat, 20 Apr 2019 15:55:07 +0800 fyang 8222785: aarch64: add necessary masking for immediate shift counts
Wed, 24 Apr 2019 17:09:24 +0900 ysuenaga 8219566: JFR did not collect call stacks when MaxJavaStackTraceDepth is set to zero
Tue, 23 Apr 2019 14:56:39 -0700 darcy 8222817: Refactor printing processor to use streams
Tue, 23 Apr 2019 22:55:09 +0200 jwilhelm 8221598: Update Graal
Tue, 23 Apr 2019 14:09:54 -0400 lfoltan 8218994: Consolidate indy and condy JVM information within a BootstrapInfo data structure
Tue, 23 Apr 2019 08:11:38 -0700 jcbeyler 8213501: Deploy ExceptionJniWrapper for a few tests
Tue, 23 Apr 2019 16:50:17 +0200 hannesw 8222526: Use of no longer existing jquery directory in script.js
Thu, 11 Apr 2019 14:56:52 +0200 redestad 8215017: Improve String::equals warmup characteristics
Tue, 23 Apr 2019 18:28:48 +0530 pmuthuswamy 8219998: Eliminate inherently singleton lists
Tue, 23 Apr 2019 07:05:38 -0400 lfoltan 8222502: Replace 19,20 case alternatives with JVM_CONSTANT_Module/Package names
Tue, 23 Apr 2019 14:20:08 +0530 psadhukhan Merge
Tue, 23 Apr 2019 13:40:37 +0530 psadhukhan Merge
Mon, 22 Apr 2019 10:53:45 +0530 psadhukhan Merge
Tue, 16 Apr 2019 10:09:11 +0530 psadhukhan 8222332: PIT: Problemlist tests that times out consistently
Thu, 11 Apr 2019 10:49:36 -0700 dbatrak 8220231: Cache HarfBuzz face object for same font's text layout calls
Tue, 23 Apr 2019 14:13:18 +0530 pmuthuswamy 8215580: Remove support for `--no-module-directories`
Tue, 23 Apr 2019 10:08:52 +0800 jjiang 8222391: javax/net/ssl/compatibility/Compatibility.java should be more flexible
Mon, 22 Apr 2019 07:13:18 -0400 gadams 8222741: jdi/EventQueue/remove/remove004 fails due to VMDisconnectedException
Mon, 22 Apr 2019 11:16:21 +0200 shade 8222786: Shenandoah get_barrier_strength should accept all shapes of (Weak)CAS reference barriers
Fri, 19 Apr 2019 21:49:54 -0700 coleenp 8192936: RI does not follow the JVMTI RedefineClasses spec that is too strict in the definition
Fri, 19 Apr 2019 10:59:09 -0300 mbalao 8221271: sun/security/pkcs11/tls/tls12/TestTLS12.java test failed
Fri, 19 Apr 2019 11:18:06 -0700 epavlova 8222747: [Graal] mx_subprocess files miss testing VM flags
Fri, 19 Apr 2019 14:42:23 +0800 qpzhang 8222753: AAarch64: Add CPU implementer code for Ampere
Fri, 19 Apr 2019 06:29:05 -0700 erikj 8222735: Update doc/building.md with current Oracle build platforms and compilers
Thu, 18 Apr 2019 17:36:10 -0700 naoto 8222668: Add @since tag to JapaneseEra.REIWA
Thu, 18 Apr 2019 17:56:46 +0100 dfuchs 8222527: HttpClient doesn't send HOST header when tunelling HTTP/1.1 through http proxy
Mon, 15 Apr 2019 15:52:38 -0300 mbalao 8220513: Wrapper Key may get deleted when closing sessions in SunPKCS11 crypto provider
Tue, 12 Mar 2019 10:43:27 +0100 sgehwolf 8217338: [Containers] Improve systemd slice memory limit support
Wed, 17 Apr 2019 07:41:12 +0200 stefank 8222550: runtime/MemberName/MemberNameLeak.java times out
Thu, 18 Apr 2019 09:27:28 +0200 stefank 8222713: Add OutputAnalyzer(Path) constructor
Wed, 17 Apr 2019 07:41:09 +0200 stefank 8222558: Rework ResolvedMethodTable verification
Thu, 18 Apr 2019 07:02:07 -0400 coleenp 8222379: JFR TestClassLoadEvent.java failed due to EXCEPTION_ACCESS_VIOLATION
Fri, 12 Apr 2019 09:13:50 +0200 mbaesken 8222280: Provide virtualization related info in the hs_error file on AIX
Thu, 18 Apr 2019 02:45:02 +0200 jwilhelm Added tag jdk-13+17 for changeset 93b702d2a0cb
Wed, 17 Apr 2019 13:18:29 -0700 erikj 8222444: Add a suggestion for non-US locale in the test docjdk-13+17
Wed, 17 Apr 2019 08:12:19 -0700 bpb 8220477: Channels.newWriter() does not close if underlying channel throws an IOException
Wed, 17 Apr 2019 15:37:20 +0100 mcimadamore 8222289: Overhaul logic for reading/writing constant pool entries
Wed, 17 Apr 2019 12:41:33 +0200 eosterlund 8219718: ZGC: Make nmethod entry barriers and nmethod::is_unloading use ZNMethodDataOops
Mon, 15 Apr 2019 06:41:02 -0700 rschmelter 8222491: jcmd can fail converting UTF8 output to strings
Wed, 17 Apr 2019 10:31:05 +0100 clanger 8222627: Remove sneaky token 'Name' in jdk-version.m4
Wed, 17 Apr 2019 09:54:37 +0200 neliasso 8218468: Load barrier slow path node should be MachTypeNode
Wed, 17 Apr 2019 09:29:25 +0200 rehn 8222327: java_lang_Thread _thread_status_offset, remove pre 1.5 code paths
Wed, 17 Apr 2019 09:25:27 +0200 rehn 8218147: make_walkable asserts on multiple calls
Wed, 17 Apr 2019 12:43:41 +0530 pmuthuswamy 8220382: Cleanup doclet instantiation
Wed, 17 Apr 2019 08:15:09 +0200 thartmann 8222418: compiler/arguments/TestScavengeRootsInCode.java times out
Wed, 17 Apr 2019 08:12:00 +0200 thartmann 8222417: compiler/loopopts/TestOverunrolling.java times out
Tue, 16 Apr 2019 20:47:11 -0700 henryjen Merge
Mon, 15 Apr 2019 18:24:37 -0700 henryjen Merge
Wed, 06 Feb 2019 11:39:57 -0500 rriggs 8218453: More dynamic RMI interactions
Tue, 22 Jan 2019 09:45:30 -0800 bpb 8211936: Better String parsing
Tue, 26 Mar 2019 10:55:17 -0700 henryjen Merge
Tue, 22 Jan 2019 14:14:52 -0800 henryjen Merge
Wed, 12 Dec 2018 11:57:22 -0800 ccheung 8214809: CDS storage improvements
Tue, 16 Apr 2019 16:59:09 -0700 xuelei 8216326: SSLSocket stream close() does not close the associated socket
Wed, 17 Apr 2019 00:06:38 +0200 redestad 8222484: Specialize generation of simple String concatenation expressions
Tue, 16 Apr 2019 21:29:33 +0000 joehw 8222415: Xerces 2.12.0: Parsing Configuration
Mon, 15 Apr 2019 18:37:18 -0700 manc 8222510: Small cleanup for JDK launcher's make file
Tue, 16 Apr 2019 18:22:13 +0200 hannesw 8222528: Fix javadoc headers in Nashorn sources
Tue, 16 Apr 2019 17:15:57 +0100 clanger 8222522: Add configure options for Mac Bundle creation
Tue, 16 Apr 2019 10:01:20 -0400 coleenp 8220743: [TESTBUG] Review Runtime tests recently migrated from JDK subdirs
Tue, 16 Apr 2019 17:56:53 +0530 pmuthuswamy 8222395: Refactor the abstract classes of package and module index writer
Tue, 16 Apr 2019 11:00:48 +0000 qpzhang 8222334: java -Xss0 triggers StackOverflowError
Tue, 16 Apr 2019 08:51:01 +0200 rrich 8222271: [s390] optimize register usage in C2 instruction forms for clearing arrays
Tue, 09 Apr 2019 18:46:51 +0800 qpzhang 8163363: AArch64: Stack size in tools/launcher/Settings.java needs to be adjusted
Mon, 15 Apr 2019 16:05:46 -0700 darcy 8222430: Add tests for ElementKind predicates
Mon, 15 Apr 2019 15:44:42 -0700 darcy 8222378: Provide mechanism to query preview feature status for annotation processors
Mon, 15 Apr 2019 12:35:29 -0700 mseledtsov 8222501: [TESTBUG] Docker support is always set to true in jtreg-ext/requires/VMProps.java
Mon, 15 Apr 2019 11:44:07 -0700 mseledtsov 8221711: [TESTBUG] create more tests for JFR in container environment
Mon, 15 Apr 2019 13:07:06 -0400 zgu 8222425: Shenandoah: Move commonly used closures to separate files
Mon, 15 Apr 2019 12:54:12 -0400 zgu 8222490: Shenandoah: Remove unused _par_state_string in ShenandoahRootEvacuator
Mon, 15 Apr 2019 18:22:10 +0200 shade 8222397: x86_32 tests with UseSHA1Intrinsics SEGV due to garbled registers
Mon, 15 Apr 2019 18:22:08 +0200 shade 8222410: java/nio/file/attribute/BasicFileAttributeView/UnixSocketFile hangs when "nc" does not accept "-U"
Tue, 09 Apr 2019 16:21:20 +0100 adinn 8221397: Support implementation-defined Map Modes
Mon, 15 Apr 2019 15:38:47 +0200 hannesw 8221644: jquery directory should be renamed
Mon, 15 Apr 2019 10:16:04 +0200 mdoerr 8220625: tools/javac/classreader/8171132/BadConstantValue.java failed with "did not see expected error"
Sun, 14 Apr 2019 21:40:07 +0000 dholmes 8222387: Out-of-bounds access to CPU _family_id_xxx array
Sun, 14 Apr 2019 10:22:56 +0800 weijun 8222275: sun/security/tools/keytool/Serial64.java: assertTrue: expected true, was false
Fri, 12 Apr 2019 14:13:31 -0700 epavlova 8208066: compiler/graalunit/JttThreadsTest.java failed with org.junit.runners.model.TestTimedOutException: test timed out after 20 seconds
Fri, 12 Apr 2019 16:30:19 -0400 zgu 8222419: Shenandoah: Remove unused _par_state_string in ShenandoahRootProcessor
Fri, 12 Apr 2019 12:26:29 -0700 mseledtsov 8222299: [TESTBUG] move hotspot container tests to hotspot/containers