log

age author description
Wed, 21 Aug 2019 12:34:37 -0700 amenkov 8228547: accessibility errors in jvmti.html
Wed, 21 Aug 2019 18:05:31 +0200 rkennke 8229977: Shenandoah: save/restore FPU state aroud LRB runtime call
Wed, 21 Aug 2019 11:29:40 -0400 hseigel 8229930: internal_name() in annotations.hpp returns "{constant pool}"
Wed, 21 Aug 2019 17:09:05 +0300 bulasevich 8229254: solaris_x64 build fails after JDK-8191278
Wed, 21 Aug 2019 17:38:19 +0530 sundar 8220700: jlink generated launcher script needs quoting to avoid parameter expansion
Wed, 21 Aug 2019 00:08:35 +0200 godin 8139820: URLClassPath.FileLoader constructor redundantly checks protocol
Tue, 20 Aug 2019 11:36:47 -0700 lmesnik 8229854: Move runtime/ErrorHandling/TestHeapDumpOnOutOfMemoryErrorInMetaspace.java out of tier1_runtime
Tue, 20 Aug 2019 18:39:09 +0200 rkennke 8229921: Shenandoah: Make Traversal mode non-experimental
Mon, 19 Aug 2019 16:08:28 -0700 aeubanks 8229899: Make java.io.File.isInvalid() less racy
Tue, 20 Aug 2019 15:40:49 +0100 dfuchs 8229916: Delete redundant test java/net/Socket/reset/Test.java
Tue, 20 Aug 2019 15:54:46 +0200 godin 8152467: remove uses of anachronistic array declarations for method return type
Tue, 02 Jul 2019 12:28:41 +0200 stefank 8227086: Use AS_NO_KEEPALIVE loads in HeapDumper
Mon, 19 Aug 2019 12:40:27 +0200 stefank 8229839: Break circular dependency between oop.inline.hpp and markWord.inline.hpp
Mon, 19 Aug 2019 11:30:03 +0200 stefank 8229838: Rename markOop files to markWord
Tue, 20 Aug 2019 11:15:23 +0100 dfuchs 8229421: The logic of java/net/ipv6tests/TcpTest.java is flawed
Tue, 20 Aug 2019 10:11:53 +0100 adinn 8224974: Implement JEP 352
Tue, 20 Aug 2019 10:46:23 +0200 chagedorn 8229158: make UseSwitchProfiling non-experimental or false by-default
Tue, 20 Aug 2019 09:22:18 +0200 tschatzl 8227442: Make young_index_in_cset zero-based
Tue, 20 Aug 2019 07:47:13 +0200 thartmann 8228888: C2 compilation fails with assert "m has strange control"
Mon, 19 Aug 2019 18:12:09 -0700 darcy 8202385: Annotation to mark serial-related fields and methods
Mon, 19 Aug 2019 12:56:48 -0700 xuelei 8228757: Fail fast if the handshake type is unknown
Mon, 19 Aug 2019 19:58:50 +0200 shade 8229865: Use explicit #include debug.hpp for STATIC_ASSERT in gc/shenandoah/shenandoahUtils.cpp
Fri, 16 Aug 2019 21:20:21 +0200 fweimer 8229835: Shenandoah should recommend -Xlog:safepoint+stats
Mon, 19 Aug 2019 14:28:43 +0100 chegar 8225425: java.lang.UnsatisfiedLinkError: net.dll: Can't find dependent libraries
Mon, 19 Aug 2019 15:36:07 +0300 bulasevich 8229352: Use of an uninitialized register in 32-bit ARM template interpreter
Mon, 19 Aug 2019 19:43:28 +0900 ysuenaga 8226204: SA: Refactoring for option processing in SALauncher
Mon, 19 Aug 2019 11:14:50 +0100 dfuchs 8191169: java/net/Authenticator/B4769350.java failed intermittently
Mon, 19 Aug 2019 06:13:52 +0200 redestad 8229773: Resolve permissions for code source URLs lazily
Sat, 17 Aug 2019 06:20:49 -0700 jnimeh 8224997: ChaCha20-Poly1305 TLS cipher suite decryption throws ShortBufferException
Fri, 16 Aug 2019 18:27:36 -0400 dholmes 8229808: javaVFrame::print_lock_info_on fails to disable extra printing
Fri, 16 Aug 2019 14:42:50 -0700 srukmannagar 8225625: AES Electronic Codebook (ECB) encryption and decryption optimization using AVX512 + VAES instructions
Fri, 16 Aug 2019 14:46:52 -0400 kbarrett 8229044: G1RedirtyCardsQueueSet should be local to a collection
Fri, 16 Aug 2019 11:35:17 -0700 igerasim 8221307: String.substring() OOB exception on start index reports improper information
Fri, 16 Aug 2019 18:06:51 +0000 poonam 8229420: [Redo] jstat reports incorrect values for OU for CMS GC
Fri, 16 Aug 2019 16:50:17 +0200 eosterlund 8229345: Memory leak due to vtable stubs not being shared on SPARC
Fri, 16 Aug 2019 15:01:58 +0100 dfuchs 8229481: sun/net/www/protocol/https/ChunkedOutputStream.java failed with a SSLException
Tue, 06 Aug 2019 10:48:21 +0200 stefank 8229258: Rework markOop and markOopDesc into a simpler mark word value carrier
Fri, 16 Aug 2019 09:18:41 +0200 lkorinth 8224666: Parallel GC: Use WorkGang (8: obsolete and remove flags)
Fri, 16 Aug 2019 09:18:38 +0200 lkorinth 8224665: Parallel GC: Use WorkGang (7: remove task manager)
Fri, 16 Aug 2019 09:18:35 +0200 lkorinth 8224664: Parallel GC: Use WorkGang (6: PSRefProcTaskProxy)
Fri, 16 Aug 2019 09:18:32 +0200 lkorinth 8224663: Parallel GC: Use WorkGang (5: ScavengeRootsTask)
Fri, 16 Aug 2019 09:18:29 +0200 lkorinth 8224662: Parallel GC: Use WorkGang (4: SharedRestorePreservedMarksTaskExecutor)
Fri, 16 Aug 2019 09:18:26 +0200 lkorinth 8224661: Parallel GC: Use WorkGang (3: UpdateDensePrefixAndCompactionTask)
Fri, 16 Aug 2019 09:18:23 +0200 lkorinth 8224660: Parallel GC: Use WorkGang (2: MarksFromRootsTask)
Fri, 16 Aug 2019 09:18:19 +0200 lkorinth 8224659: Parallel GC: Use WorkGang (1: PCRefProcTask)
Fri, 16 Aug 2019 08:42:09 +0800 weijun 8229775: Incorrect warning when jar was signed with -sectionsonly
Thu, 15 Aug 2019 16:23:41 -0700 ccheung 8226645: [TESTBUG] some AppCDS tests rely on illegal reflective access
Thu, 15 Aug 2019 19:29:58 +0000 bobv 8229699: [Graal] jck tests fail on windows with AOTed Graal
Thu, 15 Aug 2019 13:41:30 -0700 mchung 8193325: StackFrameInfo::getByteCodeIndex returns wrong value if bci > 32767
Thu, 15 Aug 2019 14:35:29 +0200 jlahoda 8226848: jline/terminal/impl files missing classpath exception clause in license header
Thu, 15 Aug 2019 12:58:27 +0100 dfuchs 8229486: Replace wildcard address with loopback or local host in tests - part 21
Thu, 15 Aug 2019 15:39:43 +0800 weijun 8229767: Typo in java.security: Sasl.createClient and Sasl.createServer
Thu, 15 Aug 2019 09:06:42 +0200 rehn 8225788: Dead code in thread and safepoint
Thu, 15 Aug 2019 14:00:36 +0800 ngasson 8229118: [TESTBUG] serviceability/sa/ClhsdbFindPC fails on AArch64
Thu, 15 Aug 2019 03:57:17 +0200 jwilhelm Added tag jdk-14+10 for changeset ececb6dae777
Wed, 14 Aug 2019 18:26:23 -0400 dholmes 8228858: Reimplement JVM_RawMonitors to use PlatformMutex
Wed, 14 Aug 2019 20:32:44 +0200 shade 8229707: [TESTBUG] Some Shenandoah tests assume Server VM by defaultjdk-14+10
Wed, 14 Aug 2019 20:32:43 +0200 shade 8229709: x86_32 build and test failures after JDK-8228369 (Shenandoah: Refactor LRB C1 stubs)
Wed, 14 Aug 2019 12:57:34 -0400 lancea 8184432: Remove references to jdbc@sun.com from javax.sql.rowset.spi.SyncProvider
Wed, 14 Aug 2019 10:07:00 -0400 coleenp 5103339: Strengthen NoSafepointVerifier
Wed, 14 Aug 2019 11:14:54 +0100 prappo 8217606: LdapContext#reconnect always opens a new connection
Wed, 14 Aug 2019 00:18:00 -0400 dholmes 8228857: Refactor PlatformMonitor into PlatformMutex and PlatformMonitor
Wed, 14 Aug 2019 01:40:29 +0000 valeriep 8228835: Memory leak in PKCS11 provider when using AES GCM
Wed, 14 Aug 2019 00:57:15 +0000 valeriep 8228613: java.security.Provider#getServices order is no longer deterministic
Tue, 13 Aug 2019 15:49:11 -0700 mchung 8209005: Lookup.unreflectSpecial fails for default methods when Lookup.findSpecial works
Tue, 13 Aug 2019 16:13:22 -0400 dcubed 8229212: clear up CHECK_OWNER confusion in objectMonitor.cpp
Tue, 13 Aug 2019 10:10:42 -0700 naoto 8211990: DateTimeException thrown when calculating duration between certain dates
Tue, 13 Aug 2019 13:01:41 -0400 zgu 8229474: Shenandoah: Cleanup CM::update_roots()
Tue, 13 Aug 2019 16:18:43 +0100 dfuchs 8229348: java/net/DatagramSocket/UnreferencedDatagramSockets.java fails intermittently
Tue, 13 Aug 2019 16:11:28 +0100 aefimov 8228508: [TESTBUG] java/net/httpclient/SmokeTest.java fails on Windows7
Tue, 13 Aug 2019 16:05:58 +0200 rkennke 8229470: Shenandoah: Fix C1 getAndSetObject() failure
Tue, 13 Aug 2019 14:59:29 +0200 shade 8229419: Shenandoah: Cleanup LRB strength selector code
Tue, 13 Aug 2019 10:27:34 +0200 jlahoda 8228502: javac crashed on a broken classfile with ConstantValue attribute on a field of type Object
Tue, 13 Aug 2019 10:27:33 +0200 jlahoda 8228647: Broken enum produce inconvenient errors and AST
Tue, 13 Aug 2019 10:27:32 +0200 jlahoda 8227922: DocTreeScanner does not dive into AttributeTree.getValue() and LiteralTree.getBody()
Tue, 13 Aug 2019 09:56:13 +0200 thartmann 8224957: C2 compilation fails with assert: Bad graph detected in build_loop_late
Tue, 13 Aug 2019 09:54:40 +0200 thartmann 8228772: C2 compilation fails due to unschedulable graph if DominatorSearchLimit is reached
Tue, 13 Aug 2019 08:25:29 +0200 thartmann 8229447: Problem list compiler/unsafe/UnsafeGetConstantField.java on Sparc until JDK-8229446 is fixed
Mon, 12 Aug 2019 21:36:29 -0700 xuelei 8226374: Restrict TLS signature schemes and named groups
Mon, 12 Aug 2019 23:37:48 +0200 rkennke 8228369: Shenandoah: Refactor LRB C1 stubs
Mon, 12 Aug 2019 20:27:14 +0200 shade 8229416: Shenandoah: Demote or remove ShenandoahOptimize*Final optimizations
Mon, 12 Aug 2019 15:27:57 +0200 redestad 8229407: Avoid ConcurrentHashMap resizes during bootstrap
Mon, 12 Aug 2019 11:24:53 +0100 michaelm 8185898: setRequestProperty(key, null) results in HTTP header without colon in request
Fri, 09 Aug 2019 15:39:32 +0200 mbaesken 8219082: jdk/jfr/event/runtime/TestShutdownEvent.java failed in validateStackTrace()
Mon, 12 Aug 2019 10:49:40 +0200 pliden 8229406: ZGC: Fix incorrect statistics
Mon, 12 Aug 2019 10:02:25 +0200 mdoerr 8229236: CriticalJNINatives: dll handling should be done in native thread state
Mon, 12 Aug 2019 08:48:47 +0200 thartmann 8225670: compiler/types/correctness/* tests fail with "assert(recv == __null || recv->is_klass()) failed: wrong type"
Fri, 09 Aug 2019 15:22:43 -0700 jjg 8229386: Typo "lables" in doc comment
Fri, 09 Aug 2019 13:13:36 -0700 iklam 8229267: [TESTBUG] Remove unnecessary @modules dependencies in CDS tests
Fri, 09 Aug 2019 12:27:05 -0700 jjg 8227697: Improve text in Taglet API spec for expected results with standard doclet
Fri, 09 Aug 2019 11:27:08 -0700 cjplummer 8227645: Some tests in serviceability/sa run with fixed -Xmx values and risk running out of memory
Fri, 09 Aug 2019 13:58:48 +0200 redestad 8229283: StringLatin1 should consistently use CharacterDataLatin1.instance when applicable
Fri, 09 Aug 2019 13:07:18 +0200 shade 8229350: Shenandoah does not need barriers before CreateEx
Fri, 09 Aug 2019 11:04:08 +0200 rehn 8226228: Make Threads_lock an always safepoint checked lock.
Fri, 09 Aug 2019 10:06:44 +0200 eosterlund 8229027: Improve how JNIHandleBlock::oops_do distinguishes oops from non-oops
Fri, 09 Aug 2019 03:51:20 +0200 jwilhelm Merge
Fri, 09 Aug 2019 03:36:59 +0200 jwilhelm Added tag jdk-13+33 for changeset 9c250a7600e1
Thu, 08 Aug 2019 05:05:04 +0000 diazhou 8229180: Remove EA from JDK 13 version stringjdk-13+33 jdk-13-ga
Thu, 08 Aug 2019 09:32:15 -0700 ljiang 8228778: JDK 13 L10n resource files update - msgdrop 20
Thu, 08 Aug 2019 07:07:06 +0100 rrich 8228359: [TESTBUG] jdk.jfr.e.g.c.TestGCHeapConfigurationEventWith32BitOops.java does not expect MinHeapSize to be aligned to HeapAlignment
Thu, 08 Aug 2019 07:05:17 +0200 thartmann 8229219: C2 compilation fails with assert: Bad graph detected in build_loop_late
Thu, 08 Aug 2019 03:08:49 +0200 jwilhelm Added tag jdk-13+33 for changeset 5c85b58e2a42
Thu, 08 Aug 2019 21:58:11 +0100 aefimov 8225430: Replace wildcard address with loopback or local host in tests - part 14
Thu, 08 Aug 2019 18:44:11 +0100 dfuchs 8228970: AssertionError in ResponseSubscribers$HttpResponseInputStream
Thu, 08 Aug 2019 04:29:56 -0700 jcbeyler 8229036: Remove the testing against NSK_TRUE from tests
Thu, 08 Aug 2019 14:13:16 +0530 rraghavan 8227439: Turn off AOT by default
Thu, 08 Aug 2019 03:09:46 +0200 jwilhelm Added tag jdk-14+9 for changeset 18f189e69b29
Wed, 07 Aug 2019 14:56:26 -0700 naoto 8215181: Accounting currency format support
Wed, 07 Aug 2019 22:43:49 +0200 jwilhelm Merge
Wed, 07 Aug 2019 08:42:14 -0700 naoto 8228971: Locale API doc has redundant hyphens for some parameters
Mon, 22 Jul 2019 10:48:14 +0200 sgehwolf 8228434: jdk/net/Sockets/Test.java fails after JDK-8227642
Fri, 12 Jul 2019 19:37:25 +0200 sgehwolf 8227642: [TESTBUG] Make docker tests podman compatible
Wed, 07 Aug 2019 20:47:43 +0000 valeriep Merge
Wed, 07 Aug 2019 20:46:28 +0000 valeriep 8229214: Don't use GCM with PKCS5Padding in test/micro/org/openjdk/bench/javax/crypto/
Wed, 07 Aug 2019 17:00:19 +0800 jiefu 8229169: False failure of GenericTaskQueue::pop_local on architectures with weak memory model
Wed, 07 Aug 2019 14:04:10 -0400 lancea 8226530: ZipFile reads wrong entry size from ZIP64 entries
Wed, 07 Aug 2019 09:17:08 -0400 zgu 8229213: Shenandoah: Allow VM global oop storage to be processed concurrentlyjdk-14+9
Wed, 07 Aug 2019 08:10:45 -0400 coleenp 8229208: Remove Monitor::ClearMonitor
Wed, 07 Aug 2019 13:00:57 +0100 rpatil 8228469: (tz) Upgrade time-zone data to tzdata2019b
Wed, 07 Aug 2019 07:45:37 -0400 zgu 8229206: Shenandoah: ShenandoahWeakRoot::oops_do() uses wrong timing phase
Wed, 07 Aug 2019 11:28:14 +0100 clanger 8213031: (zipfs) Add support for POSIX file permissions
Wed, 07 Aug 2019 12:09:55 +0200 thartmann 8229016: C2 scalarization crashes with assert(node->Opcode() == Op_CastP2X) failed: ConvP2XNode required
Wed, 07 Aug 2019 10:29:07 +0200 tschatzl 8228503: Rename "rs_lengths" to "rs_length" in ergo code
Tue, 06 Aug 2019 15:03:48 -0400 tonyp 8227225: ParallelGC: add subspace transitions for young gen for gc+heap=info log lines
Tue, 06 Aug 2019 11:40:23 -0400 kbarrett 8229156: ProblemList gc/stress/gclocker/TestExcessGCLockerCollections.java
Tue, 06 Aug 2019 15:50:30 +0200 pliden 8229129: ZGC: Fix incorrect format string for doubles
Tue, 06 Aug 2019 15:50:25 +0200 pliden 8229128: ZGC: Remove unused ZThreadRootsIterator
Tue, 06 Aug 2019 15:50:12 +0200 pliden 8229017: ZGC: Various cleanups of ZVerify
Tue, 06 Aug 2019 15:50:00 +0200 pliden 8228657: ZGC: ZObjectAllocator::used() should take undone allocations into account
Tue, 06 Aug 2019 15:49:53 +0200 pliden 8229135: ZGC: Adding missing ZStatTimerDisable before call to ZVerify::roots_strong()
Tue, 06 Aug 2019 09:27:38 -0400 mullan 8210755: Define standard names for EC curves and TLS signature schemes
Tue, 06 Aug 2019 07:43:18 -0400 coleenp 8228753: Deprecate -XX:FieldsAllocationStyle product option
Tue, 06 Aug 2019 12:14:41 +0200 shade 8229134: [TESTBUG] 32-bit build fails gc/arguments/TestSurvivorAlignmentInBytesOption.java after JDK-8228855
Tue, 06 Aug 2019 11:57:42 +0200 shade 8229176: Shenandoah should acquire CodeCache_lock without safepoint check
Fri, 02 Aug 2019 10:10:42 +0200 mbaesken 8228902: add os::dll_load to the unified logging os category
Mon, 05 Aug 2019 16:27:30 -0700 mikael Merge
Mon, 05 Aug 2019 10:40:36 +0100 michaelm 8229018: Switching to an infinite socket timeout on Windows leads to high CPU load
Sat, 03 Aug 2019 13:53:19 +0530 pbansal 8226964: [Yaru] GTK L&F: There is no difference between menu selected and de-selected
Thu, 25 Jul 2019 12:15:27 +0200 mbaesken 8228585: jdk/internal/platform/cgroup/TestCgroupMetrics.java - NumberFormatException because of large long values (memory limit_in_bytes)
Fri, 26 Jul 2019 15:05:24 +0200 mbaesken 8228650: runtime/SharedArchiveFile/CheckDefaultArchiveFile.java test fails on AIX
Thu, 01 Aug 2019 08:59:31 +0200 mbaesken 8228658: test GetTotalSafepointTime.java fails on fast Linux machines with Total safepoint time 0 ms
Fri, 02 Aug 2019 10:43:30 +0200 mgronlun 8228834: Regression caused by JDK-8214542 not installing complete checkpoint data to candidates
Thu, 01 Aug 2019 10:47:51 -0700 itakiguchi 8227919: 8213232 causes crashes on solaris sparc64
Thu, 01 Aug 2019 09:27:24 -0700 mikael Added tag jdk-13+32 for changeset 929f37a9c35d
Mon, 05 Aug 2019 13:18:31 -0700 manc 8225776: Optimize branch frequency of G1's write post-barrier in C2
Mon, 05 Aug 2019 11:16:48 -0400 coleenp 8229000: Fix lock and reenable assert in Monitor::check_safepoint_state
Mon, 05 Aug 2019 11:11:18 +0530 rpatil 8158880: test/java/time/tck/java/time/format/TCKDateTimeFormatterBuilder.java fail with zh_CN locale
Mon, 05 Aug 2019 07:59:42 -0700 erikj 8058539: Platform specific source files may not end up in src.zip
Mon, 05 Aug 2019 15:29:09 +0200 hannesw 8228393: Add an indicator for external links in javadoc
Sat, 03 Aug 2019 09:04:04 +0800 jiefu 8229020: Failure on CPUs allowing loads reordering: assert(_tasks[t] == 1) failed: What else?
Mon, 05 Aug 2019 08:03:25 +0200 thartmann 6394013: C2: Remove VerifyOpto
Fri, 02 Aug 2019 13:51:34 -0700 mseledtsov 8228687: [TESTBUG] exclude Container tests from hotspot_misc group
Fri, 02 Aug 2019 15:13:10 -0400 dcubed 8229032: ProblemList jdk/internal/platform/docker/TestDockerMemoryMetrics.java
Fri, 02 Aug 2019 11:24:59 -0700 jcbeyler 8228998: Remove the testing against NSK_FALSE from tests
Fri, 02 Aug 2019 11:28:58 +0200 mdoerr 8228649: [PPC64] SA reads wrong slots from interpreter frames
Fri, 02 Aug 2019 11:21:41 +0200 rkennke 8229002: Shenandoah: Missing node types in ShenandoahLoadReferenceBarrier::needs_barrier_impl()
Thu, 01 Aug 2019 07:14:03 -0700 igerasim 8228352: CANON_EQ breaks when pattern contains supplementary codepoint
Thu, 01 Aug 2019 16:07:07 -0400 dcubed 8228999: ProblemList vmTestbase/nsk/jvmti/GetThreadState/thrstat001/TestDescription.java
Thu, 01 Aug 2019 15:54:45 -0400 dcubed 8226899: Problemlist compiler/rtm tests
Thu, 01 Aug 2019 09:29:13 -0700 mikael Added tag jdk-14+8 for changeset c0023e364b6f
Thu, 01 Aug 2019 09:23:21 -0700 mikael Merge
Thu, 01 Aug 2019 09:37:24 +0200 mbaesken 8228764: New library dependencies due to JDK-8222720jdk-13+32
Wed, 12 Jun 2019 13:50:37 -0700 serb 8217676: Upgrade libpng to 1.6.37
Wed, 31 Jul 2019 16:09:17 +0200 mgronlun 8227605: Kitchensink fails "assert((((klass)->trace_id() & (JfrTraceIdEpoch::leakp_in_use_this_epoch_bit())) != 0)) failed: invariant"
Wed, 31 Jul 2019 09:52:28 +0800 pli 8228601: AArch64: Fix interpreter code at JVMCI deoptimization entry
Tue, 30 Jul 2019 07:22:05 +0200 thartmann 8228710: Disable AggressiveUnboxing until JDK-8224957 is fixed
Thu, 01 Aug 2019 08:59:31 +0200 mbaesken 8228658: test GetTotalSafepointTime.java fails on fast Linux machines with Total safepoint time 0 msjdk-14+8
Wed, 31 Jul 2019 16:48:51 -0700 mseledtsov 8228904: Problemlist docker/TestJcmdWithSideCar.java until JDK-8228850 and JDK-8228960 are fixed
Wed, 31 Jul 2019 17:30:25 -0400 coleenp 8228907: Some gc argument checking tests fail after JDK-8228855
Mon, 29 Jul 2019 16:31:09 +0530 jpai 8227170: (.hg)Ignore the JTwork and JTreport directories generated at the root of the repo
Wed, 31 Jul 2019 14:28:51 -0400 kbarrett 8048556: Unnecessary GCLocker-initiated young GCs
Wed, 31 Jul 2019 13:40:59 -0400 coleenp 8228855: Test runtime/CommandLine/OptionsValidation/TestOptionsWithRanges fails after JDK-8227123
Wed, 31 Jul 2019 09:55:26 -0400 ecaspole 8228674: LogCompilation: Improvements to log compare feature
Wed, 31 Jul 2019 06:54:50 -0400 coleenp 8228630: Remove always true parameter to NoSafepointVerifier
Wed, 31 Jul 2019 06:37:13 -0400 coleenp 8228673: Remove develop flag StrictSafepointChecks
Wed, 31 Jul 2019 10:03:44 +0200 rkennke 8228775: Shenandoah: Remove useless null-input-verification in Shenandoah/C2 verifier
Wed, 31 Jul 2019 08:05:14 +0200 thartmann 8193042: NativeLookup::lookup_critical_entry() should only load shared library once
Wed, 31 Jul 2019 00:02:01 -0400 dholmes 8227250: UserHandler contains ancient LinuxThreads code
Tue, 30 Jul 2019 17:31:29 -0400 pchilanomate 8227528: TestAbortVMOnSafepointTimeout.java failed due to "RuntimeException: 'Safepoint sync time longer than' missing from stdout/stderr"
Tue, 30 Jul 2019 22:16:48 +0200 shade 8228725: AArch64: Purge method call format support
Tue, 30 Jul 2019 22:15:23 +0200 shade 8228672: [TESTBUG] gc/metaspace/TestSizeTransitions.java fails on 32-bit platforms
Tue, 30 Jul 2019 09:46:06 -0700 bpb 8227609: (fs) Files.newInputStream(...).skip(n) should allow skipping beyond file size
Tue, 30 Jul 2019 17:54:53 +0200 mdoerr 8228743: [PPC64, s390] Implement FastJNIAccessors
Tue, 30 Jul 2019 09:56:18 -0400 coleenp 8227123: Assertion failure when setting SymbolTableSize larger than 2^17 (131,072)
Tue, 30 Jul 2019 09:26:47 -0400 mullan 8191138: Remove deprecated java.security.acl APIs
Tue, 30 Jul 2019 11:14:16 +0800 weijun 8228745: sun/security/tools/jarsigner/Warning.java test timeout
Mon, 29 Jul 2019 16:09:36 -0700 rhalade 8228755: ProblemList sun/security/tools/jarsigner/Warning.java
Mon, 29 Jul 2019 20:18:43 +0000 valeriep 8228668: compiler/codegen/aes/TestAESMain.java failed with GCM mode must be used with NoPadding
Mon, 29 Jul 2019 11:23:49 -0700 xuelei 8228742: Remove javax/net/ssl/SSLSocket/Tls13PacketSize.java from ProblemList
Mon, 29 Jul 2019 09:59:04 -0700 mikael Merge
Fri, 26 Jul 2019 16:03:08 +0200 rrich 8228618: s390: c1/c2 fail to add a metadata relocation in the static call stub.
Mon, 29 Jul 2019 13:57:54 +0200 eosterlund 8227407: ZGC: C2 loads and load barriers can get separated by safepoints
Sat, 27 Jul 2019 10:02:35 +0800 jjiang 8228403: SignTwice.java failed with java.io.FileNotFoundException: File name too long
Fri, 26 Jul 2019 11:47:50 +0800 ljiang 8228623: Update copyright year to 2019 for several java properties file
Thu, 25 Jul 2019 10:25:52 -0700 ccheung 8228407: JVM crashes with shared archive file mismatch
Thu, 25 Jul 2019 21:21:29 +0800 weijun 8228602: Add sun/security/tools/jarsigner/PreserveRawManifestEntryAndDigest.java to problem list
Thu, 25 Jul 2019 15:29:50 +0800 ljiang 8228397: Missing license copyright header in some properties files
Wed, 24 Jul 2019 18:23:16 -0700 iignatyev 8226905: unproblem list applications/ctw/modules/* tests on windows
Wed, 24 Jul 2019 16:54:17 -0700 mikael Added tag jdk-13+31 for changeset 6a159c6c23cc
Wed, 24 Jul 2019 10:50:40 +0300 vlivanov 8227260: JNI upcalls should bypass class initialization barrier in c2i adapterjdk-13+31
Wed, 24 Jul 2019 10:09:30 +0800 weijun 8228341: SignTwice.java fails intermittently on Windows
Wed, 24 Jul 2019 10:09:22 +0800 weijun 8227595: keytool/fakegen/DefaultSignatureAlgorithm.java fails due to "exitValue = 6"
Tue, 23 Jul 2019 11:30:31 -0700 jjg 8228494: Update nroff version of man pages
Mon, 29 Jul 2019 18:22:55 +0200 mdoerr 8227680: FastJNIAccessors: Check for JVMTI field access event requests at runtime
Mon, 29 Jul 2019 09:09:23 -0700 bpb 8078891: java.io.SequenceInputStream.close is not atomic and not idempotent
Mon, 29 Jul 2019 08:48:52 -0700 bpb 8181493: (fs) Files.readAttributes(path, BasicFileAttributes.class) should preserve nano second time stamps
Mon, 29 Jul 2019 10:34:20 -0400 coleenp 8202339: [TESTBUG] Consolidate the tests in runtime/SharedArchiveFile and runtime/appcds
Mon, 29 Jul 2019 09:57:37 -0400 hseigel 8228596: Class redefinition fails when condy instructions are removed
Mon, 29 Jul 2019 11:14:06 +0200 shade 8228400: Remove built-in AArch64 simulator
Fri, 26 Jul 2019 10:52:47 +0200 rschmelter 8228589: BasicJStackTest.java and JcmdOutputEncodingTest.java failing after JDK-8227868
Mon, 29 Jul 2019 08:17:26 +0000 coffeys 8228645: Don't run sun/security/pkcs11/Cipher/TestKATForGCM.java on buggy NSS solaris versions
Fri, 26 Jul 2019 15:05:24 +0200 mbaesken 8228650: runtime/SharedArchiveFile/CheckDefaultArchiveFile.java test fails on AIX
Mon, 29 Jul 2019 09:40:02 +0200 thartmann 8156207: Resource allocated BitMaps are often cleared unnecessarily
Mon, 29 Jul 2019 09:34:07 +0200 thartmann 8223769: Assert triggers with -XX:+StressReflectiveCode
Sun, 28 Jul 2019 23:14:07 -0400 dholmes 8221205: Obsolete AllowJNIEnvProxy
Sat, 27 Jul 2019 14:49:16 -0700 mchung 8228671: Fastdebug VM throws InternalError when publicLookup.in(T) is used to resolve a member
Fri, 26 Jul 2019 23:37:51 -0400 kbarrett 8226796: Reduce debug level logging for oopstorage+blocks
Fri, 26 Jul 2019 20:15:13 -0400 kbarrett 8228631: Fix inconsistent OopStorage::Block owner usage
Fri, 26 Jul 2019 13:32:59 -0700 naoto 8228465: HOST locale provider holds wrong era name for GregorianCalendar in US locale
Fri, 26 Jul 2019 15:06:22 -0400 lancea 8226808: PreparedStatement javadoc typo
Fri, 26 Jul 2019 17:15:17 +0000 joehw 8068376: Validator fails valid XML files due to String == in XSD validator code
Fri, 26 Jul 2019 08:56:28 -0700 naoto 8212970: TZ database in "vanguard" format support
Tue, 23 Jul 2019 15:33:52 -0400 zgu 8228532: Shenandoah: Implement SBSA::try_resolve_jobject_in_native()
Wed, 24 Jul 2019 12:36:12 +0200 mbaesken 8228578: fix CFData object leak in macosx KeystoreImpl.m
Fri, 26 Jul 2019 09:06:03 +0200 clanger 8228571: [TESTBUG] Fix tests failing on non-aot platforms after JDK-8227512
Thu, 25 Jul 2019 21:51:13 +0000 valeriep Merge
Thu, 25 Jul 2019 02:16:49 +0000 valeriep 8180392: SunJCE provider should throw exceptions for unsupported mode and padding combinations
Thu, 25 Jul 2019 17:35:58 -0400 dlong 8226771: Update Graal
Thu, 25 Jul 2019 11:44:37 -0700 bpb 8184157: (ch) AsynchronousFileChannel hangs with internal error when reading locked file
Thu, 25 Jul 2019 12:15:27 +0200 mbaesken 8228585: jdk/internal/platform/cgroup/TestCgroupMetrics.java - NumberFormatException because of large long values (memory limit_in_bytes)
Wed, 24 Jul 2019 09:28:48 +0200 mbaesken 8228501: java_props_macosx.c - provide missing CFRelease for CFLocaleCopyCurrent
Mon, 22 Jul 2019 16:32:58 -0400 zgu 8228490: Shenandoah: Shenandoah concurrent root evacuation may race against OopStorage::release()
Thu, 25 Jul 2019 12:20:04 +0530 psadhukhan Merge
Thu, 25 Jul 2019 11:31:07 +0530 psadhukhan Merge
Tue, 23 Jul 2019 22:21:16 -0700 akolarkunnu 8228479: Correct the format of ColorChooserDemoTest
Tue, 16 Jul 2019 17:00:00 -0700 serb 6573239: Typo in jfc text file
Thu, 04 Jul 2019 12:28:34 +0530 pkbalakr 8042383: [TEST_BUG] Test javax/swing/plaf/basic/BasicMenuUI/4983388/bug4983388.java fails with shortcuts on menus do not work
Mon, 01 Jul 2019 14:57:02 -0700 prr Merge
Wed, 26 Jun 2019 15:34:13 -0700 serb 8134672: [TEST_BUG] Some tests should check isDisplayChangeSupported
Tue, 25 Jun 2019 14:27:31 -0700 kcr 8222563: Remove terminally deprecated method netscape.javascript.JSObject::getWindow