log

age author description
Thu, 29 Nov 2018 14:32:23 +0530 psadhukhan Merge
Tue, 27 Nov 2018 13:47:31 +0530 mhalder 8209123: [Macosx] Maximized frame (frame state set to MAXIMIZED_BOTH using setExtendedState) is resizable on Mac but not on Windows and Ubuntu
Tue, 27 Nov 2018 10:59:24 +0530 psadhukhan Merge
Tue, 27 Nov 2018 10:45:54 +0530 psadhukhan 8213843: Changing L&F from Nimbus to Window L&F causes NPE in SwingSet2
Mon, 26 Nov 2018 10:49:53 +0530 psadhukhan Merge
Mon, 05 Nov 2018 18:53:51 -0800 akolarkunnu 8213168: Enable different look and feel tests in SwingSet3 demo test FileChooserDemoTest
Tue, 20 Nov 2018 16:40:40 +0530 kaddepalli 8212882: links to tutorial should be updated to use https:
Tue, 20 Nov 2018 15:53:54 +0530 jdv 8211422: Reading PNG with corrupt CRC for IEND chunk throws IIOException
Tue, 20 Nov 2018 14:37:24 +0530 jdv 8211795: ArrayIndexOutOfBoundsException in PNGImageReader after JDK-6788458
Thu, 15 Nov 2018 14:14:31 -0800 serb 8213817: @return has already been specified (4 occurrences, in AWT and Swing)
Thu, 15 Nov 2018 11:25:13 +0530 sveerabhadra 6849922: java/awt/Choice/ChoiceKeyEventReaction/ChoiceKeyEventReaction.html fails
Wed, 14 Nov 2018 20:47:57 -0800 alans 8211301: [macos] support full window content options
Wed, 14 Nov 2018 18:04:54 -0800 itakiguchi 8213614: DnD operation change feature does not work with 64bit big endian CPU
Wed, 14 Nov 2018 13:52:33 -0800 avu 8213292: Input freezes after MacOS key-selector (press&hold) usage on macOS Mojave
Thu, 08 Nov 2018 17:10:47 +0100 mbaesken 8213532: add missing LocalFree calls after using FormatMessage(A) [windows]
Wed, 14 Nov 2018 18:27:51 +0530 pbansal 8213844: Typo in ProblemList updation under JDK-8213536
Wed, 14 Nov 2018 01:29:34 +0530 jdv 8212116: IIOException "tEXt chunk length is not proper" on opening png file
Wed, 14 Nov 2018 17:26:24 +0530 psadhukhan Merge
Tue, 13 Nov 2018 16:35:58 -0800 serb 8211833: Javadoc cleanup of java.applet package
Tue, 13 Nov 2018 07:11:50 -0800 shurailine 8186549: move ExtendedRobot closer to tests
Tue, 13 Nov 2018 09:39:57 +0530 jdv 8176556: java/awt/dnd/ImageTransferTest/ImageTransferTest.java fails for JFIF
Mon, 12 Nov 2018 22:28:08 +0000 alitvinov 8187364: Unable to enter zero width non-joiner (ZWNJ) symbol in Swing text component
Thu, 29 Nov 2018 00:51:58 -0500 dholmes 8214465: Upgrade arm-sflt minimum architecture to ARMv5TE for assembler
Thu, 29 Nov 2018 00:49:27 -0500 dholmes 8214466: Append assembler flags on ARM targets
Wed, 28 Nov 2018 22:29:35 -0500 dholmes 8214332: Add a flag for overriding default JNI library search path
Wed, 28 Nov 2018 18:16:39 -0800 smarks 8214460: MacosX build is broken because of JDK-8214014
Thu, 29 Nov 2018 02:11:44 +0100 jwilhelm Added tag jdk-12+22 for changeset 732bec44c89e
Thu, 29 Nov 2018 07:40:45 +0800 mli 8214431: tests failed because can't find jdk.testlibrary.* in test directory or libraries
Wed, 28 Nov 2018 15:25:14 -0800 dl 8211283: Miscellaneous changes imported from jsr166 CVS 2018-11
Wed, 28 Nov 2018 15:25:14 -0800 dl 8211877: Broken links in java.util.concurrent.atomic
Wed, 28 Nov 2018 15:25:14 -0800 dl 8212899: java/util/concurrent/tck/JSR166TestCase.java - testMissedSignal_8187947(SubmissionPublisherTest): timed out waiting for CountDownLatch for 40 sec
Wed, 28 Nov 2018 14:28:28 -0800 martin 8213406: (fs) More than one instance of built-in FileSystem observed in heap
Wed, 28 Nov 2018 16:05:48 -0500 kbarrett 8214278: Cleanup process_completed_threshold and related state
Wed, 28 Nov 2018 16:04:36 -0500 rriggs 8214014: Remove vestiges of gopher: protocol proxy support
Wed, 28 Nov 2018 15:53:49 -0500 rriggs 4947890: Minimize JNI upcalls in system-properties initialization
Wed, 28 Nov 2018 14:49:19 -0500 lancea 8210454: jar tool does not allow setting the module version without also setting the main class
Wed, 28 Nov 2018 11:09:27 -0800 jcbeyler 8214408: Migrate EventsOnOff to using the same allocateAndCheck method
Wed, 28 Nov 2018 10:30:15 -0800 joehw 8213117: adoptNode corrupts attribute valuesjdk-12+22
Wed, 28 Nov 2018 07:51:15 -0800 iklam 8213275: ReplaceCriticalClasses.java fails with jdk.internal.vm.PostVMInitHook not found
Wed, 28 Nov 2018 13:56:32 +0100 simonis 8214343: Handle the absence of Xrandr more generically
Wed, 28 Nov 2018 13:24:56 +0300 dchuyko 8214272: Don't use memset to initialize arrays of MemoryUsage in memoryManager.cpp
Wed, 28 Nov 2018 11:06:27 +0100 rehn 8213791: StringTable: Use get and insert
Wed, 28 Nov 2018 11:06:58 +0100 tschatzl 8213996: Remove one of the SparsePRT entry tables
Wed, 28 Nov 2018 10:52:01 +0100 tschatzl 8211211: vmTestbase/metaspace/stressDictionary/StressDictionary.java timeout
Wed, 28 Nov 2018 10:00:41 +0100 ihse 8178317: Create man pages using pandoc from markdown sources
Tue, 27 Nov 2018 15:56:10 +0100 mbaesken 8214373: adjust usage of ReleaseLongArrayElements in MacosxDebuggerLocal
Tue, 27 Nov 2018 14:49:13 +0100 roland 8214362: C2: gc interface entry point for split if
Tue, 27 Nov 2018 09:35:02 +0100 roland 8214172: GC interface entry points for loop opts
Wed, 28 Nov 2018 15:34:43 +0800 mli 8211975: move testlibrary/jdk/testlibrary/OptimalCapacity.java to top-level library
Wed, 28 Nov 2018 10:21:07 +0530 pmuthuswamy 8202621: bad test with broken links needs to be updated
Wed, 28 Nov 2018 09:37:03 +0530 pmuthuswamy 8213921: Use {@systemProperty} tag for properties listed in "Networking Properties"
Tue, 27 Nov 2018 22:02:52 -0500 dholmes 8212207: runtime/InternalApi/ThreadCpuTimesDeadlock.java crashes with SEGV in pthread_getcpuclockid+0x0
Tue, 27 Nov 2018 21:20:16 -0500 dholmes 8214208: Nestmate package validation logging/exception should include classloader information
Tue, 27 Nov 2018 19:46:57 -0500 coleenp 8214151: [TESTBUG] CleanProtectionDomain.java fails due to RuntimeException: 'protection domain unlinked' missing
Tue, 27 Nov 2018 15:52:34 -0800 mseledtsov 8213914: [TESTBUG] Several JFR VM events are not covered by tests
Tue, 27 Nov 2018 18:35:16 -0500 dcubed 8202415: Incorrect time logged for monitor deflation
Tue, 27 Nov 2018 17:53:17 -0500 jiangli 8214217: [TESTBUG] runtime/appcds/LotsOfClasses.java failed with fragmented heap
Tue, 27 Nov 2018 13:39:57 -0500 pchilanomate 8150689: Thread dump report "waiting to re-lock in wait()" shows incorrectly
Tue, 27 Nov 2018 11:28:47 -0800 darcy 8213911: Use example.com in java.net and other examples
Tue, 27 Nov 2018 09:40:32 -0800 joehw 8177286: AttributeSet: attempt to compare Qname and String
Tue, 27 Nov 2018 18:14:27 +0100 mgronlun 8214287: SpecJbb2005StressModule got uncaught exception
Tue, 27 Nov 2018 11:07:44 -0500 vromero 8203277: preflow visitor used during lambda attribution shouldn't visit class definitions inside the lambda body
Mon, 26 Nov 2018 14:04:23 +0100 mbaesken 8214297: testbug : missing fclose in jvmti_aod.cpp
Tue, 27 Nov 2018 13:02:28 +0100 hannesw 8213716: javadoc search not working with Japanese and Chinese locales
Tue, 27 Nov 2018 11:09:53 +0000 coffeys 8214295: Populate handlers while holding streamHandlerLock
Mon, 26 Nov 2018 17:35:35 +0100 roland 8214189: test/hotspot/jtreg/compiler/intrinsics/mathexact/MulExactLConstantTest.java fails on Windows x64 when run with -XX:-TieredCompilation
Mon, 26 Nov 2018 22:49:57 -0800 dlong 8213259: [AOT] AOTing java.base fails with "java.lang.AssertionError: no fingerprint for Ljdk/internal/event/Event"
Tue, 27 Nov 2018 07:54:06 +0100 stuefe 8213834: JVMTI ResourceExhausted should not be posted in CompilerThread
Mon, 26 Nov 2018 20:50:21 -0800 xuelei 8214321: Misleading code in SSLCipher
Tue, 27 Nov 2018 08:51:20 +0800 weijun 8214100: use of keystore probing results in unnecessary exception thrown
Mon, 26 Nov 2018 15:06:53 -0800 iklam 8214029: Remove dead code BasicHashtable::bulk_free_entries
Mon, 26 Nov 2018 11:17:13 -0800 jjg 8190312: javadoc -link doesn't work with http: -> https: URL redirects
Mon, 26 Nov 2018 14:13:22 -0500 jiangli 8214086: [TESTBUG] Fix subgraph test cases in ReplaceCriticalClasses.java
Mon, 26 Nov 2018 11:00:32 -0800 jjg 8213956: javadoc crash using {@index} in doc-files file
Mon, 26 Nov 2018 13:17:39 -0500 kbarrett 8214202: DirtyCardQueueSet::get_completed_buffer should not clear _process_completed
Mon, 26 Nov 2018 09:36:30 +0100 sgehwolf 8214059: Undefined behaviour in ADLC
Mon, 26 Nov 2018 12:20:06 -0400 jlaskey 8203442: String::transform
Mon, 26 Nov 2018 09:46:20 -0500 hseigel 8204525: [TESTBUG] runtime/NMT/MallocStressTest.java ran out of java heap
Mon, 26 Nov 2018 12:16:23 +0100 thartmann 8214242: compiler/arguments/TestScavengeRootsInCode.java fails because of missing UnlockDiagnosticVMOptions
Mon, 26 Nov 2018 09:24:08 +0100 jlahoda 8214113: Switch expressions may have constant type and may be skipped during write
Mon, 26 Nov 2018 08:27:49 +0800 weijun 8214262: SunEC native code does not compile with debug on
Sat, 24 Nov 2018 01:05:11 +0100 jwilhelm 8214276: Problemlist compiler/intrinsics/mathexact/MulExactLConstantTest.java
Fri, 23 Nov 2018 19:45:38 +0300 bulasevich 8213845: ARM32: Interpreter doesn't call result handler after native calls
Thu, 22 Nov 2018 17:25:47 +0100 roland 8214206: Fix for JDK-8213419 is broken on 32-bit
Fri, 23 Nov 2018 10:57:07 +0100 sjohanss 8214118: HeapRegions marked as archive even if CDS mapping fails
Fri, 23 Nov 2018 11:07:54 +0100 rehn 8214181: safepoint header cleanup
Fri, 23 Nov 2018 10:43:18 +0100 rehn 8212108: SafepointSynchronizer never ending counter (big enough)
Fri, 23 Nov 2018 10:51:59 +0100 mgronlun 8214161: java.lang.IllegalAccessError: class jdk.internal.event.X509CertificateEvent (in module java.base) cannot access class jdk.jfr.internal.handlers.EventHandler (in module jdk.jfr) because module java.base does not read module jdk.jfr
Fri, 23 Nov 2018 13:16:45 +0530 vtewari 8203672: JNI exception pending in PlainSocketImpl.c
Fri, 23 Nov 2018 16:36:07 +0900 ysuenaga 8213015: Inconsistent settings between JFR.configure and -XX:FlightRecorderOptions
Fri, 23 Nov 2018 12:45:47 +0800 amlu 8214241: Problem list com/sun/jndi/ldap/LdapTimeoutTest.java for all platforms
Thu, 22 Nov 2018 21:43:37 -0500 mhorie 8214205: PPC64: Add instructions for counting trailing zeros
Thu, 22 Nov 2018 10:15:32 -0800 mchung 8214223: tools/jdeps/listdeps/ListModuleDeps.java failed due to missing Lib2 file
Thu, 22 Nov 2018 17:22:40 +0100 simonis 8213698: Improve devkit creation and add support for linux/ppc64/ppc64le/s390x
Thu, 22 Nov 2018 15:38:20 +0100 hannesw 8200432: javadoc fails with ClassCastException on {@link byte[]}
Thu, 22 Nov 2018 11:15:53 +0100 sgehwolf 8214108: [TESTBUG] Incorrect Function parameter lists in vmTestbase/nsk/jvmti/scenarios/extension/EX03/ex03t001
Thu, 22 Nov 2018 10:11:58 +0100 sgehwolf 8214105: [TESTBUG] Bit test is always false in serviceability/jvmti/StartPhase/AllowedFunctions
Thu, 22 Nov 2018 10:01:38 +0100 eosterlund 8213755: Let nmethods be is_unloading() outside of safepoints
Thu, 22 Nov 2018 09:55:44 +0100 eosterlund 8214056: Allow the GC to attach context information to CompiledMethod
Thu, 22 Nov 2018 09:46:24 +0100 eosterlund 8213486: SIGSEGV in CompiledMethod::cleanup_inline_caches_impl with AOT
Thu, 22 Nov 2018 09:44:02 +0100 simonis 8213944: Fix AIX build after the removal of Xrandr.h and add a configure check for it
Thu, 22 Nov 2018 09:26:51 +0100 tschatzl 8213927: G1 ignores AlwaysPreTouch when UseTransparentHugePages is enabled
Thu, 22 Nov 2018 09:25:19 +0100 tschatzl 8213997: Remove G1HRRSUseSparseTable flag
Thu, 22 Nov 2018 09:23:05 +0100 rkennke 8214057: GC/C2 abstraction for Node::has_special_unique_user()
Thu, 22 Nov 2018 09:22:54 +0100 rkennke 8214055: GC/C2 abstraction for phaseX
Fri, 09 Nov 2018 14:08:01 +0100 pliden 8212748: ZGC: Add reentrant locking functionality
Thu, 22 Nov 2018 09:14:31 +0100 pliden 8214068: ZGC crashes with vmTestbase/nsk/jdi/ReferenceType/instances/instances004/TestDescription.java
Thu, 22 Nov 2018 13:25:44 +0530 vtewari 8046500: GetIpAddrTable function failed on Pure Ipv6 environment
Wed, 21 Nov 2018 22:34:01 -0800 mchung 8213909: jdeps --print-module-deps should report missing dependences
Wed, 21 Nov 2018 22:33:33 -0800 mchung 8211051: jdeps usage of --dot-output doesn't provide valid output for modular jar
Thu, 22 Nov 2018 10:25:44 +0530 pmuthuswamy 8213819: doclint should warn against {@index} inside <a> tag
Thu, 22 Nov 2018 10:30:47 +0800 amlu 8211266: [TESTBUG] ZipFSTester.java failed intermittently in ZipFSTester.checkRead(): bound must be positive
Thu, 22 Nov 2018 02:32:36 +0100 jwilhelm Added tag jdk-12+21 for changeset f8fb0c86f2b3
Wed, 21 Nov 2018 22:02:17 +0100 dnsimon 8213907: [JVMCI] avoid Class.getDeclared* methods when converting JVMCI objects to reflection objects
Wed, 21 Nov 2018 12:36:16 -0800 jjg 8214139: Remove wrapper methods from {Base,Html}Configuration
Wed, 21 Nov 2018 15:06:13 -0500 apetcher 8213202: Possible race condition in TLS 1.3 session resumptionjdk-12+21
Wed, 21 Nov 2018 10:46:45 -0800 jcbeyler 8214149: Move out assignments when not using NSK*VERIFY macros
Wed, 21 Nov 2018 18:44:11 +0000 alanb 8214078: (fs) SecureDirectoryStream not supported on arm32
Wed, 21 Nov 2018 09:38:27 -0800 jcbeyler 8213721: [Graal] Tests vmTestbase/nsk/stress/except/except* may be encountering SEGV during out-of-memory conditions
Wed, 21 Nov 2018 08:16:25 -0800 bpb 8213235: java/nio/channels/SocketChannel/AsyncCloseChannel.java fails with threads that didn't exit
Wed, 21 Nov 2018 15:09:27 +0000 coffeys 8213942: URLStreamHandler initialization race
Wed, 21 Nov 2018 09:40:19 -0500 kbarrett 8214144: Remove confusing locking_enqueue_completed_buffer
Wed, 21 Nov 2018 15:22:28 +0100 simonis 8214120: [REDO] Fix sun.awt.nativedebug on X11 platforms
Wed, 21 Nov 2018 15:22:57 +0100 jlahoda 8212982: Rule cases in switch expression accepted even if complete normally
Wed, 21 Nov 2018 15:05:21 +0100 thartmann 8214025: assert(t->singleton()) failed: must be a constant when ScavengeRootsInCode < 2
Wed, 21 Nov 2018 14:24:31 +0530 rgoel 8209923: Unicode 11.0.0.
Wed, 14 Nov 2018 13:15:54 +0100 roland 8213419: C2 may hang in MulLNode::Ideal()/MulINode::Ideal() with gcc 8.2.1
Tue, 20 Nov 2018 20:00:15 -0800 iklam 8213587: Speed up CDS dump time by using resizable hashtables
Tue, 20 Nov 2018 18:36:57 -0800 jcbeyler 8214154: problem list HeapMonitorStatIntervalTest.java
Tue, 20 Nov 2018 20:09:11 -0500 zgu 8214124: [TESTBUG] Bugs in runtime/NMT/MallocStressTest.java
Tue, 20 Nov 2018 22:59:27 +0100 shade 8213992: Rename and make DieOnSafepointTimeout the diagnostic option
Tue, 20 Nov 2018 22:37:34 +0100 rkennke 8213746: GC/C2 abstraction for C2 matcher
Tue, 20 Nov 2018 21:12:46 +0100 redestad 8213033: Archive remaining primitive box caches
Mon, 19 Nov 2018 09:57:41 -0800 cushon 8213908: AssertionError in DeferredAttr at setOverloadKind
Tue, 20 Nov 2018 19:06:34 +0100 simonis 8214125: [test] Fix comparison between pointer and integer in test_ptrQueueBufferAllocator.cpp
Tue, 20 Nov 2018 09:22:13 -0800 joehw 8210722: JAXP Tests: CatalogSupport2 and CatalogSupport3 generate incorrect messages upon failure
Tue, 20 Nov 2018 21:59:07 +0530 sdama 8210742: compound var declaration type is not uniform for all variables
Tue, 20 Nov 2018 13:12:48 +0000 coffeys 8148188: Enhance the security libraries to record events of interest
Tue, 20 Nov 2018 10:08:19 +0100 eosterlund 8212992: Change mirror accessor in Klass::verify_on() to use AS_NO_KEEPALIVE
Tue, 20 Nov 2018 10:08:18 +0100 eosterlund 8212682: Avoid holding Compile_lock when blocking for GC in ObjArrayKlass::allocate_objArray_klass()
Tue, 20 Nov 2018 09:35:15 +0100 rehn 8213560: gtests might hang
Tue, 20 Nov 2018 08:17:24 +0100 pliden 8213623: ZGC: Let heap iteration walk all roots
Tue, 20 Nov 2018 10:50:54 +0530 pmuthuswamy 8184205: Captions on tabbed tables are squashed together
Tue, 20 Nov 2018 10:07:42 +0530 pmuthuswamy 8213920: Use {@systemProperty} tag for properties listed in System.getProperties
Tue, 20 Nov 2018 09:59:58 +0800 xyin 8129310: java/net/Socket/asyncClose/AsyncClose.java fails intermittently
Mon, 19 Nov 2018 10:47:38 -0800 cushon 8214071: Broken msg.bug diagnostics when using the compiler API
Mon, 19 Nov 2018 22:27:51 +0100 stuefe 8214075: [BACKOUT] 8214007: Fix sun.awt.nativedebug on X11 platforms
Mon, 19 Nov 2018 19:25:57 +0100 simonis 8214007: Fix sun.awt.nativedebug on X11 platforms
Mon, 19 Nov 2018 08:52:11 -0800 erikj 8214062: JDK-8167368 Leftover: get_source.sh in build documentation
Wed, 06 Dec 2017 13:07:21 +0100 phedlin 8191339: [JVMCI] BigInteger compiler intrinsics on Graal
Thu, 08 Nov 2018 10:20:04 +0100 roland 8211451: ~2.5% regression on compression benchmark starting with 12-b11
Mon, 19 Nov 2018 13:49:50 +0100 redestad 8214045: Missing explicit dependencies of build-microbenchmark cause intermittent build failure
Mon, 19 Nov 2018 07:05:13 -0500 gadams 8213916: no copyright in signature.html
Mon, 19 Nov 2018 11:51:27 +0100 shade 8212070: Introduce diagnostic flag to abort VM on failed JIT compilation
Tue, 13 Nov 2018 09:59:50 +0100 roland 8213779: Loop opts anti dependent store detection should ignore uncommon trap calls
Mon, 19 Nov 2018 09:56:42 +0000 coffeys 8210838: Override javax.crypto.Cipher.toString()
Sun, 18 Nov 2018 19:45:33 +0100 bsrbnd 8214027: Reinstate testB_mem_imm pattern in x86_64.ad
Fri, 16 Nov 2018 17:46:15 -0800 iklam 8213948: Solaris-X64 build fails with compact hashtable
Fri, 16 Nov 2018 15:51:29 +0100 rrich 8213902: com/sun/jdi/SetLocalWhileThreadInNative.java times out
Sat, 17 Nov 2018 13:48:50 +0100 shade 8214004: Missing space between compiler thread name and task info in hs_err
Sat, 17 Nov 2018 18:11:23 +0800 weijun 8212003: Deprecating the default keytool -keyalg option
Fri, 16 Nov 2018 19:27:21 -0800 jcbeyler 8212931: HeapMonitorStatIntervalTest.java fails due average calculation
Fri, 16 Nov 2018 16:10:25 -0800 ccheung 8201375: Add the AllowArchivingWithJavaAgent diagnostic vm option to allow the use of the -javaagent option during CDS dumping
Fri, 16 Nov 2018 23:39:51 +0100 redestad 8061281: Microbenchmark suite build support, directory layout and sample benchmarks
Fri, 16 Nov 2018 13:23:50 -0500 jiangli 8213898: CDS dumping of springboot asserts in G1ArchiveAllocator::alloc_new_region
Fri, 16 Nov 2018 09:49:05 -0800 erikj 8214003: Limit default test jobs based on memory size
Fri, 16 Nov 2018 09:35:39 -0800 dlong 8213959: add org.graalvm.compiler.replacements.test.StringCompressInflateTest to graal problem list
Fri, 16 Nov 2018 19:30:11 +0300 bulasevich 8213947: ARM32: failed check_simd should set UsePopCountInstruction to false
Fri, 16 Nov 2018 19:29:40 +0300 bulasevich 8213794: ARM32: disable TypeProfiling, CriticalJNINatives, Serviceablity tests for ARM32
Fri, 16 Nov 2018 19:29:20 +0300 bulasevich 8213410: UseCompressedOops requirement check fails fails on 32-bit system
Fri, 16 Nov 2018 08:25:46 -0800 erikj 8213906: Update arm devkits with libXrandr headers
Fri, 16 Nov 2018 10:54:04 -0500 coleenp 8213092: Add more runtime locks for concurrent class unloading
Fri, 16 Nov 2018 07:30:40 -0500 coleenp 8213751: ClassLoaderDataGraph::cld_do() should sometimes require CLDG_lock
Thu, 15 Nov 2018 17:08:59 +0100 mbaesken 8211326: add OS user related information to hs_err file
Thu, 15 Nov 2018 21:53:30 -0800 dzhou 8210408: Refactor java.util.ResourceBundle:i18n shell tests to plain java tests
Thu, 15 Nov 2018 21:26:35 -0800 jcm 8212779: ADL Parser does not check allocation return values in all cases
Thu, 15 Nov 2018 19:59:10 -0500 kbarrett 8213352: Separate BufferNode allocation from PtrQueueSet
Thu, 15 Nov 2018 17:55:41 -0500 dholmes 8213723: More Monitor/mutex initialization management
Thu, 15 Nov 2018 14:01:10 -0800 iignatyev 8213926: WB_EnqueueInitializerForCompilation requests compilation for NULL
Thu, 15 Nov 2018 14:01:08 -0800 iignatyev 8213922: fix ctw stand-alone build
Thu, 15 Nov 2018 09:04:07 -0800 dlong 8210777: Update Graal
Thu, 15 Nov 2018 21:05:47 +0100 shade 8213373: Bulk MarkBitMap clearing methods
Tue, 13 Nov 2018 22:08:44 -0800 manc 8213829: Remove circular dependency between g1CollectedHeap and g1ConcurrentMark
Thu, 15 Nov 2018 13:22:29 -0500 apetcher 8213363: X25519 private key PKCS#8 encoding/decoding is incorrect
Thu, 15 Nov 2018 09:56:49 -0800 dtitov 8203174: [Graal] JDI tests fail with Unexpected exception: com.sun.jdi.ObjectCollectedException
Thu, 15 Nov 2018 09:45:18 +0100 neliasso 8213538: VM crashes when MaxVectorSize is set to 0, 1 or 2
Wed, 14 Nov 2018 09:34:46 +0100 sgehwolf 8213736: Build fails with LOG=debug on F28 after JDK-8210958
Tue, 02 Oct 2018 13:48:08 +0200 mbaesken 8211106: [windows] Update OS detection code to recognize Windows Server 2019
Thu, 15 Nov 2018 11:26:46 +0000 michaelm 8213616: URLPermission with query or fragment behaves incorrectly
Thu, 15 Nov 2018 11:10:04 +0100 mgronlun 8210024: JFR calls virtual is_Java_thread from ~Thread()
Thu, 15 Nov 2018 10:59:56 +0100 rkennke 8213615: GC/C2 abstraction for escape analysis
Wed, 14 Nov 2018 23:12:19 -0800 ssahoo 8211787: javax/net/ssl/TLSCommon/TLSTest.java throws java.net.SocketTimeoutException: Read timed out
Thu, 15 Nov 2018 11:23:43 +0530 pmuthuswamy 8206475: Repeated word in error message
Thu, 15 Nov 2018 01:58:53 +0100 jwilhelm Added tag jdk-12+20 for changeset 40098289d580
Wed, 14 Nov 2018 16:27:11 -0800 jjg 8213913: Redundant HTML in java.se/module-info.java
Wed, 14 Nov 2018 16:11:21 -0800 jjg 8213910: Invalid HTML in java.net.http.HttpClient
Wed, 14 Nov 2018 18:49:02 -0500 jiangli 8213713: Minor issues during MetaspaceShared::initialize_runtime_shared_and_meta_spaces
Wed, 14 Nov 2018 12:25:15 -0800 jcbeyler 8213622: Windows VS2013 build failure - "'snprintf': identifier not found"jdk-12+20
Wed, 14 Nov 2018 11:42:40 -0800 naoto 8213818: @return has already been specified
Wed, 14 Nov 2018 18:57:47 +0100 rkennke 8213795: Force explicit null check on patching placeholder offset
Fri, 09 Nov 2018 10:34:19 -0300 mbalao 8204142: AWT hang occurs when sequenced events arrive out of sequence in multiple AppContexts
Wed, 14 Nov 2018 09:31:38 -0800 erikj 8213709: jdk/javadoc/doclet/testValueTag/TestValueTagInModule.java missing modules declaration
Wed, 14 Nov 2018 09:26:28 -0800 erikj 8211727: Adjust default concurrency settings for running tests on Sparc
Wed, 14 Nov 2018 09:50:01 -0500 pchilanomate 8213708: Different #ifdef guards cause incorrect use of Monitor::check_block_state()
Wed, 14 Nov 2018 14:23:21 +0000 michaelm 8213189: Make restricted headers in HTTP Client configurable and remove Date by default
Wed, 14 Nov 2018 17:16:44 +0530 psadhukhan Merge
Mon, 12 Nov 2018 12:39:03 +0530 pbansal 8213536: Update ProblemList for Linux
Mon, 12 Nov 2018 11:10:16 +0530 psadhukhan Merge
Mon, 12 Nov 2018 10:55:49 +0530 sveerabhadra 8198624: java/awt/KeyboardFocusmanager/TypeAhead/SubMenuShowTest/SubMenuShowTest.html fails on mac
Sat, 10 Nov 2018 18:48:35 -0800 serb 8211435: Exception in thread "AWT-EventQueue-1" java.lang.IllegalArgumentException: null source
Sat, 10 Nov 2018 18:41:43 -0800 serb 8198321: javax/swing/JEditorPane/5076514/bug5076514.java fails
Sat, 10 Nov 2018 09:52:59 -0800 serb 8199072: Test javax/swing/GroupLayout/6613904/bug6613904.java is unstable
Fri, 09 Nov 2018 22:25:40 -0800 serb 8213568: Typo in java/awt/GraphicsEnvironment/LoadLock/GE_init5.java
Fri, 09 Nov 2018 18:35:25 +0530 arapte 8198002: java/awt/Mixing/Validating.java debug assert on Windows
Fri, 09 Nov 2018 12:08:05 +0530 arapte 8198000: java/awt/List/EmptyListEventTest/EmptyListEventTest.java debug assert on Windows
Fri, 09 Nov 2018 09:29:43 +0530 psadhukhan 8213181: Updation of ProblemList.txt for removal of passing swing test
Thu, 08 Nov 2018 10:34:49 -0800 prr 8210776: Upgrade X Window System 6.8.2 to the latest XWD 1.0.7
Thu, 08 Nov 2018 12:09:06 +0530 psadhukhan 8213116: javax/swing/JComboBox/WindowsComboBoxSize/WindowsComboBoxSizeTest.java fails in Windows
Tue, 06 Nov 2018 17:57:17 -0800 serb 8211822: Some tests fail after JDK-8210039
Sat, 03 Nov 2018 09:50:22 +0530 psadhukhan 8213261: test javax/swing/plaf/nimbus/AllSwingComponentsBaselineTest.java fails
Fri, 02 Nov 2018 15:38:03 -0700 serb 8207070: Webstart app popup on wrong screen in a one-screen setup changing to multi-monitor
Fri, 02 Nov 2018 12:15:37 -0700 serb 8211992: GraphicsConfiguration.getDevice().getDisplayMode() causes JVM crash on Mac
Fri, 02 Nov 2018 23:05:47 +0530 arapte 8198001: java/awt/Menu/WrongParentAfterRemoveMenu/WrongParentAfterRemoveMenu.java debug assert on Windows
Thu, 01 Nov 2018 13:56:14 -0700 prr 8213213: Remove src/java.desktop/unix/classes/sun/awt/X11/keysym2ucs.h
Thu, 01 Nov 2018 18:13:25 +0530 sveerabhadra 7124293: [macosx] VoiceOver reads percentages rather than the actual values for sliders.
Wed, 31 Oct 2018 16:58:37 -0700 prr 8210863: Remove Xrandr include files from JDK sources
Wed, 31 Oct 2018 13:26:06 -0700 prr Merge
Wed, 31 Oct 2018 11:45:04 -0700 prr 8210886: Remove references in xwindows.md to non-existent files.
Wed, 31 Oct 2018 10:01:23 -0700 serb 8208702: javax/swing/reliability/HangDuringStaticInitialization.java may hang on macos
Wed, 31 Oct 2018 14:22:48 +0530 pbansal 8212903: [TestBug] Tests test/jdk/javax/swing/LookAndFeel/8145547/DemandGTK2.sh and DemandGTK3.sh fail on Ubuntu 18.04 LTS
Tue, 30 Oct 2018 15:51:10 -0700 itakiguchi 8211810: X11 Time stamp data should be unsigned
Tue, 30 Oct 2018 17:06:32 +0530 mhalder 8208543: [macos] Support for apple.awt.documentModalSheet incomplete
Tue, 30 Oct 2018 15:43:37 +0530 psadhukhan 8213138: Update ProblemList.txt for mac
Fri, 26 Oct 2018 22:20:19 +0530 jdv 8213130: Update ProblemList after verification of jtreg tests in Win 7
Mon, 29 Oct 2018 17:34:05 -0700 serb 8212790: Javadoc cleanup of java.awt.color package
Fri, 26 Oct 2018 15:44:33 +0530 jdv 8212865: Broken external link to TIFF6.pdf in ImageIO package-info.java
Fri, 26 Oct 2018 14:03:57 +0530 sveerabhadra 8210057: Enable different look and feels in SwingSet3 demo test InternalFrameDemoTest
Fri, 26 Oct 2018 13:52:08 +0530 sveerabhadra 8211443: Enable different look and feels in SwingSet3 demo test SplitPaneDemoTest
Thu, 25 Oct 2018 13:09:58 +0530 psadhukhan 8212735: Compilation issue with javax.swing.InputVerifier example in javadoc section
Thu, 25 Oct 2018 13:07:42 +0530 psadhukhan 8192888: AllSwingComponentsBaselineTest fails with NullPointerException for NimbusLookAndFeel