log

age author description
Tue, 07 Jul 2020 11:38:05 -0700 kvn 8248570: Incorrect copyright header in TestUnsafeUnalignedSwap.java
Thu, 02 Jul 2020 11:38:00 -0700 iignatyev 8208243: vmTestbase/gc/lock/jni/jnilock002/TestDescription.java fails in jdk/hs nightly
Tue, 07 Jul 2020 16:55:29 +0000 valeriep 8248505: Unexpected NoSuchAlgorithmException when using secure random impl from BCFIPS provider
Tue, 07 Jul 2020 17:52:55 +0200 mgronlun 8248794: Transition JFR Periodic Task Thread to "_thread_in_native" before invoking performance counters
Sun, 28 Jun 2020 16:47:25 +0800 fyang 8248219: aarch64: missing memory barrier in fast_storefield and fast_accessfield
Tue, 07 Jul 2020 16:20:30 +0200 mgronlun 8241803: JFR TestThreadStartEndEvents.java failed due to "RuntimeException: Wrong thread id"
Tue, 07 Jul 2020 13:07:53 -0700 cjplummer 8248194: Need better support for running SA tests on core files
Tue, 07 Jul 2020 10:27:47 -0700 dtitov 8205467: javax/management/remote/mandatory/connection/MultiThreadDeadLockTest.java possible deadlock
Tue, 07 Jul 2020 10:18:53 -0700 dtitov 8227337: javax/management/remote/mandatory/connection/ReconnectTest.java NoSuchObjectException no such object in table
Tue, 07 Jul 2020 13:00:46 +0200 chagedorn 8248226: TestCloneAccessStressGCM fails with -XX:-ReduceBulkZeroing
Tue, 07 Jul 2020 06:20:03 -0400 bulasevich 8248568: compiler/c2/TestBit.java failed: test missing from stdout/stderr
Tue, 07 Jul 2020 11:35:14 +0200 kdnilsen 8232782: Shenandoah: streamline post-LRB CAS barrier (aarch64)
Tue, 21 Apr 2020 10:35:53 +0200 phedlin 8245021: Adding method 'remove_if_existing' to growableArray.
Mon, 06 Jul 2020 23:11:37 -0700 iklam 8248170: Excessive include of compiledMethod, codeCache, javaClasses and systemDictionary
Tue, 07 Jul 2020 03:12:11 +0200 jwilhelm Merge
Tue, 07 Jul 2020 00:09:29 +0000 joehw 8248348: Regression caused by the update to BCEL 6.0
Fri, 03 Jul 2020 07:49:00 -0400 herrick 8248501: [macos] App created with jpackage on Mac fails with error -10810
Tue, 07 Jul 2020 06:06:18 +0800 jjiang 8242538: java/security/SecureRandom/ThreadSafe.java failed on windows
Sat, 04 Jul 2020 01:06:07 -0700 kvn 8247527: serviceability/dcmd/gc/HeapDumpCompressedTest.java fails with Graal + ZGC
Sat, 04 Jul 2020 08:18:17 +0800 fyang 8243670: Unexpected test result caused by C2 MergeMemNode::Ideal
Fri, 03 Jul 2020 10:02:37 -0700 cjplummer 8248746: Undo jhsdb related exclusiveAccess.dirs changes that were done for JDK-8220295
Mon, 06 Jul 2020 17:52:52 -0700 iklam 8248886: InstanceKlass::initialize_impl crashes with -XX:-UsePerfData after JDK-8246019
Mon, 06 Jul 2020 16:08:00 -0700 tnakamura 8233829: javac cannot find non-ASCII module name under non-UTF8 environment
Mon, 06 Jul 2020 15:14:44 -0700 iklam 8246019: PerfClassTraceTime slows down VM start-up
Mon, 06 Jul 2020 04:44:25 -0400 bulasevich 8248043: Need to eliminate excessive i2l conversions
Mon, 06 Jul 2020 09:16:58 +0200 chagedorn 8248596: [TESTBUG] compiler/loopopts/PartialPeelingUnswitch.java times out with Graal enabled
Sun, 28 Jun 2020 16:47:25 +0800 fyang 8248219: aarch64: missing memory barrier in fast_storefield and fast_accessfield
Fri, 03 Jul 2020 19:05:00 +0200 jwilhelm Merge
Fri, 03 Jul 2020 16:50:16 +0100 dfuchs 8248703: Clarify the behavior of java.net.NetworkInterface::equals
Fri, 03 Jul 2020 17:36:56 +0200 rkennke 8248799: Shenandoah: Claim threads token in constructor of ShenandoahRootVerifier
Fri, 03 Jul 2020 16:32:33 +0200 tschatzl 8248306: gc/stress/gclocker/TestExcessGCLockerCollections.java does not compile
Fri, 03 Jul 2020 11:09:59 +0200 rkennke 8248725: Shenandoah: Claim verifier thread roots for parallel processing
Fri, 03 Jul 2020 10:05:53 +0200 neliasso 8248388: ZGC: Load barrier incorrectly elided in jdk/java/text/Format/DateFormat/SDFTCKZoneNamesTest.java
Fri, 03 Jul 2020 16:32:33 +0200 tschatzl 8248306: gc/stress/gclocker/TestExcessGCLockerCollections.java does not compile
Fri, 03 Jul 2020 18:58:03 +0530 psadhukhan Merge
Fri, 03 Jul 2020 09:26:16 +0530 psadhukhan Merge
Thu, 02 Jul 2020 09:31:42 +0530 psadhukhan 8244324: RTFEditorKit does not display some of Japanese characters correctly
Thu, 02 Jul 2020 09:29:42 +0530 psadhukhan 8245921: Minor copy/paste issue in BasicScrollBarUI
Thu, 02 Jul 2020 09:27:58 +0530 psadhukhan 8248187: javax/swing/plaf/basic/BasicGraphicsUtils/8132119/bug8132119.java fails with String is not properly drawn
Wed, 01 Jul 2020 09:14:59 +0530 pbansal 8197560: test javax/swing/JTree/8003400/Test8003400.java fails
Wed, 24 Jun 2020 20:32:32 -0700 serb 8036604: Typo in BufferedBufImgOps.java in the exception message
Wed, 24 Jun 2020 15:35:43 -0700 serb 8213535: Windows HiDPI html lightweight tooltips are truncated
Mon, 22 Jun 2020 15:55:57 -0700 prr Merge
Mon, 22 Jun 2020 12:39:59 +0530 pbansal 8198623: java/awt/KeyboardFocusmanager/TypeAhead/EnqueueWithDialogButtonTest/EnqueueWithDialogButtonTest.java fails on mac
Mon, 22 Jun 2020 06:48:26 +0100 serb 7131400: [macosx] Desktop.edit(a directory) should throw IOException
Fri, 03 Jul 2020 11:46:41 +0200 neliasso 8248398: Add diagnostic RepeatCompilation utility
Fri, 03 Jul 2020 10:19:54 +0100 pconcannon 8245302: Upgrade LogRecord to support long thread ids and remove its usage of ThreadLocal
Mon, 29 Jun 2020 09:59:45 +0200 mbaesken 8248468: java/awt/font/DefaultFontTest/DefaultFontTest.java fails in SunFontManager.findFont2D
Thu, 02 Jul 2020 17:19:16 -0700 cjplummer 8244383: jhsdb/HeapDumpTestWithActiveProcess.java fails with "AssertionFailure: illegal bci"
Fri, 03 Jul 2020 00:09:45 +0000 joehw 8248348: Regression caused by the update to BCEL 6.0
Fri, 03 Jul 2020 00:14:21 +0200 jwilhelm Merge
Thu, 02 Jul 2020 21:13:41 +0200 mgronlun 8237488: jdk/jfr/event/compiler/TestCompilerCompile.java failed due to "RuntimeException: No thread in event"
Thu, 02 Jul 2020 10:21:21 -0700 jjg 8248060: small HTML issues in java.xml package-info.java files
Thu, 02 Jul 2020 08:05:00 -0700 iignatyev 8208207: Test nsk/stress/jni/gclocker/gcl001 fails after co-location
Mon, 18 May 2020 18:20:53 +0200 jlahoda 8244763: Update --release 8 symbol information after JSR 337 MR3
Thu, 02 Jul 2020 13:13:10 -0700 cjplummer 8247533: SA stack walking sometimes fails with sun.jvm.hotspot.debugger.DebuggerException: get_thread_regs failed for a lwp
Thu, 02 Jul 2020 13:03:32 -0700 dlong 8247922: Update Graal
Thu, 02 Jul 2020 12:52:49 -0700 kvn 8076985: Allocation path: biased locking + compressed oops code quality
Thu, 02 Jul 2020 11:06:16 -0700 jjg 8248417: some jdk/javadoc/doclet tests fail (JDK 16)
Thu, 02 Jul 2020 20:33:06 +0300 vkempik 8248495: [macos] zerovm is broken due to libffi headers location
Thu, 02 Jul 2020 18:39:35 +0200 jwilhelm Added tag jdk-16+4 for changeset e2622818f0bd
Thu, 02 Jul 2020 18:02:20 +0200 dnsimon 8248321: [JVMCI] improve libgraal logging and fatal error handling
Thu, 02 Jul 2020 17:35:03 +0200 ihse 8248667: Need support for building native libraries located in the test/lib directory
Thu, 02 Jul 2020 08:17:31 +0000 coffeys 8218021: Have jarsigner preserve posix permission attributes
Thu, 02 Jul 2020 09:40:27 +0200 tschatzl 8248650: [BACKOUT] Backout JDK-8244603 because it generates too much noise in CI
Thu, 02 Jul 2020 08:32:45 +0200 shade 8248634: Shenandoah: incorrect include in shenandoahInitLogger.cpp
Thu, 02 Jul 2020 08:32:39 +0200 shade 8248632: Shenandoah: build fails without both JVMTI and JFR
Thu, 02 Jul 2020 03:25:23 +0200 jwilhelm Merge
Thu, 02 Jul 2020 03:15:27 +0200 jwilhelm Added tag jdk-15+30 for changeset 6909e4a1f25b
Thu, 02 Jul 2020 03:19:33 +0200 jwilhelm Added tag jdk-16+4 for changeset 78c07dd72404
Wed, 01 Jul 2020 10:27:10 +0800 jiefu 8248612: Back quotes and double quotes must not be escaped in: Cannot convert \"$unix_path\" to Windows path
Wed, 01 Jul 2020 15:37:56 -0700 kvn 8005088: remove unused NativeInstruction::test methods
Wed, 01 Jul 2020 21:05:14 +0000 ccheung 8243586: Optimize calls to SystemDictionaryShared::define_shared_package for classpath
Wed, 01 Jul 2020 22:39:58 +0200 ihse 8248610: Clean up handling of Windows RC files
Wed, 01 Jul 2020 13:12:11 -0700 darcy 8247534: Update --release 15 symbol information for JDK 15 build 29
Wed, 01 Jul 2020 21:14:55 +0200 jwilhelm Merge
Wed, 01 Jul 2020 14:52:09 -0400 almatvee 8248059: [macos] EmptyFolderPackageTest.java failed "hdiutil: create failed - No child processes"jdk-15+30
Wed, 01 Jul 2020 09:18:28 +0200 chagedorn 8244724: CTW: C2 compilation fails with "Live Node limit exceeded limit"
Wed, 01 Jul 2020 12:06:44 +0200 dnsimon 8248359: Update JVMCI
Wed, 01 Jul 2020 18:42:13 +0000 hseigel 8247741: Test test/hotspot/jtreg/runtime/7162488/TestUnrecognizedVmOption.java fails when -XX:+IgnoreUnrecognizedVMOptions is set
Wed, 01 Jul 2020 09:18:28 +0200 chagedorn 8244724: CTW: C2 compilation fails with "Live Node limit exceeded limit"jdk-16+4
Wed, 01 Jul 2020 01:56:52 +0200 ihse 8248563: Gtest CFLAGS/warnings is not properly handled
Wed, 01 Jul 2020 07:23:48 +0900 ysuenaga 8248526: configure script failed on WSL in May 2020 update
Tue, 30 Jun 2020 20:59:15 +0200 jwilhelm Merge
Tue, 30 Jun 2020 11:36:02 -0700 jjg 8248409: some jdk/javadoc/doclet tests fail (JDK 15)
Tue, 30 Jun 2020 15:24:01 -0400 dcubed 8246493: JDI stress/serial/mixed002 needs to use WhiteBox.deflateIdleMonitors support
Tue, 30 Jun 2020 20:09:03 +0200 jwilhelm Merge
Tue, 30 Jun 2020 18:52:59 +0100 dfuchs 8246114: java/net/MulticastSocket/Promiscuous.java fails after 8241072 (multi-homed systems)
Tue, 30 Jun 2020 19:00:14 +0200 mgronlun 8248485: Poor scalability in JfrCheckpointManager when using many threads after JDK-8242008
Tue, 30 Jun 2020 18:10:44 +0200 mgronlun 8248475: Suppress unconditional warning "JFR will be disabled during CDS dumping"
Thu, 18 Jun 2020 13:51:40 +0200 roland 8247824: CTW: C2 (Shenandoah) compilation fails with SEGV in SBC2Support::pin_and_expand
Tue, 30 Jun 2020 15:08:40 +0200 thartmann 8248265: compiler/ciReplay tests fail with AOT compiled java.base
Mon, 29 Jun 2020 10:15:45 -0400 aph 8246051: SIGBUS by unaligned Unsafe compare_and_swap
Mon, 29 Jun 2020 14:22:01 -0700 cjplummer 7107012: sun.jvm.hostspot.code.CompressedReadStream readDouble() conversion to long mishandled
Mon, 29 Jun 2020 19:33:35 +0200 phedlin 8234605: C2 failed "assert(C->live_nodes() - live_at_begin <= 2 * _nodes_required) failed: Bad node estimate: actual = 208 >> request = 101"
Mon, 29 Jun 2020 10:52:24 -0400 asemenyuk 8248264: WinUpgradeUUIDTest application is missing in downgrade scenario
Mon, 29 Jun 2020 10:52:24 -0400 asemenyuk 8248254: jpackage fails if app module is in external runtime
Mon, 29 Jun 2020 10:51:39 -0400 asemenyuk 8248427: jpackage jtreg BasicTest.testTemp() test fails on Windows
Mon, 29 Jun 2020 15:25:16 +0000 bobv 8236647: Correct Fix for 8236647: java/lang/invoke/CallSiteTest.java failed with InvocationTargetException in Graal mode
Mon, 29 Jun 2020 08:18:23 +0200 thartmann 8247832: [Graal] Many Javafuzzer tests failures with Graal, due to unexpected results, after last update JDK-8243380
Tue, 30 Jun 2020 19:20:22 +0200 stefank 8248048: ZGC: AArch64: SIGILL in load barrier register spilling
Tue, 30 Jun 2020 12:41:27 -0400 kbarrett 8248545: Remove unneeded warning suppression of MSVC++ 4521/4522
Tue, 30 Jun 2020 16:26:24 +0200 ihse 8248548: Use DISABLED_WARNINGS for globally disabled warnings on Visual Studio in Hotspot
Tue, 30 Jun 2020 16:23:34 +0200 ihse 8248547: Use SetupJdkLibrary for hotspot libraries
Fri, 26 Jun 2020 15:47:16 +0200 phedlin 8234605: C2 failed "assert(C->live_nodes() - live_at_begin <= 2 * _nodes_required) failed: Bad node estimate: actual = 208 >> request = 101"
Mon, 29 Jun 2020 15:03:36 -0700 jjg 8248492: ProblemList open/test/langtools//jdk/javadoc/doclet/testHeadTag/TestHeadTag.java
Mon, 29 Jun 2020 23:17:50 +0200 stefank 8248346: Move OopStorage mutex setup out from OopStorageSet
Mon, 29 Jun 2020 13:39:35 -0700 phh 8245129: Enhance jstat gc option output and tests
Mon, 29 Jun 2020 17:25:44 +0000 bobv 8248410: Correct Fix for 8236647: java/lang/invoke/CallSiteTest.java failed with InvocationTargetException in Graal mode
Mon, 29 Jun 2020 18:39:40 +0200 ihse 8248488: JDK-8246484 actually broke COMPARE_BUILD
Mon, 29 Jun 2020 10:15:45 -0400 aph 8246051: SIGBUS by unaligned Unsafe compare_and_swap
Mon, 29 Jun 2020 17:14:19 +0200 chagedorn 8247218: Add default constructor to VectorSet to use Thread::current()->resource_area() as arena by default
Mon, 29 Jun 2020 10:14:18 -0400 zgu 8248227: Shenandoah: Refactor Shenandoah::heap() to match other GCs
Mon, 29 Jun 2020 14:49:03 +0100 pconcannon 8245245: Websocket can lose the URL encoding of URI query parameters
Mon, 29 Jun 2020 12:28:55 +0000 hseigel 8248273: Small clean up for PerfClassTraceTime
Mon, 29 Jun 2020 07:26:10 -0400 bulasevich 8247408: IdealGraph bit check expression canonicalization
Mon, 29 Jun 2020 08:21:42 +0200 thartmann 8248234: Disabling UseExactTypes crashes C2
Mon, 29 Jun 2020 07:16:53 +0200 shade 8247845: Shenandoah: refactor TLAB/GCLAB retirement code
Mon, 29 Jun 2020 13:35:45 +0900 ysuenaga 8248379: Handshake closures for JVMTI monitor functions lack of some validations
Mon, 29 Jun 2020 04:38:30 +0200 jwilhelm Merge