log

age author description
Mon, 27 Jan 2014 10:57:52 +0100 sla 8032662: test/compiler/ciReplay/TestSA.sh should report ulimit issues
Mon, 27 Jan 2014 13:46:54 +0400 dsamersoff 8032247: SA: Constantpool lookup for invokedynamic is not implemented
Fri, 24 Jan 2014 08:31:06 -0500 hseigel Merge
Fri, 24 Jan 2014 08:13:42 -0500 hseigel 8028553: The JVM should not throw VerifyError when 'overriding' a static final method in a superclass.
Fri, 24 Jan 2014 09:28:47 +0100 dsimms 8028280: ParkEvent leak when running modified runThese which only loads classes
Thu, 23 Jan 2014 16:02:14 -0500 gdub 8031427: AllocObject and Unsafe.allocateInstance segfault for primitive types
Thu, 23 Jan 2014 09:45:38 -0800 minqi Merge
Thu, 23 Jan 2014 09:40:32 -0800 minqi 6651256: jstack: DeleteGlobalRef method call doesn't lead to descreasing of global refs count shown by jstack
Thu, 23 Jan 2014 09:33:50 +0000 kevinw 8032466: serviceability/sa/jmap-hashcode/Test8028623.java fails with compilation errors
Thu, 23 Jan 2014 09:06:21 +0100 sla 8031968: Mac OS X: VM starts the agent by calling both Agent_OnAttach and Agent_OnAttach_L functions if its agent library is dynamically linked.
Thu, 23 Jan 2014 08:12:12 +0100 sla 8032250: Add trace event for VM flag changes
Mon, 20 Jan 2014 09:56:47 +0000 kevinw Merge
Fri, 17 Jan 2014 18:39:22 +0000 kevinw 8028623: SA: hash codes in SymbolTable mismatching java_lang_String::hash_code for extended characters.
Sun, 19 Jan 2014 20:23:46 -0500 hseigel Merge
Fri, 17 Jan 2014 11:21:29 -0500 coleenp 8032024: Test not added for bug 8025937: assert(existing_f1 == NULL || existing_f1 == f1) failed: illegal field,change
Fri, 17 Jan 2014 09:47:17 -0500 hseigel Merge
Fri, 17 Jan 2014 09:39:51 -0500 hseigel 8031045: Access checks should precede additional per-instruction checks
Thu, 16 Jan 2014 20:14:21 +0100 sla 8030812: Change the solaris DTrace implementation to use USDT2 instead of USDT1
Fri, 17 Jan 2014 02:13:40 -0800 sspitsyn 8030027: nsk/jvmti/scenarios/hotswap/HS101/hs101t006 Crashed the vm on Linux-amd64: SIGSEGV in JavaThread::last_java_vframe(RegisterMap*)+0xfa
Thu, 16 Jan 2014 10:51:16 -0800 ccheung 8027314: Java should recognize Diagnostic options if -XX:+UnlockDiagnosticVMOptions is not specified and print an informative message
Wed, 15 Jan 2014 19:12:45 -0500 mseledtsov 8031151: Add basic CDS tests
Wed, 15 Jan 2014 11:46:19 +0100 dsimms 6945460: [TESTBUG] runtime/6929067/Test6929067.sh
Fri, 24 Jan 2014 09:04:24 -0800 kvn Merge
Thu, 23 Jan 2014 01:23:23 +0400 vlivanov 8031695: CHA ignores default methods during analysis leading to incorrect code generation
Tue, 21 Jan 2014 20:05:28 -0800 iveresov 8031743: C2: loadI2L_immI broken for negative memory values
Fri, 17 Jan 2014 18:09:08 -0800 iveresov 8032207: C2: assert(VerifyOops || MachNode::size(ra_) <= (3+1)*4) failed: bad fixed size
Tue, 28 Jan 2014 11:21:43 -0800 lana Merge
Thu, 23 Jan 2014 10:35:38 -0800 amurillo Merge
Fri, 17 Jan 2014 10:43:43 -0800 morris Merge
Thu, 16 Jan 2014 16:18:34 -0800 twisti 8022395: java.util.zip.ZipException: Not in GZIP format in JT_JDK/test/java/util/zip/GZIP tests
Tue, 14 Jan 2014 21:33:33 -0800 anoll Merge
Wed, 15 Jan 2014 06:16:55 +0100 anoll 7194669: CodeCache::mark_for_deoptimization should avoid verifying dependencies multiple times
Tue, 14 Jan 2014 17:46:48 -0800 kvn 8002074: Support for AES on SPARC
Tue, 14 Jan 2014 14:51:47 +0100 roland 8026253: New type profiling points: sparc support
Tue, 14 Jan 2014 12:44:12 +0100 roland 8030662: "assert(counter_changed) failed: failed dependencies, but counter didn't change" still fails
Tue, 14 Jan 2014 09:44:45 +0100 roland 8028764: dtrace/hotspot_jni/ALL/ALL001 crashes the vm on Solaris-amd64, SIGSEGV in MarkSweep::follow_stack()+0x8a
Mon, 13 Jan 2014 16:16:25 -0800 roland 8029464: assert(ft == ttkp->cast_to_ptr_type(jtkp->ptr()) || ft->isa_narrowoop()
Fri, 17 Jan 2014 09:40:04 +0100 ehelin Merge
Thu, 16 Jan 2014 17:22:35 +0100 ehelin 8031779: Assert in MetaspaceGC is always true
Tue, 14 Jan 2014 14:26:43 +0100 ehelin Merge
Fri, 10 Jan 2014 09:54:25 +0100 pliden 8029162: G1: Shared SATB queue never enabled
Fri, 10 Jan 2014 09:53:53 +0100 pliden 8029255: G1: Reference processing should not enqueue references on the shared SATB queue
Tue, 14 Jan 2014 22:13:21 +0000 dsamersoff Merge
Wed, 15 Jan 2014 02:02:47 +0400 dsamersoff 8030941: Darwin mapfile-vers doesnt work for other BSDs
Tue, 14 Jan 2014 16:27:35 -0500 hseigel 8031059: invokestatic: ICCE trying to invoke static method when it clashes with an abstract method inherited from an interface
Tue, 14 Jan 2014 13:51:47 -0500 hseigel 8028398: [TESTBUG]: test/runtime/memory/ReadFromNoaccessArea.java failed with EXCEPTION_ACCESS_VIOLATION
Mon, 13 Jan 2014 10:05:37 -0500 zgu 8031530: [TESTBUG] Enable test runtime/LoadClass/LoadClassNegative.java
Tue, 14 Jan 2014 15:27:01 +0100 farvidsson 8031304: Add dcmd to print all loaded dynamic libraries.
Mon, 13 Jan 2014 18:30:57 -0500 hseigel Merge
Thu, 09 Jan 2014 15:48:00 -0800 ccheung 8022301: [TESTBUG] runtime/jsig/Test8017498.sh incorrectly compiles native code
Thu, 09 Jan 2014 14:06:53 -0500 zgu 7012961: runtime/jni/WindowsExceptionFilter/WindowsExceptionFilter01 crashes on windows-amd64
Wed, 08 Jan 2014 13:20:33 +0100 sla 8030184: Remove unneeded "content_type" declarations from tracetypes.xml
Wed, 08 Jan 2014 08:34:02 +0100 sla 8031376: TraceClassLoading expects there to be a (Java) caller when you load a class with the bootstrap class loader
Tue, 21 Jan 2014 20:07:14 -0800 henryjen 8028407: adjust-mflags.sh failed build with GNU Make 4.0 with -I<path contains j>
Thu, 06 Feb 2014 13:08:44 -0800 katleman Added tag jdk9-b02 for changeset b188446de75b
Fri, 21 Feb 2014 19:45:27 +0000 alanb XSL tests failing due to generated classes not being able to access supertypes
Fri, 21 Feb 2014 15:50:17 +0000 alanb Replace setPackageAccess with simple support for modules in the VM.
Fri, 31 Jan 2014 22:48:59 -0800 mchung Merge
Mon, 27 Jan 2014 21:00:29 -0800 lana Mergejdk9-b02
Thu, 05 Dec 2013 00:36:42 -0800 jrose 8029507: Enhance JVM method processing
Thu, 05 Sep 2013 10:29:00 -0400 coleenp 8021266: Better life cycle for objects
Fri, 10 Jan 2014 12:54:08 -0800 morris Merge
Fri, 10 Jan 2014 06:36:18 +0100 anoll 8022494: Make compilation IDs sequential
Thu, 09 Jan 2014 18:09:59 -0800 twisti 8026413: ScopeDesc::is_equal is declared in header file but not implemented
Thu, 09 Jan 2014 19:03:36 +0400 iignatyev 8031115: intrinsics for Math.decrementExact(J) and incrementExact(J) don't work
Thu, 09 Jan 2014 10:47:40 +0100 adlertz 8011391: C1: assert(code_offset() - offset == NativeInstruction::nop_instruction_size) failed: only one instruction can go in a delay slot
Wed, 08 Jan 2014 10:25:50 -0800 kvn 8028468: Add inlining information into ciReplay
Wed, 08 Jan 2014 12:05:19 +0100 adlertz 8029446: assert(_cfg.get_block_for_node(proj) == borig) failed: incorrect block for kill projections
Wed, 08 Jan 2014 09:49:31 +0100 roland 8029873: compiler/uncommontrap/TestStackBangRbp.java crashes with SIGSEGV
Tue, 07 Jan 2014 14:26:12 -0800 twisti 8022263: use same Clang warnings on BSD as on Linux
Tue, 07 Jan 2014 16:02:10 +0100 roland 8027571: fatal error: meet not symmetric
Tue, 07 Jan 2014 14:36:34 +0100 roland 8028064: tiered may collect wrong receiver type at virtual call
Tue, 07 Jan 2014 12:38:22 +0100 roland 8028536: Test cases to cover type system fixes pushed with 8024070
Mon, 06 Jan 2014 17:23:07 -0800 twisti 8029305: add type tag to AbstractCompiler
Mon, 06 Jan 2014 15:35:20 -0800 twisti 8031199: _MSC_VER is only defined on _WIN32
Tue, 24 Dec 2013 11:48:39 -0800 mikael 8029233: Update copyright year to match last edit in jdk8 hotspot repository for 2013
Thu, 19 Dec 2013 20:28:45 +0000 coleenp 8030633: nsk/jvmti/RedefineClasses/StressRedefine failed invalid method ordering length on Solaris
Mon, 16 Dec 2013 08:24:33 -0500 hseigel 8027804: JCK resolveMethod test fails expecting AbstractMethodError
Fri, 13 Dec 2013 09:25:44 +0100 roland 8029383: assert(counter_changed) failed: failed dependencies, but counter didn't change
Thu, 12 Dec 2013 15:11:35 -0500 drchase 8029351: assert(bt != T_OBJECT) failed: Guard is incorrect in VM:defmeth
Fri, 13 Dec 2013 00:34:09 +0400 iignatyev 8026941: [TESTBUG] java.lang.ClassNotFoundException: java.lang.invoke.InvokeGeneric
Thu, 12 Dec 2013 11:25:32 -0800 iveresov 8029668: Kithcensink crashed with guarantee(Assembler::is_simm13(disp)) failed: Do not match large constant offsets
Wed, 11 Dec 2013 13:51:28 -0500 jprovino 8029566: PPC: OrderAccess::load_acquire(julong) is broken
Wed, 11 Dec 2013 01:09:04 +0400 iignatyev 8029153: [TESTBUG] test/compiler/7141637/SpreadNullArg.java fails because it expects NullPointerException
Wed, 11 Dec 2013 01:04:34 +0400 iignatyev 8028122: [TESTBUG] compiler/regalloc/C1ObjectSpillInLogicOp.java
Fri, 06 Dec 2013 16:43:56 -0800 twisti 8029366: ShouldNotReachHere error when creating an array with component type of void
Fri, 06 Dec 2013 12:11:51 -0800 kvn 8028107: Kitchensink crashed with EAV
Mon, 09 Dec 2013 10:03:39 +0100 stefank 8029106: JVM crashes in Metachunk::Metachunk during parallel class redefinition (PrivateMLetController, anonymous-simple_copy_1)
Tue, 10 Dec 2013 10:31:00 +0100 sjohanss 8028993: Full collections with ParallelScavenge slower in JDK 8 compared to 7u40
Mon, 09 Dec 2013 08:20:45 +0100 ehelin 8029326: G1 does not check if threads gets created
Tue, 10 Dec 2013 16:18:26 -0500 hseigel 8028741: Interface Method Resolution should skip static and non-public methods in j.l.Object
Fri, 06 Dec 2013 11:33:10 -0500 hseigel 8029415: java/lang/reflect/Method/invoke/TestPrivateInterfaceMethodReflect.java fails on all platforms with hs25-b61
Thu, 05 Dec 2013 12:35:38 +0100 mgronlun 8028412: AsyncGetCallTrace() is broken on x86 in JDK 7u40
Wed, 04 Dec 2013 14:43:50 +0100 sla 8029395: SA: jstack throws WrongTypeException
Wed, 04 Dec 2013 08:10:31 -0500 hseigel 8027458: VM anonymous classes: wrong context for protected access checks
Tue, 31 Dec 2013 19:26:57 +0400 iignatyev 8028587: New tests development for intrisics for basic operators - add, neg, inc, dec, sub, mul
Thu, 26 Dec 2013 21:00:23 -0800 iveresov 8027388: JVM crashes with SIGSEGV (0xb) at pc=0x00000001077cbbf6
Fri, 20 Dec 2013 10:31:14 +0100 anoll 8028052: compiler/startup/SmallCodeCacheStartup.java fails there is no 'no space to run compiler' in the output
Fri, 20 Dec 2013 10:29:44 +0100 anoll 8030783: Provide regression test for 8026478: -XX:+VerifyAdapterSharing is broken
Thu, 19 Dec 2013 14:08:02 +0100 anoll 8025277: Add -XX: flag to print code cache sweeper statistics
Thu, 19 Dec 2013 06:09:16 +0100 anoll 8026478: -XX:+VerifyAdapterSharing is broken
Tue, 17 Dec 2013 08:31:06 +0100 anoll 8029091: Bug in calculation of code cache sweeping interval
Thu, 09 Jan 2014 16:53:51 +0100 ehelin Merge
Tue, 07 Jan 2014 16:15:35 +0100 ehelin Merge
Tue, 07 Jan 2014 13:31:33 +0100 tschatzl 8027364: PSScavenge accounts too large code section to StringTable unlink
Mon, 16 Dec 2013 13:43:06 +0100 brutisso 8027440: DefNew does not log heap change information when a promotion failure occurs
Mon, 16 Dec 2013 08:54:14 +0100 brutisso 8029524: Remove unsused method CollectedHeap::unsafe_max_alloc()
Wed, 08 Jan 2014 13:53:24 -0800 dcubed Merge
Tue, 07 Jan 2014 13:26:56 -0500 coleenp 8029178: Parallel class loading test anonymous-simple gets SIGSEGV in Metaspace::contains
Tue, 07 Jan 2014 12:32:57 +0100 sla 8031305: (hotspot) com.sun.management.VMOption is missing the ATTACH_ON_DEMAND origin
Tue, 07 Jan 2014 10:50:28 +0100 sla 4990369: visibleMethods() and methodsByName() return wrong visible methods
Mon, 06 Jan 2014 08:44:24 -0500 hseigel 8030955: assert(_prologue != NULL) failed: prologue pointer must be initialized
Tue, 31 Dec 2013 08:58:08 -0500 zgu 6730115: Fastdebug VM crashes with "ExceptionMark destructor expects no pending exceptions" error
Mon, 23 Dec 2013 18:44:59 -0500 hseigel 8023735: [TESTBUG] runtime/XCheckJniJsig/XCheckJSig.java fails on MacOS X
Mon, 23 Dec 2013 18:39:47 +0000 iignatyev Merge
Mon, 23 Dec 2013 20:56:18 +0400 iignatyev 8029070: memory leak in jmm_SetVMGlobal
Mon, 23 Dec 2013 10:13:42 -0500 hseigel 8021774: [TESTBUG] Tests failed because of a warning in its output
Wed, 18 Dec 2013 23:09:57 +0400 dsamersoff 6969276: minor memory leak detected by cppcheck in agent/src/os/linux/symtab.c
Wed, 18 Dec 2013 20:32:46 +0400 dsamersoff 8028408: unused-value warning on forte.cpp when build on Mac
Wed, 18 Dec 2013 08:39:06 +0100 sla 8029726: On OS X some dtrace probe names are mismatched with Solaris