log

age author description
Thu, 18 Jul 2019 08:53:06 +0800 weijun 8217375: jarsigner breaks old signature with long lines in manifest
Wed, 17 Jul 2019 12:26:56 -0300 mbalao 8227437: S4U2proxy cannot continue because server's TGT cannot be found
Wed, 17 Jul 2019 16:13:26 -0700 rhalade 8048595: problemList failing/ignored manual tests in security-libs
Wed, 17 Jul 2019 14:37:50 -0700 ascarpino 8226338: Updates to Stateless Resumption
Wed, 17 Jul 2019 13:41:12 -0700 mikael Added tag jdk-13+30 for changeset 2e63fb0a885f
Wed, 17 Jul 2019 12:31:21 -0700 ascarpino 8227551: Session Resumption without Server-Side State off by default
Wed, 17 Jul 2019 08:34:45 -0700 ccheung 8227646: [TESTBUG] appcds/SharedArchiveConsistency timed outjdk-13+30
Fri, 19 Jul 2019 11:09:41 +0200 mbaesken 8228426: xlc: switch to clang-style warning disabling
Mon, 22 Jul 2019 10:15:46 +0200 mbaesken 8228468: awt_Robot.c : format string contains 0 within the string body
Tue, 23 Jul 2019 00:29:31 -0400 dholmes 8225782: Remove expired flags in JDK 14
Thu, 11 Jul 2019 03:28:43 +0530 rpatil 8154520: java.time: appendLocalizedOffset() should return the localized "GMT" string
Mon, 22 Jul 2019 16:10:25 -0700 jjg 8222791: Order of evaluation of -link params in Javadoc tool reversed -> regression with split packages
Sat, 13 Jul 2019 12:15:17 -0400 zgu 8227866: Shenandoah: Split weak root processing and class unloading in parallel cleaning task
Mon, 22 Jul 2019 10:26:21 -0700 amenkov 8227693: HTML error in jdwp-protocol.html
Mon, 22 Jul 2019 14:40:00 +0200 rschmelter 8227868: jinfo and jstack can fail converting UTF8 output to strings
Mon, 22 Jul 2019 10:48:14 +0200 sgehwolf 8228434: jdk/net/Sockets/Test.java fails after JDK-8227642
Mon, 22 Jul 2019 12:21:18 +0200 jlahoda 8227923: End position of EndElementTree is -1
Mon, 22 Jul 2019 14:31:04 +0800 jiefu 8225648: [TESTBUG] java/lang/annotation/loaderLeak/Main.java fails with -Xcomp
Wed, 17 Jul 2019 15:40:27 +0200 mbaesken 8227869: fix wrong format specifiers in os_aix.cpp
Tue, 16 Jul 2019 16:01:10 +0200 mbaesken 8227737: avoid implicit-function-declaration on AIX
Fri, 19 Jul 2019 16:47:11 -0400 kbarrett 8162929: Enqueuing dirty cards into a single DCQS during GC does not scale
Fri, 19 Jul 2019 12:39:31 -0400 tonyp 8227179: Test for new gc+metaspace=info output format
Fri, 19 Jul 2019 15:36:23 +0200 redestad 8228394: Cleanup unused java.net SharedSecrets classes
Fri, 19 Jul 2019 16:25:04 +0300 vlivanov 8227260: JNI upcalls should bypass class initialization barrier in c2i adapter
Mon, 08 Jul 2019 17:44:34 +0200 sgehwolf 8227397: Add --with-extra-asflags configure option
Fri, 19 Jul 2019 12:35:33 +0200 mbaesken 8228420: compile error in shenandoahSupport.cpp with clang 9
Fri, 12 Jul 2019 19:37:25 +0200 sgehwolf 8227642: [TESTBUG] Make docker tests podman compatible
Fri, 19 Jul 2019 10:18:48 +0200 mdoerr 8227692: Remove develop feature PrintMallocStatistics
Thu, 18 Jul 2019 14:01:54 +0200 mbaesken 8228368: avoid incompatible pointer to integer conversion initializing gint in gtk2_interface
Tue, 16 Jul 2019 14:42:36 +0200 mbaesken 8227633: avoid comparing this pointers to NULL
Fri, 19 Jul 2019 02:40:59 +0000 joehw 8157830: Errors in XSLT stylesheet are not dispatched correctly to ErrorListener
Thu, 18 Jul 2019 17:10:33 -0700 bpb 8228392: Backout incorrect change done by JDK-8067801
Thu, 18 Jul 2019 14:57:32 -0400 kbarrett 8227653: Add VM Global OopStorage
Wed, 17 Jul 2019 08:33:38 -0400 zgu 8227755: Need more than 2 distinct CodeCache unloading cycles
Thu, 18 Jul 2019 11:54:54 -0400 kbarrett 8227652: SetupOperatorNewDeleteCheck should discuss deleting destructors
Thu, 18 Jul 2019 07:54:21 -0700 bpb 8228338: tools/pack200/TimeStamp.java fails with NullPointerException
Thu, 18 Jul 2019 21:25:41 +0900 ysuenaga 8227815: Minimal VM: set_state is not a member of AttachListener
Thu, 18 Jul 2019 13:16:10 +0200 rkennke 8228364: Shenandoah: Remove unused code from ShenandoahBarrierSetC1
Thu, 18 Jul 2019 07:06:33 -0400 coleenp 8227766: CheckUnhandledOops is broken in MemAllocator
Thu, 18 Jul 2019 10:25:49 +0200 rschmelter 8227435: Perf::attach() should not throw a java.lang.Exception
Wed, 17 Jul 2019 09:58:42 +0200 mbaesken 8227834: build.log output from failing commands : include the hs_error file path in case of crashes in build
Wed, 10 Jul 2019 11:11:30 +0200 mbaesken 8227247: tools/sjavac/IdleShutdown.java fails with AssertionError: Error too big on windows
Wed, 17 Jul 2019 15:12:47 -0700 bpb 8073213: javadoc of PushbackInputStream methods should specify NullPointerExceptions
Wed, 17 Jul 2019 15:12:30 -0700 bpb 8228204: Fix for JDK-8067801 breaks java/io/NegativeInitSize.java
Wed, 17 Jul 2019 14:24:37 -0700 bpb 8067801: Enforce null check for underlying I/O streams
Wed, 17 Jul 2019 14:24:24 -0700 bpb 8131664: Javadoc for PrintStream is now incorrect
Wed, 17 Jul 2019 13:41:38 -0700 mikael Added tag jdk-14+6 for changeset 443f7359b34d
Wed, 17 Jul 2019 11:23:51 -0700 dtitov 8206179: com/sun/management/OperatingSystemMXBean/GetCommittedVirtualMemorySize.java fails with Committed virtual memory size illegal value
Wed, 17 Jul 2019 16:33:19 +0200 tschatzl 8227090: G1 does not account the OptMergeRS in cost per card calculation
Wed, 17 Jul 2019 16:33:19 +0200 tschatzl 8227089: Add timing information for merging humongous remembered sets
Wed, 17 Jul 2019 16:33:19 +0200 tschatzl 8227084: Add timing information for merge heap root preparation
Wed, 17 Jul 2019 16:33:19 +0200 tschatzl 8227671: G1: assert_used_and_recalculate_used_equal performs work in product builds
Wed, 17 Jul 2019 16:33:19 +0200 tschatzl 8226232: Move merge heap roots code out from G1RemSetScanState
Wed, 17 Jul 2019 23:22:48 +0900 ysuenaga 8227738: jvmti/DataDumpRequest/datadumpreq001 failed due to "exit code is 134"
Sat, 13 Jul 2019 12:14:24 -0400 zgu 8227635: Shenandoah: SHBSA::load_at() needs to deal IN_NATIVE load
Wed, 17 Jul 2019 04:33:37 -0700 mikael Merge
Wed, 17 Jul 2019 00:21:02 +0000 henryjen Merge
Thu, 02 May 2019 17:43:26 -0700 jnimeh 8222678: Improve TLS negotiation
Tue, 23 Apr 2019 08:34:51 +0800 weijun 8222751: closed/test/jdk/sun/security/util/DerIndefLenConverter/IndefBerPkcs12.java fail
Thu, 11 Apr 2019 17:58:18 -0700 xuelei 8218873: Improve JSSE endpoint checking
Wed, 10 Apr 2019 14:43:13 -0700 serb 8218876: Improve PNG support options
Wed, 10 Apr 2019 15:49:24 +0100 dfuchs 8221518: Normalize normalization
Wed, 03 Apr 2019 13:35:11 -0700 jnimeh 8221345: Better Poly1305 support
Thu, 28 Mar 2019 14:18:57 -0700 darcy 8212328: Exceptional throw cases
Wed, 27 Mar 2019 00:24:13 -0700 serb 8220517: Enhanced GIF support
Thu, 07 Mar 2019 22:19:12 -0800 jnimeh 8219775: Certificate validation improvements
Wed, 27 Feb 2019 13:58:04 -0800 xuelei 8218863: Better endpoint checks
Thu, 07 Feb 2019 08:47:10 -0500 mullan 8216381: More limited privilege usage
Wed, 30 Jan 2019 14:14:57 +0000 prappo 8213431: Improve file protocol handling
Wed, 30 Jan 2019 10:51:50 +0800 weijun 8217563: Improve realm maintenance
Wed, 23 Jan 2019 14:45:54 -0800 smarks 8213432: Better copies of CopiesList
Tue, 16 Jul 2019 15:15:45 +0100 alitvinov 8227392: Colors with alpha are painted incorrectly on Linux, after JDK-8214579
Tue, 16 Jul 2019 10:48:22 +0200 jlahoda 8227640: javac crashes on text blocks with invalid escapes.
Mon, 15 Jul 2019 16:25:23 -0700 serb 8226653: [accessibility] Can edit text cell correctly, but Accessibility Tool reads nothing about editor
Mon, 15 Jul 2019 09:53:23 -0700 ccheung 8227496: Update NUM_CDS_REGIONS and CURRENT_CDS_ARCHIVE_VERSION in cds.h
Sat, 13 Jul 2019 10:43:45 +0000 plevart 8227368: EnumSet.class serialization broken in JDK 9+
Fri, 12 Jul 2019 21:38:46 +0200 clanger 8227636: Fix output dir for jlink_jre target in Images.gmk
Thu, 04 Jul 2019 11:55:00 +0200 stuefe 8227252: [aix] Disable jdk/java/lang/reflect/exeCallerAccessTest
Fri, 12 Jul 2019 08:40:37 -0700 ccheung 8226406: JVM fails to detect mismatched or corrupt CDS archive
Wed, 17 Jul 2019 12:35:46 +0200 redestad 8227587: Add internal privileged System.loadLibrary
Wed, 17 Jul 2019 11:43:38 +0200 rkennke 8227677: Shenandoah: C2: Make in-native LRB special case of normal LRB
Thu, 01 Aug 2019 16:22:28 -0700 rpressler Mergefibers
Thu, 01 Aug 2019 16:22:03 -0700 rpressler take continuations into consideration in javaVFrame::print_valuecont
Thu, 01 Aug 2019 15:44:36 -0700 cjplummer Mergefibers
Thu, 01 Aug 2019 15:43:34 -0700 cjplummer Fix JavaThread::trace_stack() so it includes frozen frames. This fixes ps() so it does the same.cont
Tue, 30 Jul 2019 15:33:57 -0700 cjplummer Adjust for the fact that yield events are now after the continuation has been frozen, so the continuation frames don't turn up when counting all frames on the stack.fibers
Tue, 30 Jul 2019 15:31:45 -0700 cjplummer Mergefibers
Tue, 30 Jul 2019 15:30:23 -0700 cjplummer Adjust for the fact that yield events are now after the continuation has been frozen, so the continuation frames don't turn up when counting all frames on the stack.cont
Sat, 27 Jul 2019 01:12:53 +0100 rpressler Mergefibers
Sat, 27 Jul 2019 01:11:42 +0100 rpressler fix regressioncont
Fri, 26 Jul 2019 17:26:36 +0100 rpressler Mergefibers
Fri, 26 Jul 2019 17:24:20 +0100 rpressler set anchor in freeze before call to JvmtiExport::post_continuation_yield and undo simplification to deoptimizationcont
Thu, 25 Jul 2019 16:48:04 -0700 cjplummer Need to look for Object.wait0() frame, not Object.wait(). This was suppose to have been pushed a while back with changeset 55911, which covered needed wait0() changes in vmSymbols.hpp.fibers
Wed, 24 Jul 2019 08:27:32 +0100 alanb Mergefibers
Wed, 24 Jul 2019 08:27:16 +0100 alanb Fix build issue on Windowscont
Wed, 24 Jul 2019 08:12:19 +0100 alanb Mergefibers
Tue, 23 Jul 2019 17:28:36 +0100 alanb Mergecont
Tue, 16 Jul 2019 11:10:38 +0200 mbaesken 8227631: Adjust AIX version checkjdk-14+6
Wed, 17 Jul 2019 10:11:05 +0800 njian 8227615: [TESTBUG] JTReg "jdk/sun/security/util/FilePermCompat/CompatImpact.java" fails with graal
Tue, 16 Jul 2019 00:57:00 +0000 pli 8227512: [TESTBUG] Fix JTReg javac test failures with Graal
Tue, 16 Jul 2019 21:12:14 +0000 joehw 8176447: javax.xml.validation.Validator validates incorrectly on uniqueness constraint
Tue, 16 Jul 2019 17:50:54 +0200 redestad 8227720: Improve ExtendedSocketOptions initialization
Tue, 16 Jul 2019 18:05:42 +0300 bulasevich 8227632: Incorrect PrintCompilation message: made not compilable on levels 0 1 2 3 4
Tue, 16 Jul 2019 13:57:13 +0200 rschmelter 8227440: Implement fix to JDK-8224642 on all platforms
Mon, 15 Jul 2019 03:14:28 +0000 njian 8227574: [TESTBUG] JTReg tests fail with Graal due to access denied
Fri, 12 Jul 2019 12:19:58 +0200 mbaesken 8227630: adjust format specifiers in loadlib_aix.cpp
Tue, 16 Jul 2019 07:29:12 +0900 ysuenaga 8225690: Multiple AttachListener threads can be created
Mon, 15 Jul 2019 11:23:05 -0400 zgu 8225483: Shenandoah: Enhance native access barrier
Mon, 15 Jul 2019 10:21:33 +0800 yzhou 8227289: Enable assertions for some shell to java conversion tests after JDK-8218960
Mon, 15 Jul 2019 15:27:06 +0200 rkennke 8227676: Shenandoah: More consistent naming of LRB entry points
Mon, 15 Jul 2019 12:31:35 +0200 rkennke 8227637: Adjust Shenandoah C2 verifier to recognize IN_NATIVE barriers
Mon, 15 Jul 2019 17:53:36 +0800 fyuan 8227438: [TESTLIB] Determine if file exists by Files.exists in function FileUtils.deleteFileIfExistsWithRetry
Sat, 13 Jul 2019 20:55:25 +0900 ysuenaga 8227594: sadebugd/DebugdConnectTest.java fails due to "java.rmi.NotBoundException: SARemoteDebugger"
Fri, 12 Jul 2019 15:15:07 -0700 jjg 8227644: make more build-time variables available to Markdown files
Fri, 12 Jul 2019 11:51:07 -0700 jcm 8227068: [Graal] MappedByteBuffer bulk access memory failures are not handled gracefully
Fri, 12 Jul 2019 10:44:11 -0700 jjg 8227613: "draft" header should be in a <header> instead of <div>
Fri, 12 Jul 2019 10:39:19 -0700 jiangli 8227582: runtime/TLS/testtls.sh fails on x86_32
Fri, 12 Jul 2019 02:50:43 -0700 mikael Merge
Fri, 12 Jul 2019 10:57:27 +0200 clanger 8227578: Wrong JRE targets in Images.gmk after JDK-8219971
Fri, 12 Jul 2019 13:59:22 +0800 fyuan 8227422: sun/net/www/protocol/file/DirPermissionDenied.java failed on Windows 2016 because DirPermissionDenied directory has no read permission
Fri, 12 Jul 2019 09:27:00 +0530 psadhukhan 8225423: GTK L&F: JSplitPane: There is no divider shown
Thu, 11 Jul 2019 20:11:47 +0000 valeriep 8225745: NoSuchAlgorithmException exception for SHA256withECDSA with RSASSA-PSS support
Thu, 11 Jul 2019 12:13:52 -0700 jjg 8227602: Update nroff version of man pages
Thu, 11 Jul 2019 17:11:54 +0200 hannesw 8227391: Update double-conversion to version 3.1.5
Thu, 11 Jul 2019 11:36:56 +0100 aph Merge
Tue, 02 Jul 2019 16:54:52 +0100 aph 8226525: HotSpot compile-time error for x86-32
Wed, 10 Jul 2019 13:14:22 -0700 jjg 8227549: Fix style of links in specs for consistency
Wed, 10 Jul 2019 18:43:45 +0000 valeriep 8181386: CipherSpi ByteBuffer to byte array conversion fails for certain data overlap conditions
Wed, 10 Jul 2019 18:48:05 +0200 neliasso 8226536: Catch OOM from deopt that fails rematerializing objects
Wed, 10 Jul 2019 08:24:31 -0700 mikael Added tag jdk-13+29 for changeset 3081f39a3d30
Thu, 11 Jul 2019 15:58:54 +0000 joehw 8178843: A bug in an inner loop in MethodGenerator's getLocals method
Thu, 11 Jul 2019 16:43:15 +0200 hannesw 8223451: Make optimistic types disabled by default
Thu, 11 Jul 2019 15:38:09 +0200 redestad 8227527: LogDecorations should lazily resolve host name
Thu, 11 Jul 2019 09:26:04 -0400 hseigel 8226798: JVM crash in klassItable::initialize_itable_for_interface(int, InstanceKlass*, bool, Thread*)
Thu, 04 Jul 2019 17:31:03 +0200 rkennke 8226695: Shenandoah: Wire C1 and C2 IN_NATIVE barrier
Thu, 11 Jul 2019 06:56:51 +0200 stuefe 8227275: Within native OOM error handling, assertions may hang the process
Thu, 11 Jul 2019 06:49:49 +0200 stuefe 8227031: Print NMT statistics on fatal errors
Wed, 10 Jul 2019 16:23:59 -0700 jjg 8227416: Add a "Table Of Contents" to HTML version of man pages
Thu, 11 Jul 2019 08:19:56 +0900 ysuenaga 8209790: SA tools not providing option to connect to debug server
Wed, 10 Jul 2019 22:33:23 +0200 dfuchs 8227539: Replace wildcard address with loopback or local host in tests - part 20
Wed, 10 Jul 2019 16:45:28 +0000 joehw 7148925: StAXSource causes exceptions to be thrown with certain wellformed XML instances
Tue, 02 Jul 2019 08:43:44 -0700 fmatte 8225715: jhsdb jmap fails to write binary heap dump of a jshell process
Wed, 10 Jul 2019 08:20:41 -0700 mikael Added tag jdk-14+5 for changeset 0f1e29c77e50
Wed, 10 Jul 2019 16:09:20 +0100 aefimov 8226756: Replace wildcard address with loopback or local host in tests - part 18
Wed, 10 Jul 2019 07:27:58 -0700 mikael Merge
Wed, 10 Jul 2019 05:12:23 +0100 rpatil 8224560: (tz) Upgrade time-zone data to tzdata2019a
Wed, 10 Jul 2019 01:19:18 -0700 ljiang 8227009: JDK 13 L10n resource files update - msgdrop 10
Wed, 10 Jul 2019 09:04:42 +0200 jlahoda 8220041: NullPointerException at jdk.compiler/com.sun.tools.javac.jvm.Code.emitop0
Wed, 10 Jul 2019 09:43:35 +0800 weijun 8227059: sun/security/tools/keytool/DefaultSignatureAlgorithm.java timed outjdk-13+29
Wed, 10 Jul 2019 09:43:34 +0800 weijun 8227381: GSS login fails with PREAUTH_FAILED
Wed, 10 Jul 2019 09:43:34 +0800 weijun 8225687: Newly added sspi.cpp in JDK-6722928 still contains some small errors
Wed, 10 Jul 2019 10:18:06 -0400 dcubed 8227338: templateInterpreter.cpp: copy_table() needs to be safer
Wed, 10 Jul 2019 14:27:51 +0100 michaelm 8225479: com.sun.net.httpserver.HttpContext that does not end with '/' has surprising matches
Wed, 10 Jul 2019 07:58:24 -0400 coleenp 8222446: assert(C->env()->system_dictionary_modification_counter_changed()) failed: Must invalidate if TypeFuncs differ
Wed, 10 Jul 2019 05:12:23 +0100 rpatil 8224560: (tz) Upgrade time-zone data to tzdata2019ajdk-14+5
Tue, 09 Jul 2019 16:37:30 -0700 mikael Merge
Tue, 09 Jul 2019 15:42:44 -0700 jbhateja 8227222: vmTestbase/jit/FloatingPoint/gen_math/Loops04/Loops04.java failed XMM register should be 0-15
Tue, 09 Jul 2019 14:59:12 -0700 never 8227034: Graal crash with gcbasher
Tue, 09 Jul 2019 13:46:39 -0400 dlong 8227237: [Graal] org.graalvm.compiler.api.directives.test.ProbabilityDirectiveTest fails with -Xcomp
Tue, 09 Jul 2019 16:39:41 +0200 eosterlund 8224531: SEGV while collecting Klass statistics
Tue, 09 Jul 2019 16:39:37 +0200 eosterlund 8227277: HeapInspection::find_instances_at_safepoint walks dead objects
Tue, 09 Jul 2019 08:05:38 -0700 naoto 8227127: Era designator not displayed correctly using the COMPAT provider
Tue, 09 Jul 2019 15:02:28 -0700 jbhateja 8227222: vmTestbase/jit/FloatingPoint/gen_math/Loops04/Loops04.java failed XMM register should be 0-15
Tue, 09 Jul 2019 14:38:48 -0400 pchilanomate 8191890: Biased locking still uses the inferior stop the world safepoint for revocation
Tue, 09 Jul 2019 10:27:38 -0700 jiangli 8225035: Thread stack size issue caused by large TLS size
Mon, 08 Jul 2019 13:29:02 +0200 mbaesken 8227389: Remove unsupported xlc16 compile options on aix
Tue, 09 Jul 2019 09:20:04 +0200 jlahoda 8223443: Calling Trees.getScope early changes names of local/anonymous classes
Mon, 08 Jul 2019 16:20:40 -0700 mikael Merge
Mon, 08 Jul 2019 12:16:13 -0400 dcubed Merge
Mon, 08 Jul 2019 04:01:54 -0700 jcm 8221577: [Graal] Implement basic type consistency checks for Low level MH intrinsics
Mon, 08 Jul 2019 10:56:05 +0200 mdoerr 8226302: Test failures on IBM platforms (power and s/390) after JDK-8223837
Sun, 07 Jul 2019 18:27:38 -0700 never 8221514: [Graal] java/lang/String/CompactString/ tests fail with "GraalError: failed guarantee: no FrameState at DeoptimizingNode" in Graal -Xcomp mode
Sun, 07 Jul 2019 18:17:46 -0700 yzheng 8224254: compiler/graalunit/HotspotJdk9Test.java is timing out intermittently
Sun, 07 Jul 2019 18:10:18 -0700 kvn 8225064: [Graal] Application SEGV in G1ParScanThreadState::copy_to_survivor_space(G1HeapRegionAttr, oopDesc*, markOopDesc*)+0x48
Sun, 07 Jul 2019 10:52:30 -0700 avu 8226654: Some swing gtk regression tests fail with "java.lang.InternalError: Unable to load native GTK librarie
Sat, 06 Jul 2019 08:11:19 +0800 weijun 8227305: Krb5Util::getTicketFromSubjectAndTgs is useless
Mon, 08 Jul 2019 18:30:09 -0400 ecaspole Merge
Mon, 08 Jul 2019 17:57:33 -0400 ecaspole 8225626: JMH Test Support for JDK-8222074
Mon, 08 Jul 2019 17:24:21 -0400 kbarrett 8217170: gc/arguments/TestUseCompressedOopsErgo.java timed out
Mon, 08 Jul 2019 12:14:15 -0400 dcubed Merge
Mon, 08 Jul 2019 11:38:49 -0400 dcubed 8227117: normal interpreter table is not restored after single stepping with TLH
Mon, 08 Jul 2019 09:24:40 +0200 tschatzl 8224741: Optimize the scan area during the Scan Heap Roots phase
Fri, 05 Jul 2019 23:31:32 +0200 shade 8227327: Shenandoah: Faster and more parallel tests
Fri, 05 Jul 2019 11:01:31 -0700 mikael Merge
Fri, 05 Jul 2019 00:24:54 -0700 jcm 8226627: assert(t->singleton()) failed: must be a constant
Mon, 10 Jun 2019 13:04:12 +0200 stefank 8227175: ZGC: ZHeapIterator visits potentially dead objects
Tue, 02 Jul 2019 12:24:26 +0200 stefank 8227083: ZGC: C2: Generates on_weak barrier for WeakCompareAndSwap
Tue, 02 Jul 2019 12:10:18 +0200 stefank 8225770: ZGC: C2: Generates on_weak instead of on_strong barriers
Wed, 03 Jul 2019 23:34:20 +0000 dholmes 8227055: Minor edits to launcher help text
Thu, 04 Jul 2019 07:25:47 +0800 weijun 8226963: More clarification on possible sequencing error in GSSContext::unwrap
Thu, 04 Jul 2019 07:25:11 +0800 weijun 8227061: KDC.java test behaves incorrectly when AS-REQ contains a PAData not PA-ENC-TS-ENC
Fri, 05 Jul 2019 10:35:37 -0700 amenkov 8227124: "could not open pipe" error does not report error details
Fri, 05 Jul 2019 13:40:29 +0200 redestad 8225239: Refactor NetworkInterface lookups
Fri, 05 Jul 2019 12:55:54 +0300 vlivanov 8226409: Enable argument profiling for sun.misc.Unsafe.put*/get*
Fri, 05 Jul 2019 11:07:09 +0200 rkennke 8227039: Shenandoah: Aggressive heuristics for Traversal mode
Thu, 04 Jul 2019 20:29:56 +0200 rkennke 8222079: Don't use memset to initialize fields decode_env constructor in disassembler.cpp
Thu, 04 Jul 2019 13:26:41 -0400 kbarrett 8226793: Replace OopStorage dup_name with os::strdup
Thu, 04 Jul 2019 17:02:19 +0200 rkennke 8226823: Adjust BarrierSetC2 for C2 runtime calls
Thu, 04 Jul 2019 17:02:17 +0200 rkennke 8226822: GC interface for C1 runtime calls
Thu, 04 Jul 2019 16:51:24 +0200 jlahoda 8227010: Error recovery after local variable redeclaration can be improved
Thu, 04 Jul 2019 15:00:03 +0200 redestad 8224657: [TESTBUG] java/util/Locale/SoftKeys.java should be ignored but run
Thu, 04 Jul 2019 14:28:31 +0200 rkennke 8226757: Shenandoah: Make traversal and passive modes explicit
Mon, 01 Jul 2019 16:28:17 +0200 stuefe 8227032: MetaspaceUtils::print_report crashes when called before initialization
Thu, 04 Jul 2019 11:55:00 +0200 stuefe 8227252: [aix] Disable jdk/java/lang/reflect/exeCallerAccessTest
Wed, 03 Jul 2019 13:34:10 +0200 mbaesken 8227171: provide function names in native stack trace on aix with xlc16
Thu, 04 Jul 2019 09:12:21 +0200 thartmann 8227173: Minor cleanup of unused code in compile.hpp
Wed, 03 Jul 2019 16:29:20 -0700 darcy 8227202: clarify Class.isEnum() doc
Wed, 03 Jul 2019 15:47:39 -0700 mikael Merge
Wed, 03 Jul 2019 14:11:21 -0700 mikael Added tag jdk-13+28 for changeset 1e95931e7d8f
Wed, 03 Jul 2019 11:07:48 -0700 dnsimon 8226566: [JVMCI] java.* classes are no longer necessarily resolved by the boot class loader
Wed, 03 Jul 2019 14:37:19 -0700 bpb 8227080: (fs) Files.newInputStream(...).skip(n) is slow
Wed, 03 Jul 2019 14:18:15 -0700 mikael Added tag jdk-14+4 for changeset 19d0b382f086
Wed, 03 Jul 2019 15:46:48 -0400 tonyp 8223575: add subspace transitions to gc+metaspace=info log lines
Wed, 03 Jul 2019 16:30:19 +0000 joehw 8223291: Whitespace is added to CDATA tags when using OutputKeys.INDENT to format XML
Wed, 03 Jul 2019 17:52:56 +0200 rkennke 8227199: Shenandoah: Remove superfluous calls to can_do_traversal_gc()
Wed, 03 Jul 2019 07:56:41 -0700 mikael Merge
Thu, 13 Jun 2019 19:37:49 +0200 shade 8224881: Shenandoah: trashing "Collection Set, Pinned" region during Degenerated GC
Wed, 03 Jul 2019 11:34:46 +0200 mgronlun 8214542: JFR: Old Object Sample event slow on a deep heap in debug builds
Wed, 03 Jul 2019 11:43:01 +0800 weijun 8226719: Kerberos login to Windows 2000 failed with "Inappropriate type of checksum in message"jdk-13+28
Tue, 02 Jul 2019 18:24:47 -0400 kbarrett 8226366: Excessive ServiceThread wakeups for OopStorage cleanup
Tue, 02 Jul 2019 14:02:32 -0700 sspitsyn 8226596: Accessibility errors in jdwp-protocol.html
Tue, 02 Jul 2019 13:55:21 -0700 iignatyev 8227112: exclude compiler/intrinsics/sha/sanity tests from AOT runs
Tue, 02 Jul 2019 12:36:31 -0700 amenkov 8225679: reference to http://java.sun.com/products/JavaManagement/download.html
Tue, 02 Jul 2019 17:46:38 +0200 mgronlun 8227011: Starting a JFR recording in response to JVMTI VMInit and / or Java agent premain corrupts memory
Tue, 02 Jul 2019 14:31:43 +0200 mgronlun 8225706: JFR RootResolver resets CLD claims with no restore
Tue, 02 Jul 2019 11:33:05 +0200 eosterlund 8225642: ZGC: Crash due to bad oops being spilled to stack in load barriers
Tue, 02 Jul 2019 11:33:01 +0200 eosterlund 8219687: G1 asserts nmethod should not be unloaded during parallel code cache unloading
Tue, 02 Jul 2019 09:14:51 +0200 jlahoda 8226522: No compilation error reported when yield is used in incorrect context
Fri, 24 May 2019 04:18:18 -0700 rschmelter 8224673: Adjust permission for delayed starting of debugging
Tue, 25 Jun 2019 11:43:36 +0200 phedlin 8225475: Node budget asserts on x86_32/64
Fri, 28 Jun 2019 13:16:11 +0200 mbaesken 8226943: compile error in libfollowref003.cpp with XCode 10.2 on macosx
Wed, 03 Jul 2019 14:33:40 +0000 poonam 8227178: Backout of 8215523
Tue, 02 Jul 2019 13:45:08 +0200 mbaesken 8226238: Improve error output and fix elf issues in os::dll_loadjdk-14+4
Tue, 02 Jul 2019 12:24:28 +0200 stefank 8227085: ZGC: Add on_weak load barrier verification
Tue, 02 Jul 2019 12:24:26 +0200 stefank 8227083: ZGC: C2: Generates on_weak barrier for WeakCompareAndSwap
Tue, 02 Jul 2019 12:10:18 +0200 stefank 8225770: ZGC: C2: Generates on_weak instead of on_strong barriers
Tue, 02 Jul 2019 13:20:27 -0400 hseigel 8226956: Add invocation tests for Graal and C1
Tue, 02 Jul 2019 16:55:22 +0100 aph Merge
Tue, 02 Jul 2019 16:54:52 +0100 aph 8226525: HotSpot compile-time error for x86-32
Tue, 02 Jul 2019 11:07:40 +0530 jpai 8226976: SessionTimeOutTests uses == operator for String value check
Tue, 02 Jul 2019 08:32:33 -0700 bpb 8224480: (fc) java/nio/channels/FileChannel/MapTest.java fails intermittently
Tue, 02 Jul 2019 10:21:23 -0400 zgu 8227101: Shenandoah: Use ShenandoahSharedFlag for claimed flag in ShenandoahSerialRoot
Tue, 02 Jul 2019 13:25:51 +0100 prappo 8226602: Test convenience reactive primitives from java.net.http with RS TCK
Tue, 02 Jul 2019 10:28:20 +0200 stuefe 8227041: runtime/memory/RunUnitTestsConcurrently.java has a memory leak
Tue, 02 Jul 2019 10:25:00 +0200 stuefe 8227035: JVM::printFlags fails in native OOM situations
Mon, 01 Jul 2019 17:08:04 -0700 mikael Merge
Mon, 01 Jul 2019 11:40:34 -0700 sspitsyn 8226603: accessibility issues in specs/jvmti.html
Mon, 01 Jul 2019 10:49:58 +0200 neliasso 8226287: Make process_users_of_allocation handle gc barriers
Fri, 28 Jun 2019 21:41:04 -0700 iveresov 8226778: [JVMCI] Handle unpacking properly in Deoptimiziation::get_cached_box()
Mon, 01 Jul 2019 18:24:06 +0000 poonam 8215523: jstat reports incorrect values for OU for CMS GC
Mon, 01 Jul 2019 08:24:45 -0400 zgu 8226957: Shenandoah: Remove obsoleted ShenandoahStoreCheck option
Mon, 01 Jul 2019 12:16:58 +0200 redestad 8225344: Avoid VM_EnableBiasedLocking VM operation during bootstrap if BiasedLockingStartupDelay is 0
Mon, 01 Jul 2019 10:49:58 +0200 neliasso 8226287: Make process_users_of_allocation handle gc barriers
Mon, 01 Jul 2019 12:50:34 +0800 aoqi 8226967: Minimal VM: FALSE was not declared in this scope
Sat, 29 Jun 2019 05:26:55 +0200 jwilhelm Merge
Fri, 28 Jun 2019 16:06:44 -0700 sspitsyn 8226917: jvmti/scenarios/contention/TC04/tc04t001/TestDescription.java fails on jvmti->InterruptThread (JVMTI_ERROR_THREAD_NOT_ALIVE)
Fri, 28 Jun 2019 16:50:14 -0400 dlong 8226533: JVMCI: findUniqueConcreteMethod should handle statically bindable methods directly
Fri, 28 Jun 2019 20:46:25 +0100 clanger 8226869: Test java/util/Locale/LocaleProvidersRun.java should enable assertions
Fri, 28 Jun 2019 19:36:32 +0000 valeriep 8226651: Setting the mgfHash in CK_RSA_PKCS_PSS_PARAMS has no effect
Fri, 28 Jun 2019 08:48:17 -0700 naoto 8226876: Assertion in sun/util/locale/provider/CalendarDataUtility on Windows after JDK-8218960
Thu, 27 Jun 2019 10:39:27 +0200 jlahoda 8226510: No compilation error when switch expression has no result expressions
Fri, 28 Jun 2019 05:29:54 +0800 jjiang 8224650: Add tests to support X25519 and X448 in TLS
Fri, 28 Jun 2019 18:51:01 -0700 darcy 8226809: Circular reference in printed stack trace is not correctly indented & ambiguous
Fri, 28 Jun 2019 13:02:18 -0700 bpb 8226706: (se) Reduce the number of outer loop iterations on Windows in java/nio/channels/Selector/RacyDeregister.java
Fri, 28 Jun 2019 09:49:10 -0700 ccheung 8211723: AppCDS: referring to a jar file in any way other than exactly how it was done during dumping doesn't work
Fri, 28 Jun 2019 18:01:36 +0200 aoqi 8226878: zero crashes after JDK-8191278
Fri, 28 Jun 2019 15:58:10 +0100 dfuchs 8226514: Replace wildcard address with loopback or local host in tests - part 14
Fri, 28 Jun 2019 17:10:22 +0300 dpochepk 8223173: Implement fast class initialization checks on AARCH64
Fri, 28 Jun 2019 11:26:07 +0100 michaelm 8222968: ByteArrayPublisher is not thread-safe resulting in broken re-use of HttpRequests
Fri, 28 Jun 2019 09:12:49 +0200 thartmann 8226879: Memory leak in Type::hashcons
Thu, 27 Jun 2019 22:03:19 +0200 jwilhelm Merge
Thu, 27 Jun 2019 12:55:55 -0700 prr 8226783: GTK is not being returned as the System L&F on Gnome
Thu, 27 Jun 2019 00:51:04 -0700 rschmelter 8226608: Hide the onjcmd option from the help output
Thu, 27 Jun 2019 03:13:54 +0200 jwilhelm Added tag jdk-13+27 for changeset b7f68ddec66f
Wed, 26 Jun 2019 18:22:28 +0200 rehn 8225702: Safepoint counter can't be used for safepoint detection
Thu, 27 Jun 2019 11:40:18 -0400 coleenp 8225437: JvmtiExport::gc_epilogue is unnecessary
Thu, 27 Jun 2019 16:12:39 +0100 dfuchs 8226825: Replace wildcard address with loopback or local host in tests - part 19
Thu, 27 Jun 2019 18:00:54 +0800 aoqi 8226871: invalid use of incomplete type class MacroAssembler when building minimal after JDK-8191278
Thu, 27 Jun 2019 11:48:32 +0200 tschatzl 8213108: Improve work distribution during remembered set scan
Thu, 27 Jun 2019 03:33:44 +0200 jwilhelm 8225497: Update Graal
Thu, 27 Jun 2019 03:10:52 +0200 jwilhelm Added tag jdk-14+3 for changeset e64383344f14
Wed, 26 Jun 2019 17:06:43 -0700 igerasim 8224716: Javadoc of Int/Long/DoubleSummaryStatistics should mention possible overflow of count
Wed, 26 Jun 2019 22:16:00 +0200 jwilhelm Merge
Wed, 26 Jun 2019 11:25:51 -0400 bobv 8224764: Create jtreg test for JDK-8222252
Tue, 25 Jun 2019 10:50:59 +0100 smonteith 8226515: AArch64: float point register corruption in ZBarrierSetAssembler::load_atjdk-13+27
Wed, 26 Jun 2019 01:15:51 +0000 valeriep 8226607: Inconsistent info between pcsclite.md and MUSCLE headers
Tue, 25 Jun 2019 18:21:21 -0400 vromero 8226709: MethodTypeDesc::resolveConstantDesc needs access check per the specification
Tue, 25 Jun 2019 09:41:03 -0700 ccheung 8226462: [TESTBUG] runtime/appcds/sharedStrings/SysDictCrash.java failed with Cannot dump shared archive
Tue, 25 Jun 2019 16:34:08 +0100 aefimov 8226730: Missing `@` in code tags
Mon, 24 Jun 2019 22:38:17 -0400 dcubed 8226699: [BACKOUT] JDK-8221734 Deoptimize with handshakes
Tue, 23 Jul 2019 15:11:35 +0100 alanb Mergefibers
Tue, 23 Jul 2019 15:11:14 +0100 alanb Missing owner check when propagating cancelfibers
Tue, 23 Jul 2019 14:58:34 +0100 rpressler Mergefibers
Tue, 23 Jul 2019 14:58:01 +0100 rpressler disable assertion that would trap under a benign conditioncont
Fri, 19 Jul 2019 17:51:31 +0100 rpressler Mergefibers
Fri, 19 Jul 2019 17:50:58 +0100 rpressler add fence to solve stack shrinking issue in Java codecont
Fri, 19 Jul 2019 15:10:26 +0100 rpressler Mergefibers
Fri, 19 Jul 2019 15:09:58 +0100 rpressler turn off PERFTEST, which was accidentally left oncont
Fri, 19 Jul 2019 14:44:35 +0100 rpressler Mergefibers
Fri, 19 Jul 2019 14:44:07 +0100 rpressler Remove link-address from compiled frames and add double-NOP codecont
Fri, 19 Jul 2019 11:10:25 +0200 rbackman Mergefibers
Fri, 19 Jul 2019 11:10:02 +0200 rbackman Cleanup for keepalive handles.cont
Thu, 18 Jul 2019 17:45:26 +0100 alanb Mergefibers
Thu, 18 Jul 2019 17:45:09 +0100 alanb Fix build issue on Windowscont
Thu, 18 Jul 2019 11:31:49 +0200 rbackman Mergefibers
Thu, 18 Jul 2019 11:31:04 +0200 rbackman Keeping nmethods on the continuation stacks alive.cont
Tue, 02 Jul 2019 09:43:31 +0100 alanb testWaitNotifyXXX tests failing intermittentlyfibers
Mon, 01 Jul 2019 14:39:46 +0100 alanb Fix intermittent test failurefibers
Sat, 29 Jun 2019 13:23:00 +0100 alanb Mergefibers
Sat, 29 Jun 2019 13:03:46 +0100 alanb Mergecont
Wed, 26 Jun 2019 13:18:38 -0400 kbarrett 8225255: Make SATB qset lock-freejdk-14+3
Wed, 26 Jun 2019 09:06:32 -0400 hseigel 8224137: Analyze and port invocation tests to jtreg and co-locate to jdk repo
Wed, 26 Jun 2019 05:49:59 +0000 joehw 8224157: BCEL: update to version 6.3.1
Tue, 25 Jun 2019 18:46:51 -0700 darcy 8226785: MandatoryWarningHandler.java contains implementation of Objects.equals functionality
Tue, 25 Jun 2019 18:20:21 -0700 igerasim 8224849: Flag (?U:...) is allowed for non-capturing groups
Tue, 25 Jun 2019 17:27:31 -0700 igerasim 8226543: Reduce GC pressure during message digest calculations in password-based encryption
Tue, 25 Jun 2019 21:33:24 +0000 valeriep 8226607: Inconsistent info between pcsclite.md and MUSCLE headers
Tue, 25 Jun 2019 21:24:37 +0200 bsrbnd 8225644: C1 dumps incorrect class name in ClassCastException message
Mon, 24 Jun 2019 11:37:56 -0700 jcm 8191278: MappedByteBuffer bulk access memory failures are not handled gracefully
Thu, 20 Jun 2019 14:09:22 +0100 sgroeger 8226468: [aix] loadquery failed error message displayed
Tue, 25 Jun 2019 14:36:31 +0200 jwilhelm Merge
Mon, 24 Jun 2019 18:51:54 -0400 dlong 8225369: [AOT] vm/classfmt/cpl/cplres001/cplres00101m004/cplres00101m004.html fails
Mon, 24 Jun 2019 13:40:23 -0700 jjg 8226628: The copyright footer should be enclosed in <footer>
Mon, 24 Jun 2019 11:52:01 -0400 bobv 8224506: [TESTBUG] TestDockerMemoryMetrics.java fails with exitValue = 137
Mon, 24 Jun 2019 11:49:59 -0400 bobv 8224502: [TESTBUG] JDK docker test TestSystemMetrics.java fails with access issues and OOM
Mon, 24 Jun 2019 10:11:17 -0400 mullan 8180005: Provide specific links in KeyManagerFactory and TrustManagerFactory to the Standard Algorithm Names Specification
Sat, 22 Jun 2019 14:35:57 -0700 sspitsyn 8226595: jvmti/scenarios/contention/TC04/tc04t001/TestDescription.java still fails due to wrong number of MonitorContendedEntered events
Fri, 21 Jun 2019 18:20:49 -0700 sspitsyn 8224555: vmTestbase/nsk/jvmti/scenarios/contention/TC02/tc02t001/TestDescription.java failed
Fri, 21 Jun 2019 16:20:01 -0700 serb 8225146: Accessibility issues in javax/swing/plaf/nimbus/doc-files/properties.html
Mon, 24 Jun 2019 22:38:17 -0400 dcubed 8226699: [BACKOUT] JDK-8221734 Deoptimize with handshakes
Mon, 24 Jun 2019 16:51:23 -0400 coleenp 8214822: Move ConcurrentHashTable VALUE parameter to CONFIG
Mon, 24 Jun 2019 14:13:49 -0400 zgu 8226310: Shenandoah: Concurrent evacuation of CLDG
Mon, 24 Jun 2019 11:46:46 -0400 zgu 8226311: Shenandoah: Concurrent evacuation of OopStorage backed weak roots
Mon, 24 Jun 2019 15:19:11 +0100 michaelm 8226683: Remove review suggestion from fix to 8219804
Mon, 24 Jun 2019 15:10:44 +0100 michaelm 8219804: java/net/MulticastSocket/Promiscuous.java fails intermittently due to NumberFormatException
Mon, 24 Jun 2019 09:51:45 -0400 zgu 8226586: Shenandoah: No need to pre-evacuate roots for degenerated GC
Sat, 22 Jun 2019 02:03:41 +0200 jwilhelm Merge
Fri, 21 Jun 2019 12:09:07 -0700 jjg 8226593: Fix HTML in com/sun/jdi/doc-files/signature.html
Fri, 21 Jun 2019 11:41:29 -0700 jjg 8226592: Fix HTML in table for jdk.zipfs module-info
Fri, 21 Jun 2019 10:38:53 -0700 erikj 8226269: Race in SetupProcessMarkdown
Fri, 21 Jun 2019 23:44:58 +0800 weijun 8225257: sun/security/tools/keytool/PSS.java timed out
Fri, 21 Jun 2019 09:53:12 -0400 coleenp 8226394: [TESTBUG] vmTestbase/metaspace/flags/maxMetaspaceSize/TestDescription.java fails with java.lang.NoClassDefFoundError
Fri, 21 Jun 2019 15:16:03 +0100 adinn 8226203: MappedByteBuffer.force method may have no effect on implementation specific map modes
Fri, 21 Jun 2019 06:33:55 -0700 erikj 8226538: find-files.gmk gets corrupted if tab completion is used before running make first
Thu, 20 Jun 2019 23:12:12 -0700 sspitsyn 8223736: jvmti/scenarios/contention/TC04/tc04t001/TestDescription.java fails due to wrong number of MonitorContendedEntered events
Fri, 21 Jun 2019 16:21:13 -0700 kvn 8225810: Update JVMCI
Fri, 21 Jun 2019 13:04:14 -0700 kvn 8185139: [Graal] Tests which set too restrictive security manager fail with Graal
Fri, 21 Jun 2019 08:38:26 -0400 mullan 8226307: Curve names should be case-insensitive
Fri, 21 Jun 2019 12:23:46 +0200 hannesw 8225802: Remove unused CSS classes from HTML doclet
Fri, 21 Jun 2019 08:07:18 +0000 coffeys 8133489: Better messaging for PKIX path validation matching
Fri, 21 Jun 2019 04:16:18 +0200 jwilhelm Merge
Thu, 20 Jun 2019 18:47:44 -0700 dtitov 8220175: serviceability/dcmd/framework/VMVersionTest.java fails with a timeout
Thu, 20 Jun 2019 14:24:13 -0700 jjg 8226412: Fix command-line help text for javac -target
Thu, 20 Jun 2019 11:42:33 -0700 epavlova 8225684: [AOT] vmTestbase/vm/oom/production/AlwaysOOMProduction tests fail with AOTed java.base
Thu, 20 Jun 2019 10:32:25 -0700 kvn 8223794: applications/kitchensink/Kitchensink.java crash bad oop with Graal
Thu, 20 Jun 2019 07:56:28 -0700 erikj 8226404: bootcycle build uses wrong CDS archive
Wed, 19 Jun 2019 21:49:33 -0700 xuelei 8225766: Curve in certificate should not affect signature scheme when using TLSv1.3
Thu, 20 Jun 2019 04:08:29 +0200 jwilhelm Added tag jdk-13+26 for changeset 0692b67f5462
Thu, 20 Jun 2019 18:29:34 -0400 zgu 8225590: Shenandoah: Refactor ShenandoahClassLoaderDataRoots API
Thu, 20 Jun 2019 20:20:01 +0000 robm 8223727: com/sun/jndi/ldap/privconn/RunTest.java failed due to hang in LdapRequest.getReplyBer
Thu, 20 Jun 2019 16:15:10 -0400 lancea 8226518: Typo in the ConnectionBuilder javadoc examples
Thu, 20 Jun 2019 14:03:10 -0600 dlsmith 8226325: Support building of filtered spec bundles
Thu, 20 Jun 2019 11:21:54 -0700 naoto 8220229: Timezone pattern "OOOO" does not result in the full "GMT+00:00" substring
Thu, 20 Jun 2019 09:35:41 -0700 erikj 8226521: Detect WSL2 as WSL in configure
Thu, 20 Jun 2019 10:12:31 -0400 zgu 8226413: Shenandoah: Separate root scanner for SH::object_iterate()
Thu, 20 Jun 2019 07:13:06 -0400 gadams 8224642: Test sun/tools/jcmd/TestJcmdSanity.java fails: Bad file descriptor
Thu, 20 Jun 2019 08:02:41 +0000 coffeys 8213561: ZipFile/MultiThreadedReadTest.java timed out in tier1
Thu, 20 Jun 2019 03:32:14 +0000 tvaleev 8226286: Remove unused method java.lang.Integer::formatUnsignedInt and cleanup Integer/Long classes
Thu, 20 Jun 2019 04:15:01 +0200 jwilhelm Added tag jdk-14+2 for changeset 43627549a488
Thu, 20 Jun 2019 02:10:53 +0200 jwilhelm Merge
Tue, 18 Jun 2019 16:15:15 +0100 aph 8225716: G1 GC: Undefined behaviour in G1BlockOffsetTablePart::block_at_or_precedingjdk-13+26
Wed, 19 Jun 2019 08:42:15 -0400 hseigel 8225789: Empty method parameter type should generate ClassFormatError
Wed, 19 Jun 2019 12:25:12 +0200 thartmann 8226382: ProblemList java/lang/constant/MethodTypeDescTest.java
Wed, 19 Jun 2019 12:24:26 +0200 thartmann 8226381: ProblemList java/lang/reflect/PublicMethods/PublicMethodsTest.java
Wed, 19 Jun 2019 03:21:38 -0700 iignatyev 8226360: merge entries in hotspot problem lists
Tue, 18 Jun 2019 16:08:31 -0700 amenkov 8225682: Reference to JNI spec on java.sun.com
Tue, 18 Jun 2019 09:19:57 -0700 iignatyev 8226313: problem list compiler/types/correctness tests
Thu, 27 Jun 2019 11:54:41 +0100 alanb invoke afterTerminate before changing fiber statefibers
Thu, 27 Jun 2019 11:32:38 +0100 alanb Mergefibers
Thu, 27 Jun 2019 11:03:58 +0100 alanb Allow BufferedInputStream wrapping I/O streams to be used in a fiberfibers
Thu, 27 Jun 2019 11:02:53 +0100 alanb FiberScope clean-upfibers
Tue, 25 Jun 2019 12:32:55 -0700 cjplummer Fix for serviceability/tmtools/jstack/WaitNotifyThreadTest.java. Stack dumping code needs to properly detect if a thread is waiting by looking for Object.wait0() frame, not Object.wait().fibers
Mon, 24 Jun 2019 17:10:53 -0700 cjplummer Account for extra frame on the stack when calling Object.wai().fibers
Mon, 24 Jun 2019 17:09:00 -0700 cjplummer Account for java.lang.Object API changes.fibers
Mon, 24 Jun 2019 14:57:34 -0700 cjplummer Adust owned monitor tests for extra Thread.sleep0() frame.fibers
Sun, 23 Jun 2019 14:11:50 +0100 alanb Mergefibers
Sun, 23 Jun 2019 13:54:23 +0100 alanb Mergecont
Wed, 19 Jun 2019 05:04:08 -0800 shurailine 8226359: Switch to JCov build which supports byte code version 58jdk-14+2
Wed, 19 Jun 2019 13:34:31 -0400 hseigel 8226304: Obsolete the -XX:+FailOverToOldVerifier option
Tue, 18 Jun 2019 16:15:15 +0100 aph 8225716: G1 GC: Undefined behaviour in G1BlockOffsetTablePart::block_at_or_preceding
Wed, 19 Jun 2019 08:52:15 -0400 zgu 8225582: Shenandoah: Enable concurrent evacuation of JNIHandles
Wed, 19 Jun 2019 12:17:22 +0100 prappo Merge
Tue, 18 Jun 2019 14:12:06 +0100 prappo 8226303: Examine the HttpRequest.BodyPublishers for exception handling
Wed, 19 Jun 2019 08:43:23 +0200 pliden 8225779: Remove unused CollectedHeap::cell_header_size()
Mon, 17 Jun 2019 09:40:07 +0000 pli 8226222: [JVMCI] Export AArch64 field VM_Version::_psr_info.dczid_el0
Tue, 18 Jun 2019 17:58:07 -0400 zgu 8225573: Shenandoah: Enhance ShenandoahVerifier to ensure roots to-space invariant
Tue, 18 Jun 2019 17:50:33 -0400 lancea 8225680: Address links in java.sql.rowset
Tue, 18 Jun 2019 22:48:27 +0200 jwilhelm Merge
Tue, 18 Jun 2019 11:52:57 -0700 jjg 8225748: Use SHA-256 for javap classfile checksum
Tue, 18 Jun 2019 12:39:29 -0500 gziemski 8225310: JFR crashed in JfrPeriodicEventSet::requestProtectionDomainCacheTableStatistics()
Tue, 18 Jun 2019 10:00:35 +0530 rraghavan 8226198: use of & instead of && in LibraryCallKit::arraycopy_restore_alloc_state
Mon, 17 Jun 2019 17:14:05 -0700 rfield 8200701: jdk/jshell/ExceptionsTest.java fails on Windows, after JDK-8198801
Mon, 17 Jun 2019 14:31:49 -0700 dtitov 8217348: assert(thread->is_Java_thread()) failed: just checking
Thu, 13 Jun 2019 11:21:50 -0700 dtitov 8225543: Jcmd fails to attach to the Java process on Linux using the main class name if whitespace options were used to launch the process
Mon, 17 Jun 2019 09:11:27 -0700 kvn 8181837: [Graal] compiler/jvmci/SecurityRestrictionsTest.java fails with AccessControlException
Fri, 14 Jun 2019 12:08:55 -0400 zgu 8225801: Shenandoah: Adjust SA to reflect recent forwarding pointer changes
Sat, 15 Jun 2019 14:39:04 +0800 weijun 8225392: Comparison builds are failing due to cacerts file
Fri, 14 Jun 2019 12:19:14 -0700 xuelei 8224829: AsyncSSLSocketClose.java has timing issue
Fri, 14 Jun 2019 10:02:57 +0200 shade 8225695: 32-bit build failures after JDK-8080462 (Update SunPKCS11 provider with PKCS11 v2.40 support)
Fri, 14 Jun 2019 03:50:25 +0200 jwilhelm Added tag jdk-13+25 for changeset 22b3b7983ada
Thu, 13 Jun 2019 17:18:06 -0700 kvn 8209590: compiler/compilercontrol/DontInlineCommandTest.java test fails with "Inline message differs" error
Thu, 13 Jun 2019 17:49:49 -0400 mullan 8225730: Add sun/security/pkcs11/tls/tls12/FipsModeTLS12.java to ProblemList for linux
Thu, 13 Jun 2019 13:42:41 -0700 iignatyev 8225746: hotspot problem lists list unexciting tests
Tue, 18 Jun 2019 18:38:53 +0100 chegar 8226319: Add forgotten test/jdk/java/net/httpclient/BodySubscribersTest.java
Tue, 18 Jun 2019 13:11:09 -0400 zgu 8225804: SA: Remove unused CollectedHeap.oopOffset() method
Tue, 18 Jun 2019 10:37:28 -0400 rriggs 8226242: Diagnostic output for posix_spawn failure
Tue, 18 Jun 2019 14:52:36 +0100 chegar 8225583: Examine the HttpResponse.BodySubscribers for null handling
Tue, 18 Jun 2019 11:06:29 +0200 rehn 8226227: Missing include of thread.inline.hpp
Tue, 18 Jun 2019 10:54:00 +0900 ysuenaga 8225636: SA can't handle prelinked libraries
Mon, 17 Jun 2019 20:03:34 +0100 dfuchs 8225578: Replace wildcard address with loopback or local host in tests - part 16
Mon, 17 Jun 2019 15:31:49 +0800 ngasson 8224851: AArch64: fix warnings and errors with Clang and GCC 8.3
Fri, 14 Jun 2019 20:30:10 -0700 rfield 8200701: jdk/jshell/ExceptionsTest.java fails on Windows, after JDK-8198801
Fri, 14 Jun 2019 12:08:55 -0400 zgu 8225801: Shenandoah: Adjust SA to reflect recent forwarding pointer changes
Fri, 14 Jun 2019 11:58:23 -0400 zgu 8225550: Shenandoah: Prevent SH::object_iterate() call's side-effects
Fri, 14 Jun 2019 16:47:58 +0200 shade 8225743: Remove ShenandoahBarrierSetC2::escape_is_barrier_node and related GC interface
Fri, 14 Jun 2019 13:26:52 +0200 thartmann 8225783: Incorrect use of binary operators on booleans in type.cpp
Fri, 14 Jun 2019 10:19:04 +0530 jpai 8217705: HttpClient - wrong exception type when bad status line is received
Fri, 14 Jun 2019 05:02:58 +0000 tvaleev 8225339: Optimize HashMap.keySet()/HashMap.values()/HashSet toArray() methods
Thu, 13 Jun 2019 16:39:20 -0700 darcy 8222369: ExecutableElement.getReceiverType returns null instead of NOTYPE
Fri, 14 Jun 2019 01:09:45 +0200 jwilhelm Added tag jdk-14+1 for changeset 2f4e214781a1
Thu, 13 Jun 2019 13:43:34 -0700 bpb 8223813: (aio) Iocp.getErrorMessage should drop trailing \r\n
Thu, 13 Jun 2019 11:50:45 -0700 darcy 8164819: Make javac's toString() on annotation objects consistent with core reflection
Thu, 13 Jun 2019 11:21:50 -0700 dtitov 8225543: Jcmd fails to attach to the Java process on Linux using the main class name if whitespace options were used to launch the processjdk-14+1
Thu, 13 Jun 2019 19:37:49 +0200 shade 8224881: Shenandoah: trashing "Collection Set, Pinned" region during Degenerated GC
Thu, 13 Jun 2019 13:04:33 -0400 mullan Merge
Thu, 13 Jun 2019 13:03:15 -0400 mullan 8225730: Add sun/security/pkcs11/tls/tls12/FipsModeTLS12.java to ProblemList for linux
Tue, 11 Jun 2019 16:45:20 -0700 darcy 8214546: Start of release updates for JDK 14
Thu, 13 Jun 2019 18:02:18 +0200 jwilhelm Added tag jdk-14+0 for changeset 22b3b7983ada
Thu, 13 Jun 2019 23:53:21 +0800 weijun 8225180: SignedObject with invalid Key not throwing the InvalidKeyException in Windowsjdk-13+25 jdk-14+0
Thu, 13 Jun 2019 15:24:34 +0100 smonteith 8214527: ZGC for Aarch64
Thu, 13 Jun 2019 12:27:29 +0200 egahlin 8220657: JFR.dump does not work when filename is set
Thu, 13 Jun 2019 11:54:55 +0200 tschatzl 8225418: G1: region attribute remembered set state disagrees with actual remembered set state
Thu, 13 Jun 2019 11:12:23 +0200 mdoerr 8225663: [testbug] Missing JNIEXPORT in XAbortProvoker native function
Thu, 13 Jun 2019 09:10:51 +0100 michaelm 8216417: cleanup of IPv6 scope-id handling
Thu, 13 Jun 2019 12:22:28 +0530 psadhukhan Merge
Thu, 13 Jun 2019 11:31:36 +0530 psadhukhan Merge
Wed, 12 Jun 2019 10:02:49 +0530 psadhukhan Merge
Tue, 11 Jun 2019 17:15:25 -0700 prr 8225487: giflib legal file is missing attribution for openbsd-reallocarray.c
Tue, 11 Jun 2019 16:23:33 -0700 serb 8221246: NullPointerException within Win32ShellFolder2
Tue, 11 Jun 2019 10:34:42 -0700 prr 8217731: Font rendering and glyph spacing changed from jdk-8 to jdk-11
Tue, 11 Jun 2019 10:15:30 -0700 serb 8225144: [macos] In Aqua L&F backspace key does not delete when Shift is pressed
Tue, 11 Jun 2019 11:01:22 +0530 psadhukhan 8225511: javax/swing/JWindow/ShapedAndTranslucentWindows/ShapedTranslucentPerPixelTranslucentGradient.java fails in linux-x64
Mon, 10 Jun 2019 10:52:11 +0530 psadhukhan 8225368: broken links in java.desktop files
Sun, 09 Jun 2019 17:46:05 -0700 serb 8223045: GraphicsEnvironment does not detect resolution changes in multiscreen systems
Sun, 09 Jun 2019 14:12:18 -0700 serb 8222083: Support of "64-bit IEEE floating point" encoding for the AU file format
Fri, 07 Jun 2019 09:38:40 -0700 prr Merge
Thu, 06 Jun 2019 15:46:36 +0300 ant 8225118: Robot.createScreenCapture() returns black image on HiDPI linux with gtk3
Tue, 04 Jun 2019 14:43:57 +0530 psadhukhan 8224876: javax/swing/JWindow/ShapedAndTranslucentWindows/ShapedPerPixelTranslucentGradient.java fails on linux-x64
Tue, 04 Jun 2019 14:23:33 +0530 psadhukhan Merge
Mon, 03 Jun 2019 08:13:18 -0700 ssadetsky 8196096: javax/swing/JPopupMenu/6580930/bug6580930.java fails
Thu, 13 Jun 2019 08:42:49 +0200 ronsh 8224161: Check.checkOverrideClashes n^2 algorithm
Thu, 13 Jun 2019 08:42:47 +0200 tnakamura 8224184: jshell got IOException at exiting with AIX
Wed, 12 Jun 2019 17:22:11 -0700 iignatyev 8225676: cleanup hotspot ProblemList
Wed, 12 Jun 2019 21:17:26 -0700 iignatyev 8208236: [TESTBUG] vmTestbase/nsk/stress/stack tests fail by timeout
Thu, 13 Jun 2019 10:06:07 +0800 weijun 6722928: Support SSPI as a native GSS-API provider
Wed, 12 Jun 2019 18:58:00 -0700 wetmore 8171279: Support X25519 and X448 in TLS
Wed, 12 Jun 2019 23:21:24 +0200 hannesw 8225671: Support HTML 5 character references in javadoc
Wed, 12 Jun 2019 14:14:39 -0700 darcy 8225675: Outdated citation of JLS in java.lang.ref.Reference
Wed, 12 Jun 2019 12:31:32 -0700 epavlova 8225622: [AOT] runtime/SharedArchiveFile/TestInterpreterMethodEntries.java crashed with AOTed java.base
Wed, 12 Jun 2019 11:48:14 -0700 iignatyev 8158048: Fix failure message from jtreg gtest wrapper
Wed, 12 Jun 2019 10:45:46 -0700 ccheung 8224710: [TESTBUG] dynamicArchive/ExcludedClasses.java test failed in tier6 testing on Windows
Wed, 12 Jun 2019 10:37:35 -0700 kvn 8223796: JVMCIEnv::get_jvmci_type does not keep klasses alive
Wed, 12 Jun 2019 16:10:39 +0100 chegar 8225651: Missed the `@` in a couple of code tags of SocketImpl
Wed, 12 Jun 2019 10:52:45 -0400 dcubed 8225453: is_busy diagnostics and other baseline cleanups from Async Monitor Deflation project
Wed, 12 Jun 2019 14:24:11 +0200 mdoerr 8224090: [PPC64] Fix SLP patterns for filling an array with double float literals
Wed, 12 Jun 2019 14:22:04 +0200 mdoerr 8224827: Implement fast class initialization checks on s390
Wed, 12 Jun 2019 14:21:36 +0200 mdoerr 8223249: [s390] Cleanup TemplateInterpreterGenerator::generate_fixed_frame
Wed, 12 Jun 2019 14:06:16 +0200 thartmann 8224658: Unsafe access C2 compile fails with assert(flat != TypePtr::BOTTOM) failed: cannot alias-analyze an untyped ptr: adr_type = NULL
Wed, 12 Jun 2019 13:49:43 +0200 jlahoda 8220018: javac crash when compiling try-catch-finally inside switch expression
Wed, 12 Jun 2019 13:21:25 +0200 hannesw 8223364: Bad placement of anchor relative to header
Wed, 12 Jun 2019 10:34:29 +0200 sangheki 8225478: Make G1CMRootRegions independent of HeapRegions
Tue, 11 Jun 2019 17:20:51 -0700 darcy 7086604: (reflect) Clarifications to javadoc for getGeneric*Type methods in j.l.r
Tue, 11 Jun 2019 16:31:37 -0700 ascarpino 8211018: Session Resumption without Server-Side State
Tue, 11 Jun 2019 19:15:31 -0400 zgu 8225572: Shenandoah: Move JNIHandles root out of serial roots
Tue, 11 Jun 2019 14:59:46 -0700 iignatyev 8066173: compiler/types/correctness/OffTest.java failed with assert
Tue, 11 Jun 2019 14:56:48 -0700 jjg 8214399: Javap -help should provide information about --multi-release option
Tue, 11 Jun 2019 21:30:28 +0000 valeriep 8080462: Update SunPKCS11 provider with PKCS11 v2.40 support
Tue, 11 Jun 2019 13:04:36 -0400 lancea 8225189: Multiple JNI calls within critical region in ZIP Library
Tue, 11 Jun 2019 15:46:26 +0100 dfuchs 8225512: Replace wildcard address with loopback or local host in tests - part 15
Mon, 10 Jun 2019 10:11:42 +0100 aph 8225429: Regression in disassembly quality
Tue, 11 Jun 2019 07:31:47 -0400 coleenp 8224847: gc/stress/TestReclaimStringsLeaksMemory.java fails with reserved greater than expected
Tue, 11 Jun 2019 08:03:29 -0400 dholmes 8225568: ProblemList compiler/compilercontrol/jcmd/ClearDirectivesFileStackTest.java
Tue, 11 Jun 2019 12:39:37 +0200 neliasso 8225564: Remove wrong assert in clean_catch_blocks
Tue, 11 Jun 2019 10:55:17 +0200 eosterlund 8224871: os::attempt_reserve_memory_at() tries too hard
Tue, 11 Jun 2019 14:33:34 +0530 rraghavan 8225567: Wrong file headers with 8202414 fix changeset
Tue, 11 Jun 2019 09:21:34 +0100 chegar 8225426: Replace plain with system-default in Socket and ServerSocket
Tue, 11 Jun 2019 09:51:33 +0200 mdoerr 8224826: Implement fast class initialization checks on PPC64
Tue, 11 Jun 2019 09:27:51 +0200 neliasso 8225509: clean_catch_blocks must add preds first
Mon, 10 Jun 2019 17:11:04 -0700 iignatyev 8209917: fix TODO in GatherDiagnosticInfoObserver
Mon, 10 Jun 2019 17:33:11 -0700 smarks 8205131: remove Runtime trace methods
Mon, 10 Jun 2019 15:53:35 -0700 darcy 8225532: Update source enums to describe 12 and 13 language features
Mon, 10 Jun 2019 15:55:11 -0700 dnsimon 8225492: Update JVMCI
Mon, 10 Jun 2019 13:42:11 -0400 zgu 8225514: Shenandoah: ShenandoahCodeRoots should inherit from AllStatic
Mon, 10 Jun 2019 09:41:09 -0700 dtitov 8222828: vmTestbase/nsk/jdi/BScenarios/multithrd/tc02x004/TestDescription.java failed
Mon, 10 Jun 2019 17:02:35 +0300 dpochepk 8222412: AARCH64: multiple instructions encoding issues
Mon, 10 Jun 2019 09:52:04 -0400 hseigel 8224952: RI deviates from JVMS - non-zero minor_version for class files throws UnsupportedClassVersionError.
Mon, 10 Jun 2019 20:38:15 +0800 weijun 8221719: Jarsigner fails to verify signed by alias if alias given in wrong case
Mon, 10 Jun 2019 12:52:57 +0200 pliden 8225227: ZGC: Be exact in what load barrier to use in ZHeapIterator
Mon, 10 Jun 2019 12:52:56 +0200 pliden 8224966: ZGC: Don't skip oop verification in OopMapSet::all_do()
Mon, 10 Jun 2019 11:17:57 +0100 dfuchs 8224865: Replace wildcard address with loopback or local host in tests - part 13
Fri, 07 Jun 2019 13:50:14 +0200 stefank 8223837: Add -XX:MinHeapSize flag to set the minimum heap size
Thu, 14 Feb 2019 14:54:05 +0100 neliasso 8224675: Late GC barrier insertion for ZGC
Mon, 10 Jun 2019 05:09:52 +0200 jlahoda 8223305: Compiler support for Switch Expressions
Sun, 09 Jun 2019 15:48:57 -0700 darcy 8042748: Clarify exception thrown by ParameterizedTypeImpl.validateConstructorArguments()
Sun, 09 Jun 2019 15:21:43 -0700 darcy 8181869: getAnnotatedParameterTypes%G?%@() specification should be clarified
Sun, 09 Jun 2019 05:56:46 -0400 lancea 8225322: Broken links in java.sql
Sun, 09 Jun 2019 11:28:13 +0200 egahlin 8216064: -XX:StartFlightRecording:settings= doesn't work properly
Fri, 07 Jun 2019 21:35:26 -0700 iignatyev 8149040: Cleanup compiler/jsr292/NonInlinedCall tests after JDK-8148994
Fri, 07 Jun 2019 16:38:42 -0700 jjg 8224257: fix issues in files generated by pandoc
Fri, 07 Jun 2019 15:35:32 -0700 sviswanathan 8224234: compiler/codegen/TestCharVect2.java fails in test_mulc
Fri, 07 Jun 2019 18:11:33 -0400 dlong 8223050: JVMCI: findUniqueConcreteMethod() should not use Dependencies::find_unique_concrete_method() for non-virtual methods
Fri, 07 Jun 2019 14:32:48 -0700 jjg 8224257: fix issues in files generated by pandoc
Fri, 07 Jun 2019 14:03:17 -0700 ccheung 8224497: Remove FIXME in metaspaceClosure.cpp
Fri, 07 Jun 2019 13:57:08 -0700 kvn 8225350: compiler/jvmci/compilerToVM/IsCompilableTest.java timed out
Fri, 07 Jun 2019 12:26:50 -0700 lmesnik 8225388: Running jcmd Compiler.CodeHeap_Analytics all 0 cause crash.
Fri, 07 Jun 2019 10:26:21 -0700 never 8209626: [JVMCI] Use implicit exception table for dispatch and printing
Fri, 07 Jun 2019 09:16:11 -0700 erikj 8217739: Cannot reuse java.base UnixConstants.java from target in BuildJDK when cross compiling
Wed, 05 Jun 2019 16:53:52 +0200 mbaesken 8224958: add os::dll_load calls to event log
Fri, 07 Jun 2019 08:47:28 -0300 jlaskey 8225448: String::translateEscapes javadoc has accessibility issues
Fri, 07 Jun 2019 11:51:27 +0100 chegar 8216988: ServerSocket.implAccept should include warnings about Socket type/state
Fri, 07 Jun 2019 11:47:49 +0100 chegar 8225424: Add jdk.net.usePlainSocketImpl runs to a couple of tests
Fri, 07 Jun 2019 11:48:01 +0200 shade 8225441: Cleanup ShenandoahHeap::atomic_compare_exchange_oop
Fri, 07 Jun 2019 11:47:53 +0200 shade 8225357: Rewire ShenandoahHeap::maybe_update_with_forwarded for contending fixups
Fri, 07 Jun 2019 11:19:34 +0200 pliden 8222467: ZGC: Log min/max/softmax capacity
Fri, 07 Jun 2019 11:19:34 +0200 pliden 8222182: ZGC: Use SoftMaxHeapSize to guide GC heuristics
Fri, 07 Jun 2019 11:19:34 +0200 pliden 8222145: Add -XX:SoftMaxHeapSize flag
Fri, 07 Jun 2019 11:19:34 +0200 pliden 8225340: ZGC: Add logging of High Usage rule
Fri, 07 Jun 2019 10:13:30 +0200 mdoerr 8225347: [s390] Unexpected exit from stack overflow test
Fri, 07 Jun 2019 10:09:41 +0200 jlahoda 8223782: jshell parser should handle Text Blocks
Thu, 06 Jun 2019 09:30:00 +0200 mbaesken 8225402: events logging in deoptimization.cpp should go to deopt-log
Thu, 06 Jun 2019 23:06:47 -0700 iignatyev 8225469: clean up problem lists
Fri, 07 Jun 2019 04:57:51 +0200 egahlin 8224139: Deprecate -XX:FlightRecorder option
Thu, 06 Jun 2019 18:57:28 -0700 dtitov 8206074: nsk/jdi/EventRequestManager/createStepRequest/crstepreq001/TestDescription.java is timing out
Thu, 06 Jun 2019 17:48:06 -0700 darcy 8225465: Add @jls tags to receiver type methods
Thu, 06 Jun 2019 17:20:19 -0700 igerasim 8225397: Integer value miscalculation in toString() method of BitSet
Thu, 06 Jun 2019 16:06:10 -0700 kvn 8222371: Use UL for TraceNMethodInstalls code
Thu, 06 Jun 2019 15:12:37 -0700 kvn 8208379: compiler/jvmci/events/JvmciNotifyInstallEventTest.java failed with "Got unexpected event count after 2nd install attempt: expected 9 to equal 2"
Thu, 06 Jun 2019 14:13:59 -0700 bpb 8224617: (fs) java/nio/file/FileStore/Basic.java found filesystem twice
Thu, 06 Jun 2019 13:42:41 -0700 iignatyev 8225450: use @file in CtwRunner
Thu, 06 Jun 2019 22:31:13 +0200 egahlin 8219205: JFR file without license header
Thu, 06 Jun 2019 15:09:17 -0400 coleenp 8224151: Test vmTestbase/nsk/sysdict/vm/stress/chain/chain007/chain007.java might hang with release binaries
Thu, 06 Jun 2019 20:19:03 +0200 egahlin 8216283: Allow shorter method sampling interval than 10 ms
Thu, 06 Jun 2019 10:36:43 -0700 jjg 8225321: Repeated use of {@systemProperty} in a file causes duplicate ids
Thu, 06 Jun 2019 10:01:36 -0700 mr 8197927: Allow the system property `java.vendor.version` to be undefined
Thu, 23 May 2019 10:06:37 -0700 aeubanks 8224645: Only test multicast interfaces if they exist
Thu, 06 Jun 2019 12:24:44 -0300 jlaskey 8223967: Implement Text Blocks (Preview) in the Java compiler
Thu, 06 Jun 2019 12:24:44 -0300 jlaskey 8203444: String::formatted (Preview)
Thu, 06 Jun 2019 12:24:44 -0300 jlaskey 8223780: String::translateEscapes (Preview)
Thu, 06 Jun 2019 12:24:44 -0300 jlaskey 8223775: String::stripIndent (Preview)
Thu, 06 Jun 2019 08:11:25 -0700 bpb 8219992: Correct the documentation of PrintWriter to refer System.lineSeparator
Wed, 05 Jun 2019 01:42:11 -0300 mbalao 8215032: Support Kerberos cross-realm referrals (RFC 6806)
Thu, 06 Jun 2019 10:03:22 -0400 rriggs 8224905: java/lang/ProcessBuilder/Basic.java#id1 failed with stream closed
Thu, 06 Jun 2019 15:22:12 +0200 egahlin 8224217: RecordingInfo should use textual representation of path
Thu, 06 Jun 2019 21:19:07 +0800 weijun 8225304: Tiny HTML error (bad heading) in org.ietf.jgss package-info.java
Thu, 06 Jun 2019 13:46:03 +0300 vlivanov 8225141: Better handling of classes in error state in fast class initialization checks
Thu, 06 Jun 2019 13:46:01 +0300 vlivanov 8225106: C2: Parse::clinit_deopt asserts when holder klass is in error state
Thu, 06 Jun 2019 13:45:59 +0300 jiefu 8224162: assert(profile.count() == 0) failed: sanity in InlineTree::is_not_reached
Tue, 04 Jun 2019 17:56:16 +0800 ngasson 8224853: CDS address sanitizer errors
Wed, 05 Jun 2019 22:19:09 -0700 lfoltan 8225325: Add tests for redefining a class' private method during resolution of the bootstrap specifier
Wed, 05 Jun 2019 21:02:42 -0700 sspitsyn 8205126: JVMTI spec incorrectly states that PopFrame can not be called on the current thread
Thu, 06 Jun 2019 10:11:24 +0800 jjiang 8225390: ProblemList sun/security/pkcs11/sslecc/ClientJSSEServerJSSE.java due to JDK-8161536
Thu, 06 Jun 2019 04:04:03 +0200 jwilhelm Added tag jdk-13+24 for changeset 7e2238451585
Wed, 05 Jun 2019 21:50:29 -0400 vromero 8225386: test for JDK-8216261 fails in Windows
Wed, 05 Jun 2019 16:10:08 -0700 naoto 8225182: JNI exception pending in DestroyXIMCallback of awt_InputMethod.c:1327
Wed, 05 Jun 2019 17:01:43 -0400 vromero 8223942: Missing methods in ClientCodeWrapper$WrappedJavaFileManager
Wed, 05 Jun 2019 13:46:31 -0700 erikj 8209381: Default CDS classlist generation should run with an explicit locale setting
Wed, 05 Jun 2019 16:01:50 -0400 vromero 8216261: Javap ignores default modifier on interfaces
Thu, 20 Jun 2019 22:49:25 -0700 cjplummer Added support for and make use of new continuation events. Add some debugging helper functions for dumping out event handlers. Numerous bugs fixes.fibers
Thu, 20 Jun 2019 19:35:19 +0100 rpressler Mergefibers
Thu, 20 Jun 2019 19:34:55 +0100 rpressler cleanupcont
Thu, 20 Jun 2019 11:11:59 +0200 rbackman Mergefibers
Thu, 20 Jun 2019 11:11:31 +0200 rbackman Better size heuristics when using CheckCompressedOops for the oopmap stubs.cont
Thu, 20 Jun 2019 09:16:50 +0100 rpressler Mergefibers
Thu, 20 Jun 2019 09:16:20 +0100 rpressler fix buildcont
Wed, 19 Jun 2019 23:34:17 -0700 cjplummer Mergefibers
Wed, 19 Jun 2019 22:33:47 -0700 cjplummer Rename frames_count argument to continuation_frame_count.cont
Wed, 19 Jun 2019 22:32:15 -0700 cjplummer Added some additonal _cur_stack_depth asserts.cont
Wed, 19 Jun 2019 23:42:00 +0100 rpressler Mergefibers
Wed, 19 Jun 2019 23:41:10 +0100 rpressler cleanupcont
Wed, 19 Jun 2019 20:15:39 +0100 rpressler Mergefibers
Wed, 19 Jun 2019 20:15:14 +0100 rpressler templatize RegisterMap functionscont
Mon, 17 Jun 2019 22:51:22 +0200 mgronlun Mergefibers
Mon, 17 Jun 2019 22:50:02 +0200 mgronlun adjust oopMapStubGenerator_x86.cpp to support Windows platformcont
Mon, 17 Jun 2019 17:25:50 +0100 rpressler Mergefibers
Mon, 17 Jun 2019 17:25:19 +0100 rpressler add freeze fast pathcont
Sun, 16 Jun 2019 11:54:17 -0700 cjplummer Mergefibers
Sun, 16 Jun 2019 11:43:43 -0700 cjplummer Support 4 different run modes + bit of cleanup in the agent.fibers
Fri, 14 Jun 2019 15:09:31 -0700 cjplummer Enable walk_cont flag for some stack walking.cont
Sun, 16 Jun 2019 18:42:37 +0100 alanb Mergefibers
Sun, 16 Jun 2019 18:36:13 +0100 alanb Initial Poller implementation for Windowsfibers
Fri, 14 Jun 2019 15:09:31 -0700 cjplummer Enable walk_cont flag for some stack walking.fibers
Thu, 13 Jun 2019 19:32:04 +0100 rpressler Mergefibers
Thu, 13 Jun 2019 19:29:18 +0100 rpressler fix perftest and oopmap stub regressionscont
Wed, 12 Jun 2019 12:32:08 -0700 dlong Mergeprocessorid
Wed, 12 Jun 2019 14:08:23 +0200 mgronlun Mergefibers
Wed, 12 Jun 2019 14:06:37 +0200 mgronlun coalesce basic blocks and tighten cont_doYieldcont
Tue, 11 Jun 2019 20:00:25 +0100 rpressler Mergefibers
Tue, 11 Jun 2019 19:59:48 +0100 rpressler fix linux buildcont
Tue, 11 Jun 2019 16:12:43 +0100 rpressler Mergefibers
Tue, 11 Jun 2019 16:12:03 +0100 rpressler fix linux build; remove unused functioncont
Tue, 11 Jun 2019 13:45:20 +0100 rpressler Mergefibers
Tue, 11 Jun 2019 13:44:53 +0100 rpressler fix deopt issuecont
Mon, 10 Jun 2019 19:03:56 +0100 rpressler Mergefibers
Mon, 10 Jun 2019 19:02:43 +0100 rpressler Introduce UseContinuationLazyCopy to control lazy copy and have it on by defaultcont
Mon, 10 Jun 2019 18:31:35 +0200 mgronlun Mergefibers
Mon, 10 Jun 2019 18:29:59 +0200 mgronlun Restore FrameInfo to r11 in StubGeneratorcont
Mon, 10 Jun 2019 17:04:46 +0200 mgronlun Fix build issue with uninitialized variable in DoContinueSingleStepTestfibers
Mon, 10 Jun 2019 16:44:27 +0200 mgronlun Exclude NetSockets and NioChannels tests for Windowsfibers
Mon, 10 Jun 2019 16:42:40 +0200 mgronlun Mergefibers
Mon, 10 Jun 2019 16:40:18 +0200 mgronlun VM support for Windowscont
Sun, 09 Jun 2019 22:47:49 -0700 cjplummer fixed typo in commentfibers
Sun, 09 Jun 2019 22:46:33 -0700 cjplummer Test single stepping into Continuation.doContinue()fibers
Sat, 08 Jun 2019 04:00:20 +0100 rpressler Mergefibers
Sat, 08 Jun 2019 03:59:54 +0100 rpressler cleanupcont
Sat, 08 Jun 2019 03:37:46 +0100 rpressler Mergefibers
Sat, 08 Jun 2019 03:36:50 +0100 rpressler fix deopt and copy_ref_stack regressionscont
Fri, 07 Jun 2019 21:47:47 +0100 rpressler Mergefibers
Fri, 07 Jun 2019 21:47:18 +0100 rpressler fix ContYieldBreakPointTestcont
Fri, 07 Jun 2019 19:04:56 +0100 rpressler Mergefibers
Fri, 07 Jun 2019 19:04:12 +0100 rpressler cleanupcont
Fri, 07 Jun 2019 15:48:13 +0100 rpressler Mergefibers
Fri, 07 Jun 2019 15:47:37 +0100 rpressler fix deopt issuecont
Thu, 06 Jun 2019 16:56:10 +0100 alanb Mergefibers
Thu, 06 Jun 2019 15:10:49 +0100 alanb Mergecont
Wed, 05 Jun 2019 21:14:46 +0200 stuefe 8225348: serviceability/dcmd/vm/EventsTest.java failedjdk-13+24
Wed, 05 Jun 2019 09:12:45 +0200 stuefe 8223777: In posix_spawn mode, failing to exec() jspawnhelper does not result in an error
Wed, 05 Jun 2019 14:07:14 -0400 dcubed 8188872: runtime/ErrorHandling/TimeoutInErrorHandlingTest.java fails intermittently
Wed, 05 Jun 2019 14:01:01 -0400 dcubed 8224793: os::die() does not honor CreateCoredumpOnCrash option
Wed, 05 Jun 2019 10:49:09 -0700 darcy 8225353: Add @jls links to java.lang.Enum
Wed, 05 Jun 2019 19:34:43 +0200 stuefe 8225225: stringStream internal buffer should always be zero terminated
Wed, 05 Jun 2019 08:43:41 -0700 mikael 8225305: ProblemList java/lang/invoke/VarHandles tests
Wed, 05 Jun 2019 08:24:03 -0700 jjg 8225346: Convert file to HTML5
Wed, 05 Jun 2019 07:49:20 -0700 mchung 8221368: Error message when module main class cannot be loaded is missing exception details
Wed, 05 Jun 2019 16:26:13 +0200 hannesw 8221709: replace use of style blockListLast
Wed, 05 Jun 2019 10:21:02 -0400 rriggs 8220238: Enhancing j.l.Runtime/System::gc specification with an explicit 'no guarantee' statement
Wed, 05 Jun 2019 15:19:13 +0200 shade 8225342: Shenandoah: use COMPILER2_OR_JVMCI macro consistently
Wed, 05 Jun 2019 09:15:42 -0400 zgu 8225341: Shenandoah: CM::update_thread_roots() needs to handle derived pointers
Wed, 05 Jun 2019 13:59:44 +0100 chegar 8225037: java.net.JarURLConnection::getJarEntry() throws NullPointerException
Tue, 21 May 2019 09:08:01 +0200 roland 8224580: Matcher can cause oop field/array element to be reloaded
Wed, 05 Jun 2019 12:02:01 +0100 chegar 8225214: Socket.getOption(SocketOption) not returning the expected type for the StandardSocketOptions.SO_LINGER
Fri, 31 May 2019 14:52:01 +0200 mdoerr 8222103: [testbug] compiler/compilercontrol/jcmd/ClearDirectivesFileStackTest may exceed VM limit
Wed, 05 Jun 2019 10:43:45 +0200 pliden 8225084: gc/z/TestHighUsage.java fails with unexpected allocation stall
Wed, 05 Jun 2019 10:43:45 +0200 pliden 8224965: ZGC: Strengthen ZHeap::is_in()
Wed, 05 Jun 2019 10:43:44 +0200 pliden 8224962: ZGC: Strengthen ZHeap::is_oop()
Wed, 05 Jun 2019 10:23:06 +0200 redestad 8224240: Properties.load fails to throw IAE on malformed unicode in certain circumstances
Wed, 05 Jun 2019 10:07:22 +0200 redestad 8225179: (regex) Minor Pattern cleanup
Wed, 05 Jun 2019 09:23:09 +0200 shade 8225229: Shenandoah: trim down default number of GC threads
Wed, 05 Jun 2019 08:59:17 +0200 stuefe 8224181: On child process spawn, child may write to random file descriptor instead of the fail pipe
Wed, 05 Jun 2019 07:25:09 +0200 stuefe 8224600: Provide VM.events command
Tue, 04 Jun 2019 18:59:53 -0700 smarks 8225315: test java/util/ArrayDeque/WhiteBox.java isn't part of the jdk_collections test group
Wed, 05 Jun 2019 09:58:05 +0800 weijun 8193255: Root Certificates should be stored in text format and assembled at build time
Tue, 04 Jun 2019 18:55:53 -0700 igerasim 8225198: Optimize regex tree for greedy quantifiers of type {N,}
Tue, 04 Jun 2019 21:25:40 -0400 dholmes 8225217: Backout: JDK-8224814: Remove dead JNIHandleBlock freelist code
Tue, 04 Jun 2019 18:12:25 -0700 mikael 8225307: ProblemList compiler/codegen/TestCharVect2.java and compiler/c2/cr6340864/TestLongVect.java
Tue, 04 Jun 2019 16:50:25 -0700 jjg 8225324: Bad HTML in jdk.jfr module-info.java
Tue, 04 Jun 2019 15:42:16 -0700 jjg 8225314: broken links in java.base
Tue, 04 Jun 2019 14:47:25 -0700 jjg 8225309: HTML issues in jdk.jdi module
Tue, 04 Jun 2019 13:47:59 -0700 jjg 8225306: bad headings in java.sql.rowset SyncProvider.java
Tue, 04 Jun 2019 12:50:15 -0700 mchung 8222448: java/lang/reflect/PublicMethods/PublicMethodsTest.java times out
Tue, 04 Jun 2019 12:44:53 -0700 kvn 8225019: Update JVMCI
Tue, 04 Jun 2019 11:55:51 -0700 smarks 8217412: deprecate rmic for removal
Tue, 04 Jun 2019 11:29:29 -0700 jjg 8223805: DocCommentParser should allow for <main> and </main>
Tue, 04 Jun 2019 13:26:20 -0400 kbarrett 8212630: jtreg/gc/logging/TestMetaSpaceLog.java failed with Agent timed out
Tue, 04 Jun 2019 17:51:14 +0200 hannesw 8178982: Javadoc search specification
Tue, 04 Jun 2019 10:29:42 -0400 coleenp 8222468: [TESTBUG] vmTestbase/metaspace/flags/maxMetaspaceSize/TestDescription.java fails with java.lang.NoClassDefFoundError
Tue, 04 Jun 2019 07:54:16 -0700 mseledtsov Merge
Tue, 04 Jun 2019 07:53:12 -0700 mseledtsov 8223396: [TESTBUG] several jfr tests do not clean up files created in /tmp
Tue, 04 Jun 2019 15:52:26 +0100 chegar 6394787: Typos in javadoc of OIS.readObjectOverride and OOS.writeObjectOverride
Tue, 04 Jun 2019 16:33:37 +0200 hannesw 8214126: Method signatures not formatted correctly in browser
Tue, 04 Jun 2019 16:20:42 +0200 hannesw 8222091: Javadoc does not handle package annotations correctly on package-info.java
Tue, 04 Jun 2019 13:34:50 +0530 psadhukhan Merge
Mon, 03 Jun 2019 11:56:48 +0530 jdv 8225105: java/awt/Focus/ShowFrameCheckForegroundTest/ShowFrameCheckForegroundTest.java fails in Windows 10
Mon, 03 Jun 2019 11:06:24 +0530 psadhukhan Merge
Sun, 02 Jun 2019 16:59:41 -0700 tnakamura 8219901: Noto fonts for East Asian countries cannot belong to CompositeFont
Sun, 02 Jun 2019 12:38:45 -0700 prr 8224056: Fix some assignments of string literals to LPSTR (instead of LPCSTR)
Thu, 30 May 2019 17:14:06 -0700 serb 8225032: Fix some C++ conformance issues in AWT Windows code
Thu, 30 May 2019 11:52:23 -0700 prr 8223271: SplashScreen is still shown if defaulting to headless on MacOS
Thu, 30 May 2019 09:23:14 -0700 prr 8225007: java/awt/print/PrinterJob/LandscapeStackOverflow.java may hang
Thu, 30 May 2019 09:16:43 -0700 prr 8225020: Problem list some sanity test failures
Thu, 30 May 2019 10:45:51 +0530 psadhukhan 8224824: ProblemList java/awt/Color/AlphaColorTest failure in linux_x64
Tue, 28 May 2019 16:38:01 +0530 psadhukhan 8224821: java/awt/Focus/NoAutotransferToDisabledCompTest/NoAutotransferToDisabledCompTest.java fails linux-x64
Tue, 28 May 2019 16:35:47 +0530 psadhukhan 8224830: test/jdk/java/awt/Focus/ModalExcludedWindowClickTest/ModalExcludedWindowClickTest.java fails on linux-x64
Mon, 27 May 2019 12:24:26 -0700 prr 8224778: test/jdk/demo/jfc/J2Ddemo/J2DdemoTest.java cannot find J2Ddemo.jar
Fri, 24 May 2019 13:52:33 -0700 prr 8224632: testbug: java/awt/dnd/RemoveDropTargetCrashTest/RemoveDropTargetCrashTest.java fails on MacOS
Fri, 24 May 2019 13:50:56 -0700 prr 8224771: backout RemoveDropTargetCrashTest.java fix to re-push with correct bugid
Fri, 24 May 2019 09:10:10 -0700 prr 8224705: Tests that need to be problem-listed or have printer resources
Thu, 23 May 2019 15:02:47 -0700 prr 8223804: [macos] remove obsoleted reference to security framework in launcher code
Thu, 23 May 2019 10:50:47 +0530 psadhukhan 8211703: JInternalFrame : java.lang.AssertionError: cannot find the internal frame
Tue, 21 May 2019 14:41:43 +0530 psadhukhan 8214702: Wrong text position for whitespaced string in printing Swing text
Fri, 26 Apr 2019 23:32:46 -0700 serb 8222917: GraphicsEnvironment for Unix still have an unused dependency on Solaris
Mon, 20 May 2019 12:17:34 -0700 serb 8213516: jck test api/javax_accessibility/AccessibleState/fields.html fails intermittent
Mon, 20 May 2019 15:42:20 +0100 dmarkov 8214579: JFrame does not paint content in XVFB / X11vnc environment
Mon, 20 May 2019 11:03:05 +0530 psadhukhan 8224096: Add relevant bugid to java/awt/Window/ShapedAndTranslucentWindows/StaticallyShaped.java in ProblemList
Sat, 18 May 2019 23:35:40 -0700 serb 6933331: (d3d/ogl) java.lang.IllegalStateException: Buffers have not been created
Fri, 17 May 2019 22:48:03 -0700 serb 8223766: Remains of ancient code in AWT initialization
Fri, 17 May 2019 22:37:27 -0700 serb 8224152: [macOS] ProblemList tests that leave rubbish on the screen
Fri, 17 May 2019 13:05:21 -0700 prr 8223804: [macos] remove obsoleted reference to security framework in launcher code
Wed, 15 May 2019 15:17:24 +0530 psadhukhan 8223937: PIT: java/awt/Window/ShapedAndTranslucentWindows/StaticallyShaped.java listed twice in ProblemList
Tue, 04 Jun 2019 07:49:58 +0200 stuefe 8225178: [Solaris] os::signal() should call sigaction() with SA_SIGINFO
Mon, 03 Jun 2019 10:28:03 +0200 rwestberg 8223678: Add Visual Studio Code workspace generation support (for native code)
Mon, 03 Jun 2019 17:14:23 -0700 epavlova 8225199: [Graal] compiler/jvmci/compilerToVM/IsMatureVsReprofileTest.java fails with -XX:CompileThresholdScaling=0.1
Mon, 03 Jun 2019 19:42:58 -0400 coleenp 8225212: ProblemList gc/stress/TestReclaimStringsLeaksMemory.java
Mon, 03 Jun 2019 16:24:34 -0700 rfield 8225208: Re-Problem list jdk/jshell/ExceptionsTest.java fails on windows
Mon, 03 Jun 2019 16:16:50 -0700 jjg 8225207: redundant <p> in Instrumentation.java
Mon, 03 Jun 2019 11:04:24 -0700 kkharbas 8224247: AllocateOldGenAt fires assertion failure
Mon, 03 Jun 2019 14:15:11 -0700 iveresov 8225202: Add missing include after JDK-8223320
Mon, 03 Jun 2019 13:21:02 -0700 iveresov 8223320: [AOT] jck test api/javax_script/ScriptEngine/PutGet.html fails when test classes are AOTed
Mon, 03 Jun 2019 21:28:45 +0200 rkennke 8225171: Remove leftovers in shenandoahBarrierSetC1.cpp
Mon, 03 Jun 2019 10:52:18 -0700 erikj 8225140: Build fails if directory contains 'unix'
Mon, 03 Jun 2019 08:21:04 -0700 rfield 8199623: JShell: corralling not restored on drop
Mon, 03 Jun 2019 07:46:47 -0700 rfield 8225151: JShell API: Fix position of @jls tag
Mon, 03 Jun 2019 13:35:08 +0200 eosterlund 8224816: Provide os::processor_id() implementation for Mac OS
Mon, 03 Jun 2019 13:35:05 +0200 eosterlund 8224814: Remove dead JNIHandleBlock freelist code
Mon, 03 Jun 2019 14:50:59 +0200 shade 8225046: Shenandoah metrics logs refactoring
Tue, 21 May 2019 15:46:09 +0200 roland 8173196: [REDO] C2 does not optimize redundant memory operations with G1
Tue, 28 May 2019 14:56:58 +0200 phedlin 8223363: Bad node estimate assertion failure
Mon, 03 Jun 2019 10:51:28 +0200 tschatzl 8223693: Memory wastage in size of per-region type buffers in GC
Mon, 03 Jun 2019 10:50:14 +0200 tschatzl 8223162: Improve ergonomics for Sparse PRT entry sizing
Sun, 02 Jun 2019 17:13:31 -0400 lancea 8212807: tools/jar/multiRelease/Basic.java times out
Sun, 02 Jun 2019 10:08:39 +0200 shade 8225048: Shenandoah x86_32 support
Sun, 02 Jun 2019 10:08:38 +0200 shade 8225111: Make Shenandoah tests work with 32-bit VMs
Sun, 02 Jun 2019 10:08:37 +0200 shade 8225104: 32-bit build failures after JDK-8222252
Sat, 01 Jun 2019 14:09:59 -0700 rfield 8223688: JShell: crash on the instantiation of raw anonymous class
Sat, 01 Jun 2019 13:41:01 -0700 rfield 8080353: JShell: Better error message on attempting to add default method
Sat, 01 Jun 2019 03:18:23 +0200 redestad 8225061: Performance regression in Regex
Fri, 31 May 2019 17:27:28 -0700 jjg 8225134: Update man-page files
Fri, 31 May 2019 15:49:12 -0700 ccheung 8223336: Assert in VirtualMemoryTracker::remove_released_region when running the SharedArchiveConsistency.java test with -XX:NativeMemoryTracking=detail
Fri, 31 May 2019 18:35:17 -0400 vromero 8224083: javadoc Reporter generates warning for Kind.NOTE
Wed, 22 May 2019 15:30:11 -0700 cushon 8224629: Unnecessary cast in LambdaToMethod
Fri, 31 May 2019 13:49:35 -0700 naoto 8223773: DateTimeFormatter Fails to throw an Exception on Invalid CLOCK_HOUR_OF_AMPM and HOUR_OF_AMPM
Fri, 31 May 2019 13:37:58 -0700 erikj 8219788: Configure recommends JDK 8
Fri, 31 May 2019 12:51:36 -0700 iklam 8224692: runtime/appcds tests crash in "HotSpotJVMCI::compute_offset" when running in Graal as JIT mode
Fri, 31 May 2019 14:42:28 -0400 kbarrett 8219149: ProcessTools.ProcessBuilder should print timing info for subprocesses
Fri, 31 May 2019 11:13:58 -0700 bpb 8225117: java/math/BigInteger/SymmetricRangeTests.java fails with ParseException
Fri, 31 May 2019 10:59:54 -0700 jjg 8225129: Fix minor HTML issues in java.naming
Fri, 31 May 2019 13:09:15 -0400 hseigel 8222936: mlvm/anonloader/stress/randomBytecodes/Test.java fails due to "ERROR: There were 1 hangups during parsing."
Fri, 31 May 2019 09:26:27 -0700 jjg 8225094: Fix minor HTML issues in jdk.zipfs
Fri, 31 May 2019 11:17:55 -0400 pchilanomate 8225016: Dead code due to VMOperationQueue::add() always returning true
Tue, 28 May 2019 20:12:16 +0200 azeller 8194231: java/net/DatagramSocket/ReuseAddressTest.java failed with java.net.BindException: Address already in use: Cannot bind
Fri, 31 May 2019 15:02:45 +0100 chegar 8224973: URLStreamHandler.openConnection(URL,Proxy) - spec and implementation mismatch
Thu, 16 May 2019 17:09:11 +0200 phedlin 8225110: IGV build definition uses non-secure transport
Fri, 31 May 2019 12:20:21 +0200 redestad 8224986: (str) optimize StringBuilder.append(CharSequence, int, int) for String arguments
Fri, 31 May 2019 10:13:24 +0200 neliasso 8224538: LoadBarrierNode::common_barrier must check address
Fri, 31 May 2019 08:27:06 +0530 sundar 8216535: tools/jimage/JImageExtractTest.java timed out
Thu, 30 May 2019 21:12:26 -0400 zgu 8225014: Separate ShenandoahRootScanner method for object_iterate
Thu, 30 May 2019 17:28:26 -0700 jjg 8220251: fix headings in java.management
Wed, 29 May 2019 11:55:30 -0400 zgu 8224978: Shenandoah: Allows root verifier to verify some roots outside safepoints with proper locks
Thu, 30 May 2019 16:21:08 -0700 darcy 8224687: Add clarifying overrides of Element.asType to more specific subinterfaces
Thu, 30 May 2019 15:55:16 -0700 sspitsyn 8223718: Checks in check_slot_type_no_lvt() should be always executed
Thu, 30 May 2019 13:45:48 -0700 jjg 8225077: fix references to broken link in java.compiler module
Thu, 30 May 2019 12:45:02 -0700 skuksenko 8223504: Improve performance of forall loops by better inlining of "iterator()" methods
Thu, 30 May 2019 10:29:55 +0800 fyang 8224828: aarch64: rflags is not correct after safepoint poll
Thu, 30 May 2019 11:00:23 -0700 jjg 8225066: Add missing file
Thu, 30 May 2019 10:37:48 -0700 jjg 8224257: fix issues in files generated by pandoc
Thu, 30 May 2019 18:10:34 +0100 chegar 8225060: java.net.DefaultInterface invokes NetworkInterface::getInetAddresses without doPriv
Thu, 30 May 2019 19:12:11 +0300 vlivanov 8223216: C2: Unify class initialization checks between new, getstatic, and putstatic
Thu, 30 May 2019 09:24:13 -0400 mullan 8224767: Add String constants for Canonical XML 1.1 URIs
Thu, 30 May 2019 07:07:15 -0400 bobv 8222252: Java ergonomics limits heap to 128GB with disabled compressed oops
Thu, 30 May 2019 17:30:33 +0530 sundar 8224946: jrtfs URI to Path and Path to URI conversions are wrong
Thu, 30 May 2019 12:36:04 +0100 chegar 8224730: java.net.ServerSocket::toString not invoking checkConnect
Thu, 30 May 2019 13:39:13 +0300 vlivanov 8223213: Implement fast class initialization checks on x86-64
Thu, 30 May 2019 11:42:53 +0200 mgronlun 8224172: assert(jfr_is_event_enabled(id)) failed: invariant
Thu, 30 May 2019 10:21:51 +0200 shade 8225017: [TESTBUG] gc/shenandoah/oom/TestThreadFailure.java takes too long
Thu, 06 Jun 2019 02:23:02 -0700 sspitsyn correct FRAMES_TO_NOTIFY_POP value from 8 to 7 (after enter0 was removed)cont
Wed, 05 Jun 2019 16:03:25 +0100 rpressler Mergefibers
Wed, 05 Jun 2019 16:02:45 +0100 rpressler fix stack-passed args and ref array zeroing regressioncont
Mon, 03 Jun 2019 14:19:31 +0200 rbackman Mergefibers
Mon, 03 Jun 2019 14:18:09 +0200 rbackman Some cleanup and exclude Windows from oopmap stub generation.cont
Thu, 30 May 2019 22:36:20 +0100 rpressler Mergefibers
Thu, 30 May 2019 22:35:49 +0100 rpressler templatize allocationscont
Thu, 30 May 2019 19:54:01 +0100 alanb Mergefibers
Thu, 30 May 2019 19:53:10 +0100 alanb Mergecont
Thu, 30 May 2019 17:10:23 +0100 alanb Mergefibers
Thu, 30 May 2019 16:42:22 +0100 alanb Mergecont
Thu, 30 May 2019 07:19:19 +0100 alanb 8221481: Reimplement the Legacy Socket API
Wed, 29 May 2019 22:17:48 -0400 dholmes 8224790: Remove Xusage.txt file
Thu, 30 May 2019 03:15:06 +0200 jwilhelm Added tag jdk-13+23 for changeset b034d2dee5fc
Wed, 29 May 2019 19:25:45 -0400 dcubed 8225022: Put compiler/graalunit/JttThreadsTest.java on ProblemList-graal.txt
Wed, 29 May 2019 15:29:06 -0700 erikj 8224011: Failure handling in ExecuteWithLog fails in run-test-prebuilt
Wed, 29 May 2019 22:30:14 +0100 clanger 8224729: Cleanups in sun/security/provider/certpath/ldap/LDAPCertStoreImpl.java
Wed, 29 May 2019 13:44:27 -0700 igerasim 8224789: Parsing repetition count in regex does not detect numeric overflow
Wed, 29 May 2019 13:39:08 -0700 xuelei 8224991: Problemlist javax/net/ssl/ServerName/SSLEngineExplorerMatchedSNI.java
Wed, 29 May 2019 13:31:56 -0700 dlong 8224931: disable JAOTC invokedynamic support until 8223533 is fixed
Thu, 16 May 2019 15:58:15 -0700 aeubanks 8224081: SOCKS v4 doesn't work with IPv6
Thu, 30 May 2019 15:19:04 +0100 alanb Mergefibers
Thu, 30 May 2019 15:18:20 +0100 alanb Mergecont
Thu, 30 May 2019 14:44:47 +0100 alanb Mergefibers
Thu, 30 May 2019 14:23:56 +0100 alanb Mergecont
Wed, 29 May 2019 11:58:30 -0700 joehw 8225005: Xerces 2.12.0: License filejdk-13+23
Wed, 29 May 2019 11:54:26 -0700 iignatyev 8224945: googlemock update breaks the build of arm32 and ppc
Wed, 29 May 2019 09:53:28 -0700 darcy 8224012: AnnotatedType implementations of hashCode() lead to StackOverflowError
Wed, 29 May 2019 10:57:19 -0400 zgu 8224875: Shenandoah: ParallelCleaning code unloading should take lock to protect shared code roots array
Wed, 29 May 2019 23:36:36 +0800 weijun 8223053: [xmldsig] Add KeyValue::EC_TYPE
Wed, 22 May 2019 12:17:26 -0400 gromero 8223660: jtreg: Decouple Unsafe from RTM tests
Wed, 29 May 2019 07:48:27 -0700 xuelei 8224984: Problemlist javax/net/ssl/SSLSocket/Tls13PacketSize.java
Wed, 29 May 2019 06:56:19 -0700 xuelei 8224981: Problemlist test/jdk/sun/security/pkcs11/tls/tls12/FipsModeTLS12.java
Wed, 29 May 2019 15:52:12 +0200 hannesw 8224982: JDK-8222318 breaks tools/doclint/html/EntitiesTest.java
Wed, 29 May 2019 09:43:37 -0400 zgu 8224932: Shenandoah: Rename ShenandoahHeapLock, make it general purpose lock
Wed, 29 May 2019 15:25:21 +0200 shade 8224970: ShenandoahRootScanner::roots_do assert is too strong
Wed, 29 May 2019 13:58:05 +0100 chegar 8224477: java.net socket types new-style socket option methods - spec and impl mismatch
Wed, 29 May 2019 08:21:33 -0400 hseigel 8224763: Update man pages to show deprecation of -Xverify:none
Wed, 22 May 2019 10:11:04 +0200 roland 8224496: Shenandoah compilation fails with assert(is_CountedLoopEnd()) failed: invalid node class
Wed, 29 May 2019 13:30:17 +0200 mgronlun 8217089: JFR: Lazy install os interface components for improved startup
Wed, 29 May 2019 12:43:29 +0200 hannesw 8222318: javadoc does not accept valid HTML5 entity names
Wed, 29 May 2019 12:01:21 +0200 rkennke 8224584: Shenandoah: Eliminate forwarding pointer word
Wed, 29 May 2019 09:25:20 +0200 stefank 8223392: Add missing BitMap comments for JDK-8222986
Fri, 24 May 2019 14:32:17 +0200 mbaesken 8224750: Display thread once in Internal exceptions event log lines
Wed, 29 May 2019 13:50:33 +0900 ysuenaga 8223814: SA: jhsdb common help needs to be more detailed
Tue, 28 May 2019 19:01:38 -0300 mbalao 8223482: Unsupported ciphersuites may be offered by a TLS client
Wed, 29 May 2019 07:49:06 +0530 rraghavan 8220449: serviceability/dcmd/compiler/CodelistTest.java failure
Tue, 28 May 2019 16:51:28 -0300 jlaskey 8224908: Revert: 8216553: JrtFileSystemProvider getPath(URI) omits /modules element from file path
Tue, 28 May 2019 21:31:07 +0200 shade 8224796: C code is not compiled correctly due to undefined "i386"
Tue, 28 May 2019 20:47:47 +0200 rehn 8224795: some runtime/SelectionResolution tests are timing out
Tue, 28 May 2019 14:29:29 -0400 mullan Merge
Tue, 28 May 2019 14:28:40 -0400 mullan 8224885: ProblemList sun/security/tools/keytool/KeyToolTest.java and WeakAlgTest.java on Solaris
Tue, 28 May 2019 11:22:23 -0700 jjg Merge
Tue, 28 May 2019 11:21:02 -0700 jjg 8219147: Javadoc should expose covariant return type overrides
Tue, 28 May 2019 19:19:58 +0100 coffeys 8042904: apple.security.KeychainStore.getSalt() calling generateSeed()
Tue, 28 May 2019 10:54:59 -0700 darcy 8224783: Javadoc of String strip methods uses link where linkplain would be better
Tue, 28 May 2019 09:56:47 -0700 vdeshpande 8224558: Fix replicateB encoding
Tue, 28 May 2019 09:40:49 -0700 ccheung 8224548: [TESTBUG] runtime/appcds/jvmti/ClassFileLoadHookTest.java failed: must be shared
Tue, 28 May 2019 10:20:05 -0400 aph Merge
Tue, 28 May 2019 09:13:11 -0400 aph 8224880: AArch64: java/javac error with AllocatePrefetchDistance
Tue, 28 May 2019 19:30:30 +0530 sundar 8216553: JrtFIleSystemProvider getPath(URI) omits /modules element from file path
Tue, 28 May 2019 14:53:57 +0200 thartmann 8224870: Problemlist compiler/c2/Test8004741.java until JDK-8214904 is fixed
Tue, 28 May 2019 08:25:22 -0400 aph Merge
Thu, 23 May 2019 07:57:50 -0400 aph 8224671: AArch64: mauve System.arraycopy test failure
Tue, 28 May 2019 13:28:48 +0200 mgronlun 8221121: applications/microbenchmarks are encountering crashes in tier5
Tue, 28 May 2019 06:42:32 -0400 coleenp 8220688: [TESTBUG] runtime/NMT/MallocStressTest.java timed out
Tue, 28 May 2019 09:41:20 +0200 lucy 8224672: (lib)hsdis-<arch>.so search incorrect after JDK-8213084
Tue, 28 May 2019 12:01:52 +0530 rraghavan 8213416: Replace some enums with static const members in hotspot/compiler
Mon, 27 May 2019 19:46:34 -0700 iignatyev 8222414: bring googlemock v1.8.1
Mon, 27 May 2019 14:34:58 -0400 zgu 8224751: Shenandoah: Shenandoah Verifier should select proper roots according to current GC cycle
Mon, 27 May 2019 19:24:42 +0100 dfuchs 8224761: Replace wildcard address with loopback or local host in tests - part 12
Mon, 27 May 2019 14:57:26 +0200 rkennke 8224836: Backout: JDK-8224626: Shenandoah: Elide barriers on uncommon traps
Mon, 27 May 2019 13:29:11 +0100 aefimov 8224035: Replace wildcard address with loopback or local host in tests - part 9
Thu, 23 May 2019 15:15:01 +0200 mbaesken 8224221: add memprotect calls to event log
Sat, 25 May 2019 20:55:33 +0900 ysuenaga 8224252: [TESTBUG] hotspot/test/serviceability/sa/sadebugd/SADebugDTest.java is timing out again after fix for JDK-8163805
Sat, 25 May 2019 10:54:10 +0100 clanger 8224727: Problem list test security/infra/java/security/cert/CertPathValidator/certification/ActalisCA.java
Fri, 24 May 2019 21:05:19 -0700 sspitsyn 8046018: JVMTI Spec: can_redefine_any_class capability spec is inconsistent
Sat, 25 May 2019 08:30:53 +0800 weijun 6682540: Incorrect SASL DIGEST-MD5 behavior
Fri, 24 May 2019 15:06:58 -0400 lancea 8224682: Remove the com.sun.CORBA.ORBIorTypeCheckRegistryFilter security property
Fri, 24 May 2019 10:28:21 -0700 joehw 8223658: Performance regression of XML.validation in 13-b19
Fri, 24 May 2019 09:47:41 -0700 rhalade 8202651: Test ComodoCA.java fails
Fri, 24 May 2019 08:55:03 -0700 dl 8223245: Miscellaneous changes imported from jsr166 CVS 2019-06
Fri, 24 May 2019 08:51:04 -0700 dl 8220478: java/util/concurrent/ConcurrentHashMap/ToArray.java timed out intermittently
Fri, 24 May 2019 08:47:39 -0700 dl 8224024: java/util/concurrent/BlockingQueue/DrainToFails.java testBounded fails intermittently
Fri, 24 May 2019 08:43:40 -0700 dl 8224176: Fix inconsistencies in @jls tags in java.util.concurrent
Fri, 24 May 2019 08:39:37 -0700 dl 8224698: ConcurrentSkipListMap.java does not compile with the Eclipse Java Compiler
Fri, 24 May 2019 15:34:14 +0100 dfuchs 8224603: Replace wildcard address with loopback or local host in tests - part 11
Fri, 24 May 2019 15:36:48 +0200 lucy 8224742: JLONG_FORMAT_W incompatible with type jlong
Wed, 22 May 2019 21:24:09 -0400 zgu 8224115: Shenandoah: Eliminate RWLock that protects recorded nmethod data array
Fri, 24 May 2019 09:23:58 -0400 zgu 8224679: Shenandoah: Make ShenandoahParallelCodeCacheIterator noncopyable
Fri, 24 May 2019 12:25:18 +0200 jlahoda 8220702: compiling in the context of an automatic module disallows --add-modules ALL-MODULE-PATH
Thu, 23 May 2019 12:36:54 +0530 dkejriwal 8214563: Use {@systemProperty} in specification of system properties in java.nio packages
Fri, 24 May 2019 09:51:02 +0200 thartmann 8224723: [TESTBUG] compiler/arraycopy/TestArrayCopyWithBadOffset.java failed
Thu, 23 May 2019 18:50:48 +0200 lucy 8224652: 32-bit build failures after JDK-8213084
Fri, 24 May 2019 09:02:33 +0200 stuefe 8220394: bufferedStream does not honor size limit
Fri, 24 May 2019 07:56:29 +0100 clanger 8223553: Fix code constructs that do not compile with the Eclipse Java Compiler
Thu, 23 May 2019 18:47:24 -0700 darcy 8224177: Harden annotation processing framework to irregular behavior from processors
Thu, 23 May 2019 18:31:38 -0700 mseledtsov 8224706: [TESTBUG] problem list failing JDK docker API tests
Fri, 24 May 2019 03:17:31 +0200 jwilhelm 8224715: ProblemList compiler/graalunit/HotspotJdk9Test.java
Thu, 23 May 2019 14:14:13 -0700 erikj 8224145: Build compare script fails intermittently on test image native libraries
Thu, 23 May 2019 14:13:09 -0700 erikj 8224677: Dtrace .d files clash with make dependency .d files
Thu, 23 May 2019 13:48:16 -0700 igerasim 7061590: Javadoc issues in Charset and StandardCharsets
Thu, 23 May 2019 17:01:38 +0200 rkennke 8224667: Shenandoah: Post-LRB cleanup
Thu, 23 May 2019 12:57:12 -0700 iklam 8224689: ProblemList runtime/appcds/SharedArchiveConsistency.java
Thu, 23 May 2019 12:21:21 -0700 naoto 8221431: Support for Unicode 12.1
Thu, 23 May 2019 11:37:24 -0700 mseledtsov 8224165: [TESTBUG] Docker tests produce excessive output
Thu, 23 May 2019 10:05:02 -0700 ccheung 8224264: [TESTBUG] HelloDynamicCustom.java test failed on the Windows platform in tiers 6 and 7 testing
Thu, 23 May 2019 09:03:58 -0700 aeubanks 8224635: Revert 8224256 and add back java/security/SecureClassLoader/DefineClass.java test
Thu, 23 May 2019 18:43:47 +0200 redestad 8224202: Speed up Properties.load
Thu, 23 May 2019 08:57:24 -0700 erikj 8221543: Indify-dependent microbenchmarks are broken
Thu, 23 May 2019 11:36:31 +0100 dfuchs 8224656: Problem list java/security/SecureClassLoader/DefineClass.java until JDK-8224635 is fixed
Thu, 23 May 2019 12:12:04 +0200 rkennke 8224626: Shenandoah: Elide barriers on uncommon traps
Thu, 23 May 2019 10:13:29 +0200 rehn 8221734: Deoptimize with handshakes
Thu, 23 May 2019 09:46:49 +0200 thartmann 8223581: C2 compilation failed with assert(!q->is_MergeMem())
Thu, 23 May 2019 08:57:37 +0200 thartmann 8224539: C2 compilation fails during ArrayCopyNode optimizations with assert(i < _max) failed: oob: i=1, _max=1
Thu, 23 May 2019 08:09:29 +0200 pliden 8224185: ZGC: Introduce "High Usage" rule
Wed, 22 May 2019 21:49:31 -0700 darcy 8224628: Note that type parameters are not visited by ElementScanners
Wed, 22 May 2019 21:45:47 -0700 henryjen 8215156: Deprecate the -Xfuture option
Wed, 22 May 2019 21:50:16 -0400 dholmes 8224087: Compile C code for at least C99 Standard compliance
Thu, 23 May 2019 02:36:15 +0200 jwilhelm Added tag jdk-13+22 for changeset 181986c54764
Mon, 20 May 2019 16:47:08 -0700 aeubanks 8224256: test/jdk/java/security/SecureClassLoader/DefineClass.java hardcodes 127.0.0.1
Wed, 22 May 2019 21:38:16 +0000 valeriep 7107615: scalability bloker in javax.crypto.JceSecurity
Thu, 30 May 2019 19:10:50 +0100 rpressler Mergefibers
Thu, 30 May 2019 19:08:50 +0100 rpressler streamline stack array management and fix transition crashcont
Thu, 30 May 2019 14:49:45 +0100 dmacgregor Mergefibers
Thu, 30 May 2019 14:48:13 +0100 dmacgregor Update graal support.cont
Wed, 29 May 2019 18:22:22 +0100 rpressler Mergefibers
Wed, 29 May 2019 18:21:46 +0100 rpressler more refactoring and fix preempt regressioncont
Tue, 28 May 2019 12:52:50 +0200 rbackman Mergefibers
Mon, 27 May 2019 11:24:15 +0200 rbackman Fix potential out of bounds.cont
Wed, 22 May 2019 22:06:28 -0400 dlong LongAdderCPU demo of Linux rseqprocessorid
Fri, 24 May 2019 14:44:23 +0100 alanb Mergefibers
Fri, 24 May 2019 14:36:14 +0200 rbackman Mergecont
Wed, 22 May 2019 21:40:58 +0200 shade 8224522: Shenandoah should apply barriers on deoptimizationjdk-13+22
Thu, 23 May 2019 00:21:39 +0800 aoqi 8224568: minimal and zero build fails after JDK-8213084
Wed, 22 May 2019 21:33:58 +0300 dchuyko 8220072: GCC 8.3 reports errors in java.base
Wed, 22 May 2019 10:51:30 -0700 mseledtsov 8224529: [TESTBUG] JFR TestShenandoahHeapRegion* tests fail on build w/o Shenandoah
Wed, 22 May 2019 20:39:04 +0300 dpochepk 8218966: AArch64: String.compareTo() can read memory after string
Wed, 22 May 2019 20:12:19 +0300 dpochepk 8215792: AArch64: String.indexOf generates incorrect result
Mon, 20 May 2019 14:19:19 -0700 aeubanks 8224248: test/jdk/java/net/InetAddress/CheckJNI.java assumes 127.0.0.1 is available
Wed, 22 May 2019 09:32:02 -0700 jcbeyler 8224500: Put HeapMonitorStatArrayCorrectnessTest in the problem list
Wed, 22 May 2019 09:06:24 -0700 dtitov 8214545: sun/management/jmxremote/bootstrap tests hang in revokeall.exe on Windows
Wed, 22 May 2019 09:26:48 -0400 vromero 8223914: specification of j.l.c.MethodTypeDesc::of should document better the exceptions thrown
Wed, 22 May 2019 09:10:07 -0400 zgu 8224525: Shenandoah: Eliminate shenandoah verifier's side-effects
Wed, 22 May 2019 13:58:19 +0100 dfuchs 8224204: Replace wildcard address with loopback or local host in tests - part 10
Wed, 22 May 2019 13:06:31 +0200 stefank 8224203: Remove need to specify type when using FLAG_SET macros
Wed, 22 May 2019 13:05:37 +0200 stefank 8224201: Simplify JVM flag macro expansions
Wed, 22 May 2019 07:12:18 -0400 zgu 8224508: Shenandoah: Need to update thread roots in final mark for piggyback ref update cycle
Wed, 22 May 2019 13:19:04 +0200 redestad 8224589: Improve startup behavior of SecurityProperties
Wed, 22 May 2019 06:29:08 -0400 smonteith 8224187: Refactor arraycopy_prologue to allow ZGC read barriers on arraycopy
Wed, 22 May 2019 06:13:53 -0400 dholmes 8224570: Update ProblemList-graal.txt
Wed, 22 May 2019 11:19:14 +0200 tschatzl 8224160: Move G1RemSetScanClosure into g1RemSet.cpp file
Wed, 22 May 2019 10:48:46 +0200 shade 8224579: ResourceMark not declared in shenandoahRootProcessor.inline.hpp with --disable-precompiled-headers
Wed, 22 May 2019 08:42:00 +0100 clanger 8224573: Fix windows build after JDK-8221507
Wed, 22 May 2019 09:33:22 +0200 stuefe 8224193: stringStream should not use Resouce Area
Wed, 22 May 2019 07:10:54 +0200 stuefe 8224487: outputStream should not be copyable
Tue, 21 May 2019 20:14:30 -0700 henryjen 8218997: Xusage text, man help, etc doesn't mention -Xlog option.
Tue, 21 May 2019 18:40:29 -0700 igerasim 8223593: Refactor code for reallocating storage
Tue, 21 May 2019 19:19:44 -0400 kbarrett 8224167: Refactor PtrQueue completed buffer processing
Tue, 21 May 2019 14:55:30 -0700 joehw 8219692: DOM and SAX parsers ignore namespace
Tue, 21 May 2019 13:40:56 -0700 naoto 8224105: Cannot parse JapaneseDate string on some specified locales
Tue, 21 May 2019 15:59:46 -0400 vromero 8223725: j.l.c.MethodHandleDesc::of throws undocumented exception IllegalArgumentException
Tue, 21 May 2019 12:29:47 -0700 epavlova 8222482: [Graal] Update java-allocation-instrumenter.jar handling in graalunit README.md
Tue, 21 May 2019 15:44:00 -0400 vromero 8223723: j.l.c.MethodTypeDesc.dropParameterTypes? throws the undocumented exception: IllegalArgumentException
Tue, 21 May 2019 20:53:27 +0200 mgronlun 8220293: Deadlock in JFR string pool
Tue, 21 May 2019 13:06:52 -0400 zgu 8224495: Shenandoah: Do not rescan code roots in final mark pause if it is not degenerated GC
Tue, 21 May 2019 18:22:54 +0200 stuefe 8224034: [TESTBUG] runtime/ErrorHandlerTest/ErrorHandler fails intermittently for case 13 on Windows
Tue, 21 May 2019 09:53:16 -0400 coleenp 8224119: Safepoint cleanup logging logs times for things it doesn't do
Tue, 21 May 2019 15:51:35 +0200 lucy 8213084: Rework and enhance Print[Opto]Assembly output
Tue, 21 May 2019 11:45:37 +0200 mdoerr 8224230: [PPC64, s390] Support AsyncGetCallTrace
Tue, 21 May 2019 15:02:18 +0530 pmuthuswamy 8223733: "Detail" in headings should be "Details"
Tue, 21 May 2019 10:46:08 +0200 rehn 8223313: Use handshakes for CountStackFrames.
Tue, 21 May 2019 10:36:23 +0200 kdobson 8221507: Implement JFR Events for Shenandoah
Tue, 21 May 2019 10:34:57 +0200 rehn 8223306: Remove threads linked list (use ThreadsList's array in SA)
Tue, 21 May 2019 00:52:04 -0700 sspitsyn 8183273: Clarify Instrumentation interface should not be implemented outside java.instrument module
Mon, 20 May 2019 18:18:42 -0700 jjg 8224166: Create a taglet to better handle @jls and @jvms tags
Mon, 20 May 2019 17:29:44 -0700 darcy 8224175: Fix inconsistencies in @jls and @jvms tags
Mon, 20 May 2019 15:18:00 -0700 mseledtsov 8220672: [TESTBUG] TestCPUSets should check that cpuset does not exceed available cores
Mon, 20 May 2019 10:57:57 -0700 jjg 8223663: Update links for tool guides
Mon, 20 May 2019 10:32:10 -0700 jiangli Merge
Wed, 15 May 2019 16:21:51 -0700 aeubanks 8224014: Don't run test/jdk/java/net/NetworkInterface/IPv4Only.java in IPv6 only environment
Wed, 15 May 2019 17:21:18 -0700 aeubanks 8224019: test/jdk/java/nio/channels/DatagramChannel/BasicMulticastTests.java assumes IPv4 is always available
Mon, 20 May 2019 10:16:45 -0700 darcy 8224174: java.lang.Number has a default constructor
Wed, 15 May 2019 09:15:59 -0700 aeubanks 8223214: Inet6AddressImpl.loopbackAddress() should choose loopback address that is available
Mon, 20 May 2019 12:24:05 -0400 lancea 8222807: Address iteration with invalid ZIP header entries
Mon, 20 May 2019 17:44:29 +0200 lucy 8223444: Improve CodeHeap Free Space Management
Mon, 20 May 2019 10:06:07 -0400 coleenp 8221967: InternTest.java timed out