log

age author description
Mon, 15 Aug 2016 10:23:39 -0700 ddehaven Merge
Mon, 15 Aug 2016 20:08:55 +0300 serb 8163949: Cleanup of classes which are related to JavaSound
Mon, 15 Aug 2016 08:15:02 -0700 ddehaven Merge
Fri, 12 Aug 2016 14:35:56 -0700 bpb 8152966: ClassCastException when adding IFD to the TIFFDirectory before the image write
Fri, 12 Aug 2016 20:36:41 +0300 serb 8159696: java.beans.MethodRef#get throws NullPointerException
Fri, 12 Aug 2016 18:43:13 +0300 mcherkas 8160696: IllegalArgumentException: adding a component to a container on a different GraphicsDevice
Thu, 11 Aug 2016 21:48:53 -0500 ptbrunet 8161483: Implement AccessibleAction interface in JList.AccessibleJList.AccessibleJListChild
Thu, 11 Aug 2016 11:35:47 -0700 bpb 8145014: "IIOException: Couldn't seek!" when calling TIFFImageReader.getNumImages()
Thu, 11 Aug 2016 10:37:50 -0700 prr Merge
Wed, 10 Aug 2016 02:50:58 +0300 azvegint 8155690: Update libPNG library to the latest up-to-date
Tue, 09 Aug 2016 16:20:02 -0700 prr 8163238: Upgrade to harfbuzz 1.3.0 in JDK 9
Tue, 09 Aug 2016 12:08:51 +0300 alexsch 8160986: Bad rendering of Swing UI controls with Metal L&F on HiDPI display
Tue, 09 Aug 2016 13:55:27 +0530 jdv 8160455: KSS : class.forName issue in TIFFImageMetadata.java
Tue, 09 Aug 2016 13:45:17 +0530 jdv 8160456: KSS : resource loading issue in TIFFMetadataFormat.java
Tue, 09 Aug 2016 13:22:58 +0530 psadhukhan 5080098: Page Range must be disabled on the common print dlg for Non serv-formatted flvrs
Tue, 09 Aug 2016 10:17:51 +0300 alexsch 8162856: JSlider thumb is twice smaller on HiDPI display
Mon, 08 Aug 2016 11:09:19 -0700 bpb 8150154: AIOOB Exception during sequential write of TIFF images
Mon, 08 Aug 2016 11:40:39 +0400 rstevens 8161664: Memory leak in com.apple.laf.AquaProgressBarUI removed progress bar still referenced
Fri, 05 Aug 2016 12:03:58 -0700 prr Merge
Fri, 05 Aug 2016 16:20:02 +0300 serb 8162970: Merge error in the DefaultRowSorter.java
Fri, 05 Aug 2016 15:48:37 +0530 arapte 8039081: [TEST_BUG] Test java/awt/TrayIcon/PopupMenuLeakTest/PopupMenuLeakTest.java fails
Wed, 03 Aug 2016 15:18:58 +0800 prr 8159713: Make the non-translated keywords clear to translator in jar.properties
Thu, 04 Aug 2016 15:58:28 +0200 clanger 8163177: Fix for 8152971 breaks builds with VS2010
Wed, 03 Aug 2016 17:01:51 -0700 bpb 8155960: TIFF javadoc contains HTML entities inside {@code} tags
Wed, 03 Aug 2016 22:53:38 +0200 lbourges 8159638: Improve array caches and renderer stats in Marlin renderer
Fri, 19 Aug 2016 18:06:46 +0100 chegar 8156841: sun.security.pkcs11.SunPKCS11 poller thread retains a strong reference to the context class loader
Fri, 19 Aug 2016 13:50:03 +0200 redestad 8164451: Generate all zero and identity forms at link time
Fri, 19 Aug 2016 10:03:43 +0200 mhaupt 8164102: MethodHandles.countedLoop/4 works incorrect for start/end = Integer.MAX_VALUE
Fri, 19 Aug 2016 16:29:41 +0900 ysuenaga 8164326: jrtfsviewer.js and jrtls.js does not work
Fri, 19 Aug 2016 06:27:54 +0000 valeriep 8130181: Deprecate java.security.Provider(String, double, String), add Provider(Strin
Thu, 18 Aug 2016 17:30:49 -0700 tvaleev 8164189: Collectors.toSet() parallel performance improvement
Fri, 19 Aug 2016 01:41:54 +0300 igerasim 8153438: Avoid repeated "Please insert a smart card" popup windows
Thu, 18 Aug 2016 17:51:40 -0400 lancea 8164394: Minor correction in Java API doc for DataSource
Thu, 18 Aug 2016 21:34:03 +0000 lana Merge
Thu, 18 Aug 2016 12:48:23 -0700 jnimeh 8162808: Add references to the standard JSSE cipher suite names in javadoc
Thu, 18 Aug 2016 22:07:09 +0300 igerasim 8163517: Various cleanup in java.io code
Thu, 18 Aug 2016 15:05:02 -0400 lancea 8138661: Minor correction in Java API doc for DataSource
Thu, 18 Aug 2016 19:00:39 +0200 redestad 8164044: Generate corresponding simple DelegatingMethodHandles when generating a DirectMethodHandle at link time
Thu, 18 Aug 2016 09:52:43 -0700 amurillo 8164329: Problem list sun/rmi/runtime/Log/6409194/NoConsoleOutput.java on windows due to JDK-8164124
Thu, 18 Aug 2016 16:27:15 +0300 snikandrova 8146602: jdk/test/sun/misc/URLClassPath/ClassnameCharTest.java test fails with NullPointerException
Thu, 18 Aug 2016 12:39:23 -0400 lancea 8161965: Create initial javadoc description for modules
Wed, 17 Aug 2016 16:03:52 -0700 ascarpino 8156192: Provider#compute and #merge methods expect wrong permission & #compute ClassCastException even with wrong permission.
Wed, 17 Aug 2016 21:14:39 +0100 vinnie 6977937: The SunJCE PBKDF2KeyImpl is requiring the MAC instance also be from SunJCE.
Wed, 17 Aug 2016 14:41:17 -0400 mullan Merge
Wed, 17 Aug 2016 14:40:12 -0400 mullan 8164071: Default.policy file missing content for solaris
Wed, 17 Aug 2016 08:44:38 -0700 amurillo Merge
Tue, 16 Aug 2016 08:18:27 -0700 amurillo Merge
Fri, 12 Aug 2016 13:58:18 -0700 amurillo Merge
Mon, 08 Aug 2016 21:59:33 +0900 ysuenaga 8163272: jhsdb jinfo cannot show system properties
Fri, 05 Aug 2016 09:58:09 -0700 amurillo Merge
Thu, 04 Aug 2016 16:11:30 -0700 cjplummer 8162670: make of jtreg_tests fails if no tests are run, causing jprt test runs to also fail
Wed, 17 Aug 2016 10:08:18 +0800 weijun 8087144: sun/security/krb5/auto/MaxRetries.java fails with Retry count is -1 less
Tue, 16 Aug 2016 21:28:10 +0800 weijun 8141411: keytool can wrongly parse the start date value given by the -startdate option
Tue, 16 Aug 2016 12:34:00 +0530 ssahoo 8159964: Update Tests to verify JDK build for "JDK-8159488 Deprivilege java.xml.crypto"
Tue, 16 Aug 2016 15:26:41 +0900 nishjain 8129555: DateFormatSymbols: month-related methods must refer to Calendar constants
Mon, 15 Aug 2016 16:32:41 -0700 asmotrak 8162484: javax/net/ssl/Stapling/SSLSocketWithStapling.java test fails intermittently with "Address already in use" error
Mon, 15 Aug 2016 23:45:32 +0300 igerasim 8163896: Finalizing one key of a KeyPair invalidates the other key
Thu, 18 Aug 2016 21:01:22 +0000 lana Added tag jdk-9+132 for changeset 5542e4584972
Wed, 05 Jul 2017 22:06:09 +0200 duke Merge
Fri, 19 Aug 2016 11:22:14 -0700 amurillo Merge
Tue, 16 Aug 2016 09:56:18 -0400 hseigel 8030221: Checking for anonymous class should check for NULL as well as potential nesting
Mon, 15 Aug 2016 13:14:08 -0700 cjplummer 8133740: NMT for Linux/x86/x64 and bsd/x64 slowdebug builds includes NativeCallStack::NativeCallStack() frame in backtrace
Mon, 15 Aug 2016 13:13:48 -0700 cjplummer 8133747: NMT includes an extra stack frame due to assumption NMT is making on tail calls being used
Mon, 15 Aug 2016 13:06:50 -0700 cjplummer 8133749: os::current_frame() is not returning the proper frame on ARM and solaris-x64
Mon, 15 Aug 2016 16:15:16 +0200 erikj 8069540: Remove universal binaries support from hotspot build
Tue, 09 Aug 2016 21:57:29 +0900 ysuenaga 8163185: jhsdb jstack cannot work with normal mode
Fri, 12 Aug 2016 14:12:55 -0700 amurillo Merge
Fri, 12 Aug 2016 08:46:17 -0700 fparain 8146697: VM crashes in test Test7005594
Fri, 12 Aug 2016 00:19:44 -0400 dholmes 8159461: bigapps/Kitchensink/stressExitCode hits assert: Must be VMThread or JavaThread
Thu, 11 Aug 2016 16:22:08 -0700 iveresov Merge
Tue, 09 Aug 2016 16:47:47 +0300 dpochepk 8160299: Test8015436 doesn't check which method was executed
Tue, 09 Aug 2016 14:17:28 +0300 dpochepk 8163366: compiler/codecache/jmx/ThresholdNotificationsTest.java doesn't set -XX:+UnlockDiagnosticVMOptions while using WB
Tue, 09 Aug 2016 14:16:44 +0300 dpochepk 8160083: compiler.codecache.jmx.InitialAndMaxUsageTest can not be used w/ disabled SegmentedCodeCache
Mon, 08 Aug 2016 17:06:21 +0200 dnsimon 8163105: SIGSEGV: constantPoolHandle::constantPoolHandle(ConstantPool*)
Mon, 08 Aug 2016 11:30:46 +0300 dpochepk 8163243: [TESTBUG] compiler/codecache/jmx/UsageThresholdIncreasedTest.java failed with: Failed to find sun/hotspot/WhiteBox.class
Sat, 06 Aug 2016 11:52:37 -0700 iveresov 8163313: assert(comp != __null) failed: compiler not available
Fri, 05 Aug 2016 13:37:53 -0700 iveresov Merge
Fri, 05 Aug 2016 16:23:44 +0300 dpochepk 8157498: compiler/codecache/jmx/InitialAndMaxUsageTest.java times out on 32-bit platforms
Fri, 05 Aug 2016 16:22:30 +0300 dpochepk 8161279: Various JMX-tests timed out
Thu, 04 Aug 2016 22:42:05 -0400 mdoerr 8162369: PPC64: Wrong ucontext used after SIGTRAP while in HTM critical section
Thu, 04 Aug 2016 10:34:34 +0200 thartmann 8136818: Test compiler/arraycopy/TestEliminatedArrayCopyDeopt.java fails with "m1 failed"
Thu, 04 Aug 2016 08:58:22 +0200 thartmann 8162881: Effect of -XX:CICompilerCount depends on ordering of other flags
Wed, 03 Aug 2016 15:52:38 +0000 never Merge
Tue, 02 Aug 2016 17:12:16 -0700 never 8162477: [JVMCI] assert(wf.check_method_context(ctxk, m)) failed: proper context
Tue, 02 Aug 2016 19:46:29 -0700 kvn 8163018: Slow compiler tests in JPRT
Thu, 11 Aug 2016 21:35:09 +0200 dcubed Merge
Thu, 11 Aug 2016 16:13:05 +0000 lfoltan Merge
Thu, 11 Aug 2016 11:41:11 -0400 lfoltan 8162553: Crash in class unloading due to null CLD having a zero _keep_alive value
Thu, 11 Aug 2016 17:47:25 +0300 dsamersoff 8163143: illegal bci error with interpreted frames in SA due to mirror being stored in interpreted frames
Wed, 10 Aug 2016 21:02:14 -0400 ysuenaga 8163580: Cannot get Monitor Cache Dump in HSDB
Wed, 10 Aug 2016 09:24:42 +0200 rehn 8161026: GPL header missing comma in year
Thu, 18 Aug 2016 21:33:36 +0000 lana Merge
Tue, 16 Aug 2016 08:08:00 -0700 amurillo Merge
Thu, 11 Aug 2016 12:27:20 -0700 dcubed 8163879: quarantine serviceability/sa/sadebugd/SADebugDTest.java since it hangs intermittently
Fri, 12 Aug 2016 13:58:14 -0700 amurillo Merge
Mon, 08 Aug 2016 15:53:02 +0000 dsamersoff Merge
Mon, 08 Aug 2016 21:59:12 +0900 ysuenaga 8163272: jhsdb jinfo cannot show system properties
Mon, 08 Aug 2016 17:15:46 +0300 dsamersoff 8163269: Testcase missed in push for JDK-8160817
Fri, 05 Aug 2016 09:58:09 -0700 amurillo Merge
Thu, 04 Aug 2016 16:11:49 -0700 cjplummer 8162670: make of jtreg_tests fails if no tests are run, causing jprt test runs to also fail
Thu, 04 Aug 2016 23:17:33 +0200 mockner Merge
Thu, 04 Aug 2016 12:55:28 -0400 mockner 8145543: JPRT jobs see intermittent failures in compiler/floatingpoint/ModNaN.java
Thu, 04 Aug 2016 19:50:23 +0000 coleenp Merge
Thu, 04 Aug 2016 10:11:35 -0700 gthornbr 8162999: Build give extraneous find warnings
Thu, 04 Aug 2016 20:28:12 +0200 mockner Merge
Thu, 04 Aug 2016 18:34:40 +0200 mockner Merge
Thu, 04 Aug 2016 12:24:10 -0400 mockner 8159917: Space character is missing in ClassLoaderData::print_value_on
Thu, 04 Aug 2016 14:04:14 +0300 lmesnik 8162852: Mark stress compiler and gc tests with stress keyword
Wed, 03 Aug 2016 15:55:40 -0700 iveresov Merge
Tue, 02 Aug 2016 11:06:25 -0700 dlong 8029441: assert(!((nmethod*)_cb)->is_deopt_pc(_pc)) failed: invariant broken
Mon, 01 Aug 2016 22:34:23 -0700 kvn Merge
Sat, 30 Jul 2016 04:05:28 -0700 roland 8161652: Crash with assert(ft == _type) failed in PhiNode::Value()
Wed, 03 Aug 2016 13:56:27 -0700 cjplummer 8161030: GPL header missing comma after year
Wed, 03 Aug 2016 09:40:21 -0400 coleenp 8159284: bigapps/Jetty - assert(jfa->last_Java_sp() > sp()) failed with JFR in use
Tue, 02 Aug 2016 20:55:27 -0700 dcubed Merge
Tue, 02 Aug 2016 13:48:07 -0700 gthornbr 8161696: [TESTBUG] runtime/StackGuardPages/testme.sh uses invalid argument -Xss328k
Wed, 03 Aug 2016 02:10:23 +0000 jprovino Merge
Tue, 02 Aug 2016 16:39:33 -0400 jprovino 8071770: G1 does not implement millis_since_last_gc which is needed by RMI GC
Thu, 18 Aug 2016 21:01:21 +0000 lana Added tag jdk-9+132 for changeset a11ec8919fef
Mon, 22 Aug 2016 08:27:08 -0700 amurillo Merge
Fri, 19 Aug 2016 11:22:13 -0700 amurillo Merge
Mon, 15 Aug 2016 16:14:59 +0200 erikj 8069540: Remove universal binaries support from hotspot build
Fri, 19 Aug 2016 07:54:03 -0700 tbell 8164402: key word 'requires' appearing in comment causing a build failure
Thu, 18 Aug 2016 21:01:21 +0000 lana Added tag jdk-9+132 for changeset cbba9772b2be
Wed, 05 Jul 2017 22:05:30 +0200 duke Added tag jdk-9+132 for changeset 2e83d21d78cd
Wed, 05 Jul 2017 22:05:29 +0200 duke Mergejdk-9+132
Wed, 05 Jul 2017 22:05:22 +0200 duke Merge
Mon, 15 Aug 2016 08:28:26 +0200 jlahoda 8129421: JShell: unacceptable suggestions in 'extends', 'implements' in smart completion
Sat, 13 Aug 2016 09:42:26 -0700 vromero 8067485: ct.properties has no copyright notice
Fri, 12 Aug 2016 17:45:31 -0700 jjg 8052398: Uniqify test framework class names
Fri, 12 Aug 2016 16:03:36 -0700 jjg 8160137: HTMLDoclet and AbstractDoclet should implement Doclet
Fri, 12 Aug 2016 15:41:47 -0700 jjg 8163524: doclet resources doclet.usage.NAME.name are redundant
Fri, 12 Aug 2016 11:49:18 +0530 sadayapalam 8068626: Add javac lint warning when the @Deprecated annotation is used where it is a no-op
Thu, 11 Aug 2016 17:02:00 +0000 lana Merge
Thu, 11 Aug 2016 17:26:12 +0200 jlahoda 8133884: javac moduleName/className and moduleName/packageName options
Wed, 10 Aug 2016 16:19:09 -0700 ksrini 8152054: fix @ignored langtools/test/jdk/javadoc/tool/ tests
Wed, 10 Aug 2016 15:54:25 -0700 mchung Merge
Wed, 10 Aug 2016 15:47:46 -0700 jjg 8136930: Simplify use of module-system options by custom launchers
Wed, 10 Aug 2016 15:52:26 -0700 rfield 8163817: JShell tests: disable minor failing editor tool cases: 8161276, 8163816, 8159229
Wed, 10 Aug 2016 13:52:02 -0700 vromero 8160156: javac is generating let expressions unnecessarily
Wed, 10 Aug 2016 10:47:43 -0700 rfield 8163500: JShell: ProblemList.txt update: 8139872 and 8080843 fixed
Tue, 09 Aug 2016 23:00:49 -0700 rfield 8143964: JShell API: convert query responses to Stream instead of List
Tue, 09 Aug 2016 13:22:57 -0700 jjg 8160697: HTMLWriter needs perf cleanup
Tue, 09 Aug 2016 20:27:06 +0200 jlahoda 8143048: Re-examine dependency on property sun.boot.class.path
Tue, 09 Aug 2016 07:31:16 -0700 ksrini 8075529: Documentation in DocumentationTool.getTask(...) should mention about "null" parameter for doclet.
Thu, 11 Aug 2016 15:47:10 +0000 lana Added tag jdk-9+131 for changeset 48d9e26a8fa4
Wed, 05 Jul 2017 22:05:10 +0200 duke Merge
Thu, 11 Aug 2016 17:02:08 +0000 lana Merge
Wed, 10 Aug 2016 15:49:27 -0700 mchung 8136930: Simplify use of module-system options by custom launchers
Thu, 11 Aug 2016 15:47:08 +0000 lana Added tag jdk-9+131 for changeset 11487423d488
Wed, 05 Jul 2017 22:05:03 +0200 duke Merge
Thu, 11 Aug 2016 13:34:30 -0700 joehw 8163535: javax/xml/jaxp/unittest/catalog/CatalogSupport2.java failed due to SocketTimeoutException
Thu, 11 Aug 2016 17:02:17 +0000 lana Merge
Thu, 11 Aug 2016 10:20:44 +0800 fyuan 8163468: javax/xml/jaxp/unittest/validation/Bug6773084Test.java fails intermittently
Wed, 10 Aug 2016 15:49:23 -0700 mchung 8136930: Simplify use of module-system options by custom launchers
Thu, 04 Aug 2016 13:58:06 +0800 lana 8163145: Remove two null line in the end of message.properties
Thu, 11 Aug 2016 15:47:08 +0000 lana Added tag jdk-9+131 for changeset 64662417aa2d
Wed, 05 Jul 2017 22:04:55 +0200 duke Merge
Thu, 11 Aug 2016 17:02:59 +0000 lana Merge
Wed, 10 Aug 2016 15:49:16 -0700 mchung 8136930: Simplify use of module-system options by custom launchers
Wed, 10 Aug 2016 09:21:58 -0700 sdama 8134304: NPE in initialization of OptimisticTypesPersistence
Thu, 11 Aug 2016 15:47:10 +0000 lana Added tag jdk-9+131 for changeset b381e616c242
Wed, 05 Jul 2017 22:04:45 +0200 duke Merge
Thu, 11 Aug 2016 15:47:07 +0000 lana Added tag jdk-9+131 for changeset e0d360ea22db
Wed, 05 Jul 2017 22:04:38 +0200 duke Merge
Mon, 15 Aug 2016 09:16:31 -0700 dl 8162627: Miscellaneous changes imported from jsr166 CVS 2016-08
Mon, 15 Aug 2016 09:13:22 -0700 dl 8151158: [TESTBUG] java/util/concurrent/forkjoin/FJExceptionTableLeak.java fails due to out of memory
Mon, 15 Aug 2016 09:09:00 -0700 dl 8163210: java/util/concurrent/tck/JSR166TestCase.java testWriteAfterReadLock(StampedLockTest): timed out waiting for thread to terminate
Mon, 15 Aug 2016 09:04:40 -0700 dl 8162805: Optimize AtomicBoolean.getAndSet
Mon, 15 Aug 2016 14:25:51 +0100 vinnie 8163503: PKCS12 keystore cannot store non-X.509 certificates
Sat, 13 Aug 2016 02:21:30 +0000 xuelei 8162362: Introduce system property to control enabled ciphersuites
Fri, 12 Aug 2016 20:14:25 +0300 snikandrova 8145732: Duplicate entry in http.nonProxyHosts will ignore subsequent entries
Fri, 12 Aug 2016 17:35:01 +0200 redestad 8163946: java/lang/String/concat/WithSecurityManager.java fails after 8163878
Fri, 12 Aug 2016 11:30:23 +0200 redestad 8163878: Remove unnecessary bridge methods, allocations in java.lang.invoke
Fri, 12 Aug 2016 14:38:02 +0800 fyuan 8163435: Update issue number for SupportedDHKeys.java and UnsupportedDHKeys.java in ProblemList
Fri, 12 Aug 2016 14:36:14 +0800 fyuan 8161340: ProblemList.txt update for sun/security/tools/keytool/autotest.sh
Fri, 12 Aug 2016 14:34:45 +0800 fyuan 8160611: Clean up ProblemList.txt for closed/resolved issues
Fri, 12 Aug 2016 00:47:06 +0000 valeriep 8154113: java.security.AccessControlException: access denied ("java.security.SecurityPermission" "authProvider.SunMSCAPI")
Fri, 12 Aug 2016 00:39:34 +0000 valeriep 8157579: com/sun/crypto/provider/Mac/MacClone.java failed on solaris12(sparcv9 and x86)
Fri, 12 Aug 2016 00:10:07 +0000 valeriep 6469513: (smartcardio) CardPermission(String termName, String actions) violates specification
Thu, 11 Aug 2016 23:41:48 +0300 igerasim 8163877: Tests added in JDK-8163518 fail on some platforms
Thu, 11 Aug 2016 17:02:46 +0000 lana Merge
Thu, 11 Aug 2016 17:03:40 +0300 igerasim 8163518: Integer overflow in StringBufferInputStream.read() and CharArrayReader.read/skip()
Thu, 11 Aug 2016 13:10:54 +0800 weijun 8133910: Some sun/security/tools tests failed.
Wed, 10 Aug 2016 15:51:25 -0700 mchung 8136930: Simplify use of module-system options by custom launchers
Wed, 10 Aug 2016 22:48:25 +0100 prappo 8163586: java.net.http.RawChannel has been made public by mistake
Wed, 10 Aug 2016 22:49:05 +0200 redestad 8163814: JDK build has been failing after 8163373
Wed, 10 Aug 2016 21:55:25 +0200 redestad 8163373: Rewrite GenerateJLIClassesPlugin to avoid reflective calls into java.lang.invoke
Wed, 10 Aug 2016 17:55:08 +0200 simonis 8163408: Fix wrong prototype of getNativeScaleFactor() in systemScale.h
Wed, 10 Aug 2016 13:54:38 +0200 redestad 8163370: Reduce number of classes loaded by common usage of java.lang.invoke
Wed, 10 Aug 2016 11:54:12 +0100 coffeys 8163104: Unexpected NPE still possible on some Kerberos ticket calls
Tue, 09 Aug 2016 22:31:41 -0700 jnimeh 8132943: ServerHandshaker may select non-empty OCSPStatusRequest structures when Responder ID
Wed, 10 Aug 2016 11:30:53 +0800 weijun 8162739: Create new keytool option to access cacerts file
Wed, 10 Aug 2016 11:21:01 +0800 weijun 8163489: Avoid using Utils.getFreePort() in TsacertOptionTest.java test
Fri, 29 Jul 2016 09:58:28 -0700 sdrach 8158295: Add a multi-release jar validation mechanism to jar tool
Tue, 09 Aug 2016 07:50:26 -0700 bpb 8163305: Add some print instrumentation to java/nio/channels/Selector/RacyDeregister
Tue, 09 Aug 2016 07:43:48 -0700 bpb 8163431: probeContentType/Basic.java fails after changes for JDK-8146215
Thu, 11 Aug 2016 15:47:09 +0000 lana Added tag jdk-9+131 for changeset 6863c0579ecf
Wed, 05 Jul 2017 22:04:25 +0200 duke Merge
Fri, 12 Aug 2016 08:59:20 -0700 mhaupt 8163533: jdk.vm.ci.hotspot.test.MethodHandleAccessProviderTest fails on jdk9/dev
Thu, 11 Aug 2016 17:02:27 +0000 lana Merge
Wed, 10 Aug 2016 15:48:04 -0700 hseigel 8136930: Simplify use of module-system options by custom launchers
Thu, 11 Aug 2016 15:47:07 +0000 lana Added tag jdk-9+131 for changeset 2bf4f6d6a72f
Thu, 11 Aug 2016 17:01:55 +0000 lana Merge
Wed, 10 Aug 2016 15:49:03 -0700 mchung 8136930: Simplify use of module-system options by custom launchers
Thu, 11 Aug 2016 15:47:07 +0000 lana Added tag jdk-9+131 for changeset 1ca743d80734
Wed, 05 Jul 2017 22:04:05 +0200 duke Added tag jdk-9+131 for changeset 4d2a15091124
Wed, 05 Jul 2017 22:04:04 +0200 duke Mergejdk-9+131
Wed, 05 Jul 2017 22:03:58 +0200 duke Merge
Mon, 08 Aug 2016 11:48:02 -0700 vromero 8162874: AST nodes representing operators should have a common superclass
Mon, 08 Aug 2016 17:22:44 +0200 jlahoda 8144733: Iterating over elements of a Scope can return spurious inner class elements
Thu, 04 Aug 2016 17:48:48 +0000 amurillo Merge
Thu, 04 Aug 2016 10:07:48 +0200 erikj 8157100: missing dependency in build system
Wed, 03 Aug 2016 16:01:09 -0700 jjg 8162359: javac should use stdout for --help and --version
Wed, 03 Aug 2016 11:30:27 -0700 darcy 8163113: langtools repeating annotations tests depend rely on annotations toString output
Wed, 03 Aug 2016 10:05:37 -0700 darcy 8163115: Temporarily problem list javac repeating annotations tests
Tue, 02 Aug 2016 13:14:12 -0700 bpatel 8154817: Fix the click-through navigation for modules
Thu, 04 Aug 2016 17:32:55 +0000 amurillo Added tag jdk-9+130 for changeset 4923274643f2
Wed, 05 Jul 2017 22:03:48 +0200 duke Merge
Mon, 08 Aug 2016 10:15:29 -0400 rriggs 8163266: Doc for ValidationEvent#getSeverity() should say it returns a constant from ValidationEvent instead of ValidationError
Thu, 04 Aug 2016 17:32:53 +0000 amurillo Added tag jdk-9+130 for changeset 86902ef5ff79
Wed, 05 Jul 2017 22:03:41 +0200 duke Merge
Mon, 08 Aug 2016 12:50:00 +0800 fyuan 8067170: Enable security manager on JAXP unit tests and make some improvement
Thu, 04 Aug 2016 17:47:31 -0700 joehw 8160069: RuntimeException thrown by XPathFactory::newInstance missing the cause
Thu, 04 Aug 2016 17:32:53 +0000 amurillo Added tag jdk-9+130 for changeset 00e4298ae168
Wed, 05 Jul 2017 22:03:31 +0200 duke Merge
Mon, 08 Aug 2016 12:51:44 +0200 hannesw 8162955: Activate anonymous class loading for small sources
Thu, 04 Aug 2016 17:49:29 +0000 amurillo Merge
Tue, 02 Aug 2016 12:39:25 +0200 hannesw 8162771: Strict equality operators should not be optimistic
Thu, 04 Aug 2016 17:32:55 +0000 amurillo Added tag jdk-9+130 for changeset bb2621620e5f
Wed, 05 Jul 2017 22:03:22 +0200 duke Merge
Thu, 04 Aug 2016 17:32:52 +0000 amurillo Added tag jdk-9+130 for changeset 78f922bcd6cf
Wed, 05 Jul 2017 22:03:13 +0200 duke Merge
Tue, 09 Aug 2016 15:02:27 +0200 redestad 8163476: java/lang/StackWalker/VerifyStackTrace.java fails after JDK-8163369
Tue, 09 Aug 2016 10:00:31 +0200 redestad 8163369: Enable generating DMH classes at link time
Tue, 09 Aug 2016 09:42:01 +0200 redestad 8162815: unnecessary object creation in reflection
Tue, 09 Aug 2016 09:44:25 +0530 sundar 8163382: ResourcePoolManager.findEntry has a bug in startsWith call
Mon, 08 Aug 2016 13:58:14 -0700 bpb 8162745: content-types.properties files are missing some modern types
Mon, 08 Aug 2016 13:57:51 -0700 bpb 8146215: (fs) java/nio/file/Files/probeContentType/Basic.java failed frequently on Solaris-sparc with Unexpected type: text/plain
Mon, 08 Aug 2016 11:04:57 -0700 amurillo Merge