log

age author description
Mon, 05 Aug 2019 11:11:18 +0530 rpatil 8158880: test/java/time/tck/java/time/format/TCKDateTimeFormatterBuilder.java fail with zh_CN locale
Mon, 05 Aug 2019 07:59:42 -0700 erikj 8058539: Platform specific source files may not end up in src.zip
Mon, 05 Aug 2019 15:29:09 +0200 hannesw 8228393: Add an indicator for external links in javadoc
Sat, 03 Aug 2019 09:04:04 +0800 jiefu 8229020: Failure on CPUs allowing loads reordering: assert(_tasks[t] == 1) failed: What else?
Mon, 05 Aug 2019 08:03:25 +0200 thartmann 6394013: C2: Remove VerifyOpto
Fri, 02 Aug 2019 13:51:34 -0700 mseledtsov 8228687: [TESTBUG] exclude Container tests from hotspot_misc group
Fri, 02 Aug 2019 15:13:10 -0400 dcubed 8229032: ProblemList jdk/internal/platform/docker/TestDockerMemoryMetrics.java
Fri, 02 Aug 2019 11:24:59 -0700 jcbeyler 8228998: Remove the testing against NSK_FALSE from tests
Fri, 02 Aug 2019 11:28:58 +0200 mdoerr 8228649: [PPC64] SA reads wrong slots from interpreter frames
Fri, 02 Aug 2019 11:21:41 +0200 rkennke 8229002: Shenandoah: Missing node types in ShenandoahLoadReferenceBarrier::needs_barrier_impl()
Thu, 01 Aug 2019 07:14:03 -0700 igerasim 8228352: CANON_EQ breaks when pattern contains supplementary codepoint
Thu, 01 Aug 2019 16:07:07 -0400 dcubed 8228999: ProblemList vmTestbase/nsk/jvmti/GetThreadState/thrstat001/TestDescription.java
Thu, 01 Aug 2019 15:54:45 -0400 dcubed 8226899: Problemlist compiler/rtm tests
Thu, 01 Aug 2019 09:29:13 -0700 mikael Added tag jdk-14+8 for changeset c0023e364b6f
Thu, 01 Aug 2019 09:23:21 -0700 mikael Merge
Thu, 01 Aug 2019 09:37:24 +0200 mbaesken 8228764: New library dependencies due to JDK-8222720jdk-13+32
Wed, 12 Jun 2019 13:50:37 -0700 serb 8217676: Upgrade libpng to 1.6.37
Wed, 31 Jul 2019 16:09:17 +0200 mgronlun 8227605: Kitchensink fails "assert((((klass)->trace_id() & (JfrTraceIdEpoch::leakp_in_use_this_epoch_bit())) != 0)) failed: invariant"
Wed, 31 Jul 2019 09:52:28 +0800 pli 8228601: AArch64: Fix interpreter code at JVMCI deoptimization entry
Tue, 30 Jul 2019 07:22:05 +0200 thartmann 8228710: Disable AggressiveUnboxing until JDK-8224957 is fixed
Thu, 08 Aug 2019 10:30:04 +0100 alanb Fix build issue with tests using native libsfibers
Wed, 07 Aug 2019 22:45:38 -0700 sspitsyn added new JVMTI functions: GetFiberStackTrace/GetFiberFrameCount/GetFiberFrameLocationfibers
Wed, 07 Aug 2019 19:19:36 -0700 sspitsyn Mergefibers
Wed, 07 Aug 2019 19:15:56 -0700 sspitsyn added 'mounted' field to javaClasses; fixed small bug in vframeStream constructorcont
Mon, 05 Aug 2019 08:54:37 +0100 alanb Mergefibers
Mon, 05 Aug 2019 08:54:20 +0100 alanb Mergefibers
Mon, 05 Aug 2019 08:54:01 +0100 alanb Mergecont
Sun, 04 Aug 2019 19:46:13 +0100 alanb Mergefibers
Sun, 04 Aug 2019 08:51:58 +0100 alanb Mergecont
Thu, 01 Aug 2019 08:59:31 +0200 mbaesken 8228658: test GetTotalSafepointTime.java fails on fast Linux machines with Total safepoint time 0 msjdk-14+8
Wed, 31 Jul 2019 16:48:51 -0700 mseledtsov 8228904: Problemlist docker/TestJcmdWithSideCar.java until JDK-8228850 and JDK-8228960 are fixed
Wed, 31 Jul 2019 17:30:25 -0400 coleenp 8228907: Some gc argument checking tests fail after JDK-8228855
Mon, 29 Jul 2019 16:31:09 +0530 jpai 8227170: (.hg)Ignore the JTwork and JTreport directories generated at the root of the repo
Wed, 31 Jul 2019 14:28:51 -0400 kbarrett 8048556: Unnecessary GCLocker-initiated young GCs
Wed, 31 Jul 2019 13:40:59 -0400 coleenp 8228855: Test runtime/CommandLine/OptionsValidation/TestOptionsWithRanges fails after JDK-8227123
Wed, 31 Jul 2019 09:55:26 -0400 ecaspole 8228674: LogCompilation: Improvements to log compare feature
Wed, 31 Jul 2019 06:54:50 -0400 coleenp 8228630: Remove always true parameter to NoSafepointVerifier
Wed, 31 Jul 2019 06:37:13 -0400 coleenp 8228673: Remove develop flag StrictSafepointChecks
Wed, 31 Jul 2019 10:03:44 +0200 rkennke 8228775: Shenandoah: Remove useless null-input-verification in Shenandoah/C2 verifier
Wed, 31 Jul 2019 08:05:14 +0200 thartmann 8193042: NativeLookup::lookup_critical_entry() should only load shared library once
Wed, 31 Jul 2019 00:02:01 -0400 dholmes 8227250: UserHandler contains ancient LinuxThreads code
Tue, 30 Jul 2019 17:31:29 -0400 pchilanomate 8227528: TestAbortVMOnSafepointTimeout.java failed due to "RuntimeException: 'Safepoint sync time longer than' missing from stdout/stderr"
Tue, 30 Jul 2019 22:16:48 +0200 shade 8228725: AArch64: Purge method call format support
Tue, 30 Jul 2019 22:15:23 +0200 shade 8228672: [TESTBUG] gc/metaspace/TestSizeTransitions.java fails on 32-bit platforms
Tue, 30 Jul 2019 09:46:06 -0700 bpb 8227609: (fs) Files.newInputStream(...).skip(n) should allow skipping beyond file size
Tue, 30 Jul 2019 17:54:53 +0200 mdoerr 8228743: [PPC64, s390] Implement FastJNIAccessors
Tue, 30 Jul 2019 09:56:18 -0400 coleenp 8227123: Assertion failure when setting SymbolTableSize larger than 2^17 (131,072)
Tue, 30 Jul 2019 09:26:47 -0400 mullan 8191138: Remove deprecated java.security.acl APIs
Tue, 30 Jul 2019 11:14:16 +0800 weijun 8228745: sun/security/tools/jarsigner/Warning.java test timeout
Mon, 29 Jul 2019 16:09:36 -0700 rhalade 8228755: ProblemList sun/security/tools/jarsigner/Warning.java
Mon, 29 Jul 2019 20:18:43 +0000 valeriep 8228668: compiler/codegen/aes/TestAESMain.java failed with GCM mode must be used with NoPadding
Mon, 29 Jul 2019 11:23:49 -0700 xuelei 8228742: Remove javax/net/ssl/SSLSocket/Tls13PacketSize.java from ProblemList
Mon, 29 Jul 2019 09:59:04 -0700 mikael Merge
Fri, 26 Jul 2019 16:03:08 +0200 rrich 8228618: s390: c1/c2 fail to add a metadata relocation in the static call stub.
Mon, 29 Jul 2019 13:57:54 +0200 eosterlund 8227407: ZGC: C2 loads and load barriers can get separated by safepoints
Sat, 27 Jul 2019 10:02:35 +0800 jjiang 8228403: SignTwice.java failed with java.io.FileNotFoundException: File name too long
Fri, 26 Jul 2019 11:47:50 +0800 ljiang 8228623: Update copyright year to 2019 for several java properties file
Thu, 25 Jul 2019 10:25:52 -0700 ccheung 8228407: JVM crashes with shared archive file mismatch
Thu, 25 Jul 2019 21:21:29 +0800 weijun 8228602: Add sun/security/tools/jarsigner/PreserveRawManifestEntryAndDigest.java to problem list
Thu, 25 Jul 2019 15:29:50 +0800 ljiang 8228397: Missing license copyright header in some properties files
Wed, 24 Jul 2019 18:23:16 -0700 iignatyev 8226905: unproblem list applications/ctw/modules/* tests on windows
Wed, 24 Jul 2019 16:54:17 -0700 mikael Added tag jdk-13+31 for changeset 6a159c6c23cc
Wed, 24 Jul 2019 10:50:40 +0300 vlivanov 8227260: JNI upcalls should bypass class initialization barrier in c2i adapterjdk-13+31
Wed, 24 Jul 2019 10:09:30 +0800 weijun 8228341: SignTwice.java fails intermittently on Windows
Wed, 24 Jul 2019 10:09:22 +0800 weijun 8227595: keytool/fakegen/DefaultSignatureAlgorithm.java fails due to "exitValue = 6"
Tue, 23 Jul 2019 11:30:31 -0700 jjg 8228494: Update nroff version of man pages
Mon, 29 Jul 2019 18:22:55 +0200 mdoerr 8227680: FastJNIAccessors: Check for JVMTI field access event requests at runtime
Mon, 29 Jul 2019 09:09:23 -0700 bpb 8078891: java.io.SequenceInputStream.close is not atomic and not idempotent
Mon, 29 Jul 2019 08:48:52 -0700 bpb 8181493: (fs) Files.readAttributes(path, BasicFileAttributes.class) should preserve nano second time stamps
Mon, 29 Jul 2019 10:34:20 -0400 coleenp 8202339: [TESTBUG] Consolidate the tests in runtime/SharedArchiveFile and runtime/appcds
Mon, 29 Jul 2019 09:57:37 -0400 hseigel 8228596: Class redefinition fails when condy instructions are removed
Mon, 29 Jul 2019 11:14:06 +0200 shade 8228400: Remove built-in AArch64 simulator
Fri, 26 Jul 2019 10:52:47 +0200 rschmelter 8228589: BasicJStackTest.java and JcmdOutputEncodingTest.java failing after JDK-8227868
Mon, 29 Jul 2019 08:17:26 +0000 coffeys 8228645: Don't run sun/security/pkcs11/Cipher/TestKATForGCM.java on buggy NSS solaris versions
Fri, 26 Jul 2019 15:05:24 +0200 mbaesken 8228650: runtime/SharedArchiveFile/CheckDefaultArchiveFile.java test fails on AIX
Mon, 29 Jul 2019 09:40:02 +0200 thartmann 8156207: Resource allocated BitMaps are often cleared unnecessarily
Mon, 29 Jul 2019 09:34:07 +0200 thartmann 8223769: Assert triggers with -XX:+StressReflectiveCode
Sun, 28 Jul 2019 23:14:07 -0400 dholmes 8221205: Obsolete AllowJNIEnvProxy
Sat, 27 Jul 2019 14:49:16 -0700 mchung 8228671: Fastdebug VM throws InternalError when publicLookup.in(T) is used to resolve a member
Fri, 26 Jul 2019 23:37:51 -0400 kbarrett 8226796: Reduce debug level logging for oopstorage+blocks
Fri, 26 Jul 2019 20:15:13 -0400 kbarrett 8228631: Fix inconsistent OopStorage::Block owner usage
Fri, 26 Jul 2019 13:32:59 -0700 naoto 8228465: HOST locale provider holds wrong era name for GregorianCalendar in US locale
Fri, 26 Jul 2019 15:06:22 -0400 lancea 8226808: PreparedStatement javadoc typo
Fri, 26 Jul 2019 17:15:17 +0000 joehw 8068376: Validator fails valid XML files due to String == in XSD validator code
Fri, 26 Jul 2019 08:56:28 -0700 naoto 8212970: TZ database in "vanguard" format support
Tue, 23 Jul 2019 15:33:52 -0400 zgu 8228532: Shenandoah: Implement SBSA::try_resolve_jobject_in_native()
Wed, 24 Jul 2019 12:36:12 +0200 mbaesken 8228578: fix CFData object leak in macosx KeystoreImpl.m
Fri, 26 Jul 2019 09:06:03 +0200 clanger 8228571: [TESTBUG] Fix tests failing on non-aot platforms after JDK-8227512
Thu, 25 Jul 2019 21:51:13 +0000 valeriep Merge
Thu, 25 Jul 2019 02:16:49 +0000 valeriep 8180392: SunJCE provider should throw exceptions for unsupported mode and padding combinations
Thu, 25 Jul 2019 17:35:58 -0400 dlong 8226771: Update Graal
Thu, 25 Jul 2019 11:44:37 -0700 bpb 8184157: (ch) AsynchronousFileChannel hangs with internal error when reading locked file
Thu, 25 Jul 2019 12:15:27 +0200 mbaesken 8228585: jdk/internal/platform/cgroup/TestCgroupMetrics.java - NumberFormatException because of large long values (memory limit_in_bytes)
Wed, 24 Jul 2019 09:28:48 +0200 mbaesken 8228501: java_props_macosx.c - provide missing CFRelease for CFLocaleCopyCurrent
Mon, 22 Jul 2019 16:32:58 -0400 zgu 8228490: Shenandoah: Shenandoah concurrent root evacuation may race against OopStorage::release()
Thu, 25 Jul 2019 12:20:04 +0530 psadhukhan Merge
Thu, 25 Jul 2019 11:31:07 +0530 psadhukhan Merge
Tue, 23 Jul 2019 22:21:16 -0700 akolarkunnu 8228479: Correct the format of ColorChooserDemoTest
Tue, 16 Jul 2019 17:00:00 -0700 serb 6573239: Typo in jfc text file
Thu, 04 Jul 2019 12:28:34 +0530 pkbalakr 8042383: [TEST_BUG] Test javax/swing/plaf/basic/BasicMenuUI/4983388/bug4983388.java fails with shortcuts on menus do not work
Mon, 01 Jul 2019 14:57:02 -0700 prr Merge
Wed, 26 Jun 2019 15:34:13 -0700 serb 8134672: [TEST_BUG] Some tests should check isDisplayChangeSupported
Tue, 25 Jun 2019 14:27:31 -0700 kcr 8222563: Remove terminally deprecated method netscape.javascript.JSObject::getWindow
Tue, 25 Jun 2019 14:13:33 +0530 pkbalakr 8196467: javax/swing/JInternalFrame/Test6325652.java fails
Tue, 25 Jun 2019 11:05:07 +0530 psadhukhan 8226361: jdk ProblemList file contains more than 1 entry for a test
Mon, 24 Jun 2019 17:31:00 -0700 prr 8226697: Several tests which need the @key headful keyword are missing it.
Fri, 21 Jun 2019 09:05:45 -0700 prr Merge
Tue, 18 Jun 2019 21:40:50 -0700 serb 8214469: [macos] PIT: java/awt/Choice/ChoiceKeyEventReaction/ChoiceKeyEventReaction.java fails
Sun, 09 Jun 2019 18:14:48 -0700 serb 8224171: The cleanup multi-font related code in the XFontPeer
Thu, 25 Jul 2019 08:04:33 +0200 thartmann 8071275: remove AbstractAssembler::update_delayed_values dead code
Wed, 24 Jul 2019 17:08:14 -0700 mikael Added tag jdk-14+7 for changeset 28ab01c06755
Wed, 24 Jul 2019 16:46:42 -0700 mchung 8173978: Lookup.in should allow teleporting from a lookup class in a named module without dropping all access
Wed, 24 Jul 2019 10:22:11 -0400 coleenp 8228485: JVM crashes when bootstrap method for condy triggers loading of class whose static initializer throws exception
Wed, 24 Jul 2019 08:34:06 -0400 zgu 8227927: Move ParallelCleaningTask back to G1
Wed, 24 Jul 2019 13:08:36 +0100 aefimov 8227721: test/jdk/java/net/NetworkInterface/NetworkInterfaceRetrievalTests.java should open the java.net package
Wed, 24 Jul 2019 11:49:39 +0200 tschatzl 8228388: Add information about dirty/skipped card for Merge HCC in G1 logjdk-14+7
Wed, 24 Jul 2019 11:49:39 +0200 tschatzl 8227719: G1 Pending cards estimation too conservative in cost prediction
Wed, 24 Jul 2019 11:49:39 +0200 tschatzl 8226913: Scale cards per chunk used during heap root scanning with region size
Tue, 23 Jul 2019 20:03:03 -0700 mchung 8219774: Reexamine the initialization of LangReflectAccess shared secret at AccessibleObject::<clinit>
Tue, 23 Jul 2019 11:36:05 -0700 mseledtsov 8227122: [TESTBUG] Create Docker sidecar test cases
Tue, 23 Jul 2019 13:56:41 -0400 coleenp 8228484: Remove NoAllocVerifier because nothing uses it
Thu, 18 Jul 2019 13:58:34 -0700 ascarpino 8228396: Re-enable Stateless Resumption On by default for merge to mainline
Tue, 23 Jul 2019 11:17:59 -0700 mikael Merge
Mon, 22 Jul 2019 15:54:25 -0700 jjg 8228492: Remove pako.md
Mon, 22 Jul 2019 10:39:10 -0700 ascarpino 8228399: Remove mistaken open.iml
Mon, 22 Jul 2019 08:07:15 -0700 naoto 8228450: unicode.md and icu.md text should be pre-formatted
Wed, 10 Jul 2019 11:11:30 +0200 mbaesken 8227247: tools/sjavac/IdleShutdown.java fails with AssertionError: Error too big on windows
Thu, 18 Jul 2019 12:29:57 -0700 dtitov 8221303: sun/management/jmxremote/bootstrap/JMXInterfaceBindingTest.java fails due to java.rmi.server.ExportException: Port already in use
Thu, 18 Jul 2019 11:47:52 -0700 iignatyev 8226910: make it possible to use jtreg's -match via run-test framework
Thu, 18 Jul 2019 09:15:26 -0700 kbarrett 8228340: JVMCI deleteGlobalHandle doesn't delete the handle
Tue, 02 Jul 2019 10:28:20 +0200 stuefe 8227041: runtime/memory/RunUnitTestsConcurrently.java has a memory leak
Thu, 18 Jul 2019 11:15:20 +0200 eosterlund 8224674: NMethod state machine is not monotonic
Thu, 18 Jul 2019 13:41:55 +0800 weijun 8228342: Add SignTwice.java to problem list
Thu, 18 Jul 2019 08:53:06 +0800 weijun 8217375: jarsigner breaks old signature with long lines in manifest
Wed, 17 Jul 2019 12:26:56 -0300 mbalao 8227437: S4U2proxy cannot continue because server's TGT cannot be found
Wed, 17 Jul 2019 16:13:26 -0700 rhalade 8048595: problemList failing/ignored manual tests in security-libs
Wed, 17 Jul 2019 14:37:50 -0700 ascarpino 8226338: Updates to Stateless Resumption
Wed, 17 Jul 2019 13:41:12 -0700 mikael Added tag jdk-13+30 for changeset 2e63fb0a885f
Wed, 17 Jul 2019 12:31:21 -0700 ascarpino 8227551: Session Resumption without Server-Side State off by default
Wed, 17 Jul 2019 08:34:45 -0700 ccheung 8227646: [TESTBUG] appcds/SharedArchiveConsistency timed outjdk-13+30
Fri, 19 Jul 2019 11:09:41 +0200 mbaesken 8228426: xlc: switch to clang-style warning disabling
Mon, 22 Jul 2019 10:15:46 +0200 mbaesken 8228468: awt_Robot.c : format string contains 0 within the string body
Tue, 23 Jul 2019 00:29:31 -0400 dholmes 8225782: Remove expired flags in JDK 14
Thu, 11 Jul 2019 03:28:43 +0530 rpatil 8154520: java.time: appendLocalizedOffset() should return the localized "GMT" string
Mon, 22 Jul 2019 16:10:25 -0700 jjg 8222791: Order of evaluation of -link params in Javadoc tool reversed -> regression with split packages
Sat, 13 Jul 2019 12:15:17 -0400 zgu 8227866: Shenandoah: Split weak root processing and class unloading in parallel cleaning task
Mon, 22 Jul 2019 10:26:21 -0700 amenkov 8227693: HTML error in jdwp-protocol.html
Mon, 22 Jul 2019 14:40:00 +0200 rschmelter 8227868: jinfo and jstack can fail converting UTF8 output to strings
Mon, 22 Jul 2019 10:48:14 +0200 sgehwolf 8228434: jdk/net/Sockets/Test.java fails after JDK-8227642
Mon, 22 Jul 2019 12:21:18 +0200 jlahoda 8227923: End position of EndElementTree is -1
Mon, 22 Jul 2019 14:31:04 +0800 jiefu 8225648: [TESTBUG] java/lang/annotation/loaderLeak/Main.java fails with -Xcomp
Wed, 17 Jul 2019 15:40:27 +0200 mbaesken 8227869: fix wrong format specifiers in os_aix.cpp
Tue, 16 Jul 2019 16:01:10 +0200 mbaesken 8227737: avoid implicit-function-declaration on AIX
Fri, 19 Jul 2019 16:47:11 -0400 kbarrett 8162929: Enqueuing dirty cards into a single DCQS during GC does not scale
Fri, 19 Jul 2019 12:39:31 -0400 tonyp 8227179: Test for new gc+metaspace=info output format
Fri, 19 Jul 2019 15:36:23 +0200 redestad 8228394: Cleanup unused java.net SharedSecrets classes
Fri, 19 Jul 2019 16:25:04 +0300 vlivanov 8227260: JNI upcalls should bypass class initialization barrier in c2i adapter
Mon, 08 Jul 2019 17:44:34 +0200 sgehwolf 8227397: Add --with-extra-asflags configure option
Fri, 19 Jul 2019 12:35:33 +0200 mbaesken 8228420: compile error in shenandoahSupport.cpp with clang 9
Fri, 12 Jul 2019 19:37:25 +0200 sgehwolf 8227642: [TESTBUG] Make docker tests podman compatible
Fri, 19 Jul 2019 10:18:48 +0200 mdoerr 8227692: Remove develop feature PrintMallocStatistics
Thu, 18 Jul 2019 14:01:54 +0200 mbaesken 8228368: avoid incompatible pointer to integer conversion initializing gint in gtk2_interface
Tue, 16 Jul 2019 14:42:36 +0200 mbaesken 8227633: avoid comparing this pointers to NULL
Fri, 19 Jul 2019 02:40:59 +0000 joehw 8157830: Errors in XSLT stylesheet are not dispatched correctly to ErrorListener
Thu, 18 Jul 2019 17:10:33 -0700 bpb 8228392: Backout incorrect change done by JDK-8067801
Thu, 18 Jul 2019 14:57:32 -0400 kbarrett 8227653: Add VM Global OopStorage
Wed, 17 Jul 2019 08:33:38 -0400 zgu 8227755: Need more than 2 distinct CodeCache unloading cycles
Thu, 18 Jul 2019 11:54:54 -0400 kbarrett 8227652: SetupOperatorNewDeleteCheck should discuss deleting destructors
Thu, 18 Jul 2019 07:54:21 -0700 bpb 8228338: tools/pack200/TimeStamp.java fails with NullPointerException
Thu, 18 Jul 2019 21:25:41 +0900 ysuenaga 8227815: Minimal VM: set_state is not a member of AttachListener
Thu, 18 Jul 2019 13:16:10 +0200 rkennke 8228364: Shenandoah: Remove unused code from ShenandoahBarrierSetC1
Thu, 18 Jul 2019 07:06:33 -0400 coleenp 8227766: CheckUnhandledOops is broken in MemAllocator
Thu, 18 Jul 2019 10:25:49 +0200 rschmelter 8227435: Perf::attach() should not throw a java.lang.Exception
Wed, 17 Jul 2019 09:58:42 +0200 mbaesken 8227834: build.log output from failing commands : include the hs_error file path in case of crashes in build
Wed, 10 Jul 2019 11:11:30 +0200 mbaesken 8227247: tools/sjavac/IdleShutdown.java fails with AssertionError: Error too big on windows
Wed, 17 Jul 2019 15:12:47 -0700 bpb 8073213: javadoc of PushbackInputStream methods should specify NullPointerExceptions
Wed, 17 Jul 2019 15:12:30 -0700 bpb 8228204: Fix for JDK-8067801 breaks java/io/NegativeInitSize.java
Wed, 17 Jul 2019 14:24:37 -0700 bpb 8067801: Enforce null check for underlying I/O streams
Wed, 17 Jul 2019 14:24:24 -0700 bpb 8131664: Javadoc for PrintStream is now incorrect
Wed, 17 Jul 2019 13:41:38 -0700 mikael Added tag jdk-14+6 for changeset 443f7359b34d
Wed, 17 Jul 2019 11:23:51 -0700 dtitov 8206179: com/sun/management/OperatingSystemMXBean/GetCommittedVirtualMemorySize.java fails with Committed virtual memory size illegal value
Wed, 17 Jul 2019 16:33:19 +0200 tschatzl 8227090: G1 does not account the OptMergeRS in cost per card calculation
Wed, 17 Jul 2019 16:33:19 +0200 tschatzl 8227089: Add timing information for merging humongous remembered sets
Wed, 17 Jul 2019 16:33:19 +0200 tschatzl 8227084: Add timing information for merge heap root preparation
Wed, 17 Jul 2019 16:33:19 +0200 tschatzl 8227671: G1: assert_used_and_recalculate_used_equal performs work in product builds
Wed, 17 Jul 2019 16:33:19 +0200 tschatzl 8226232: Move merge heap roots code out from G1RemSetScanState
Wed, 17 Jul 2019 23:22:48 +0900 ysuenaga 8227738: jvmti/DataDumpRequest/datadumpreq001 failed due to "exit code is 134"
Sat, 13 Jul 2019 12:14:24 -0400 zgu 8227635: Shenandoah: SHBSA::load_at() needs to deal IN_NATIVE load
Wed, 17 Jul 2019 04:33:37 -0700 mikael Merge
Wed, 17 Jul 2019 00:21:02 +0000 henryjen Merge
Thu, 02 May 2019 17:43:26 -0700 jnimeh 8222678: Improve TLS negotiation
Tue, 23 Apr 2019 08:34:51 +0800 weijun 8222751: closed/test/jdk/sun/security/util/DerIndefLenConverter/IndefBerPkcs12.java fail
Thu, 11 Apr 2019 17:58:18 -0700 xuelei 8218873: Improve JSSE endpoint checking
Wed, 10 Apr 2019 14:43:13 -0700 serb 8218876: Improve PNG support options
Wed, 10 Apr 2019 15:49:24 +0100 dfuchs 8221518: Normalize normalization
Wed, 03 Apr 2019 13:35:11 -0700 jnimeh 8221345: Better Poly1305 support
Thu, 28 Mar 2019 14:18:57 -0700 darcy 8212328: Exceptional throw cases
Wed, 27 Mar 2019 00:24:13 -0700 serb 8220517: Enhanced GIF support
Thu, 07 Mar 2019 22:19:12 -0800 jnimeh 8219775: Certificate validation improvements
Wed, 27 Feb 2019 13:58:04 -0800 xuelei 8218863: Better endpoint checks
Thu, 07 Feb 2019 08:47:10 -0500 mullan 8216381: More limited privilege usage
Wed, 30 Jan 2019 14:14:57 +0000 prappo 8213431: Improve file protocol handling
Wed, 30 Jan 2019 10:51:50 +0800 weijun 8217563: Improve realm maintenance
Wed, 23 Jan 2019 14:45:54 -0800 smarks 8213432: Better copies of CopiesList
Tue, 16 Jul 2019 15:15:45 +0100 alitvinov 8227392: Colors with alpha are painted incorrectly on Linux, after JDK-8214579
Tue, 16 Jul 2019 10:48:22 +0200 jlahoda 8227640: javac crashes on text blocks with invalid escapes.
Mon, 15 Jul 2019 16:25:23 -0700 serb 8226653: [accessibility] Can edit text cell correctly, but Accessibility Tool reads nothing about editor
Mon, 15 Jul 2019 09:53:23 -0700 ccheung 8227496: Update NUM_CDS_REGIONS and CURRENT_CDS_ARCHIVE_VERSION in cds.h
Sat, 13 Jul 2019 10:43:45 +0000 plevart 8227368: EnumSet.class serialization broken in JDK 9+
Fri, 12 Jul 2019 21:38:46 +0200 clanger 8227636: Fix output dir for jlink_jre target in Images.gmk
Thu, 04 Jul 2019 11:55:00 +0200 stuefe 8227252: [aix] Disable jdk/java/lang/reflect/exeCallerAccessTest
Fri, 12 Jul 2019 08:40:37 -0700 ccheung 8226406: JVM fails to detect mismatched or corrupt CDS archive
Wed, 17 Jul 2019 12:35:46 +0200 redestad 8227587: Add internal privileged System.loadLibrary
Wed, 17 Jul 2019 11:43:38 +0200 rkennke 8227677: Shenandoah: C2: Make in-native LRB special case of normal LRB
Thu, 01 Aug 2019 16:22:28 -0700 rpressler Mergefibers
Thu, 01 Aug 2019 16:22:03 -0700 rpressler take continuations into consideration in javaVFrame::print_valuecont
Thu, 01 Aug 2019 15:44:36 -0700 cjplummer Mergefibers
Thu, 01 Aug 2019 15:43:34 -0700 cjplummer Fix JavaThread::trace_stack() so it includes frozen frames. This fixes ps() so it does the same.cont
Tue, 30 Jul 2019 15:33:57 -0700 cjplummer Adjust for the fact that yield events are now after the continuation has been frozen, so the continuation frames don't turn up when counting all frames on the stack.fibers
Tue, 30 Jul 2019 15:31:45 -0700 cjplummer Mergefibers
Tue, 30 Jul 2019 15:30:23 -0700 cjplummer Adjust for the fact that yield events are now after the continuation has been frozen, so the continuation frames don't turn up when counting all frames on the stack.cont
Sat, 27 Jul 2019 01:12:53 +0100 rpressler Mergefibers
Sat, 27 Jul 2019 01:11:42 +0100 rpressler fix regressioncont
Fri, 26 Jul 2019 17:26:36 +0100 rpressler Mergefibers
Fri, 26 Jul 2019 17:24:20 +0100 rpressler set anchor in freeze before call to JvmtiExport::post_continuation_yield and undo simplification to deoptimizationcont
Thu, 25 Jul 2019 16:48:04 -0700 cjplummer Need to look for Object.wait0() frame, not Object.wait(). This was suppose to have been pushed a while back with changeset 55911, which covered needed wait0() changes in vmSymbols.hpp.fibers
Wed, 24 Jul 2019 08:27:32 +0100 alanb Mergefibers
Wed, 24 Jul 2019 08:27:16 +0100 alanb Fix build issue on Windowscont
Wed, 24 Jul 2019 08:12:19 +0100 alanb Mergefibers
Tue, 23 Jul 2019 17:28:36 +0100 alanb Mergecont
Tue, 16 Jul 2019 11:10:38 +0200 mbaesken 8227631: Adjust AIX version checkjdk-14+6
Wed, 17 Jul 2019 10:11:05 +0800 njian 8227615: [TESTBUG] JTReg "jdk/sun/security/util/FilePermCompat/CompatImpact.java" fails with graal
Tue, 16 Jul 2019 00:57:00 +0000 pli 8227512: [TESTBUG] Fix JTReg javac test failures with Graal
Tue, 16 Jul 2019 21:12:14 +0000 joehw 8176447: javax.xml.validation.Validator validates incorrectly on uniqueness constraint
Tue, 16 Jul 2019 17:50:54 +0200 redestad 8227720: Improve ExtendedSocketOptions initialization
Tue, 16 Jul 2019 18:05:42 +0300 bulasevich 8227632: Incorrect PrintCompilation message: made not compilable on levels 0 1 2 3 4
Tue, 16 Jul 2019 13:57:13 +0200 rschmelter 8227440: Implement fix to JDK-8224642 on all platforms
Mon, 15 Jul 2019 03:14:28 +0000 njian 8227574: [TESTBUG] JTReg tests fail with Graal due to access denied
Fri, 12 Jul 2019 12:19:58 +0200 mbaesken 8227630: adjust format specifiers in loadlib_aix.cpp
Tue, 16 Jul 2019 07:29:12 +0900 ysuenaga 8225690: Multiple AttachListener threads can be created