log

age author description
Fri, 24 Jun 2016 23:28:06 +0530 sundar 8153238: Improve test/tools/jlink/JLinkTest.java not to hard code the number of plugins
Fri, 24 Jun 2016 16:03:17 +0100 dfuchs 8150173: JAXBContext.newInstance causes PrivilegedActionException when createContext's declared in abstract class extended by discovered JAXB implementation
Fri, 24 Jun 2016 19:56:50 +0530 sundar 8147794: Jlink's ModuleEntry.stream can't be consumed more than once and ModuleEntry content should be read only if needed
Fri, 24 Jun 2016 11:20:24 -0300 jlaskey 8159172: Update usage of jlink/jimage/jmod to show option patterns
Fri, 24 Jun 2016 06:52:29 +0100 skuksenko 8158690: GET request via HTTP/2 has a huge delays due to Nagle?s Algorithm and Delayed ACK clash
Fri, 24 Jun 2016 06:47:32 +0100 chegar 8154017: Shutdown hooks are racing against shutdown sequence, if System.exit()-calling thread is interrupted
Thu, 23 Jun 2016 19:58:58 -0700 tidu 8146393: sun/security/tools/jarsigner/ts.sh failed on OEL Linux 7 with ar_SA Locale
Thu, 23 Jun 2016 21:44:11 +0000 lana Merge
Thu, 23 Jun 2016 21:13:13 +0000 lana Merge
Thu, 23 Jun 2016 14:14:06 -0700 bchristi 7131356: (props) "No Java runtime present, requesting install" when creating VM from JNI [macosx]
Thu, 23 Jun 2016 10:25:04 +0100 skuksenko 8158980: Memory leak in HTTP2Connection.streams
Wed, 22 Jun 2016 15:58:08 -0700 asmotrak 8074580: sun/security/pkcs11/rsa/TestKeyPairGenerator.java fails due to PKCS11Exception: CKR_FUNCTION_FAILED
Wed, 22 Jun 2016 11:31:07 -0700 sherman 8159545: closed/java/io/Console/TestConsole.java failed with exit code 1
Wed, 22 Jun 2016 09:33:16 -0700 asmotrak 8152745: javax/net/ssl/TLS/TestJSSE.java fails intermittently: Unsupported or unrecognized SSL message
Wed, 22 Jun 2016 08:51:32 -0700 naoto 8159781: jlink --include-locales fails with java.util.regex.PatternSyntaxException
Wed, 22 Jun 2016 09:21:06 +0100 chegar 8157166: Update spec to account for platforms that do not support multicast
Wed, 22 Jun 2016 09:01:34 +0100 vtewari 8071660: URLPermission not handling empty method lists correctly
Wed, 22 Jun 2016 16:12:39 +0900 okutsu 8159766: "Switching encoding from UTF-8 to ISO-8859-1" log message should be trace/debug message
Tue, 21 Jun 2016 20:20:14 -0700 xiaofeya 8157530: Remove intermittent key from javax/net/ssl/DTLS/WeakCipherSuite.java
Tue, 21 Jun 2016 15:15:05 -0700 naoto 8159548: Formatter returns unexpected strings if locale is null.
Tue, 21 Jun 2016 18:51:18 +0100 prappo 8156742: Miscellaneous WebSocket API improvements
Tue, 21 Jun 2016 16:52:16 +0100 vtewari 8114860: Behavior of java.net.URLPermission.getActions() contradicts spec
Tue, 21 Jun 2016 16:42:33 +0100 vtewari 8154234: Remove netdoc URL protocol Handler
Tue, 21 Jun 2016 17:48:29 +0300 igerasim 8158802: com.sun.jndi.ldap.SimpleClientId produces wrong hash code
Tue, 21 Jun 2016 19:05:34 +0530 sundar 8159593: Plugin Set<Category> getType() should return a Category
Tue, 21 Jun 2016 14:00:59 +0100 vtewari 8144008: Setting NO_PROXY on HTTP URL connections does not stop proxying
Tue, 21 Jun 2016 11:09:13 +0800 weijun 8157318: ThreadedSeedGenerator uses System.currentTimeMillis and stops generating when time is set back
Mon, 20 Jun 2016 19:31:03 -0700 mchung Merge
Sun, 19 Jun 2016 16:46:49 -0700 mchung 8155955: packager needs to determine the root modules to create JRE image
Mon, 20 Jun 2016 18:30:57 -0700 mli 8159879: Some typo and minor test bugs in ava/lang/module/ModuleReferenceTest.java and ConfigurationTest.java
Mon, 20 Jun 2016 17:06:27 -0700 asmotrak 8049314: javax/net/ssl/templates/SSLSocketSSLEngineTemplate.java fails intermittently with "Unexpected EOF" message
Tue, 21 Jun 2016 00:45:52 +0100 msheppar 8146975: NullPointerException in IIOPInputStream.inputClassFields
Mon, 20 Jun 2016 14:08:05 -0700 bpb 8136738: InputStream documentation for IOException in skip() is unclear or incorrect
Thu, 23 Jun 2016 20:35:15 +0000 lana Added tag jdk-9+124 for changeset 45cbf2937973
Wed, 05 Jul 2017 21:52:20 +0200 duke Merge
Thu, 23 Jun 2016 21:12:55 +0000 lana Merge
Tue, 24 May 2016 16:02:45 +0530 csahu 8150900: Implement diagnostic_pd
Thu, 23 Jun 2016 20:35:13 +0000 lana Added tag jdk-9+124 for changeset 6f7d687193a4
Mon, 27 Jun 2016 08:04:48 -0700 tbell 8081676: Verify that configure detects AS on Solaris and print help otherwise
Thu, 23 Jun 2016 21:12:39 +0000 lana Merge
Wed, 22 Jun 2016 17:20:53 -0700 jjg 8154399: Need replacement for jdk.javadoc/com.sun.tools.doclets.standard.Standard
Tue, 21 Jun 2016 20:28:12 +0200 erikj 8157253: Fix compare script for html files
Tue, 21 Jun 2016 20:00:20 +0200 erikj 8159628: Bundles contain extra /./ path element for all files
Wed, 08 Jun 2016 15:13:19 +0200 erikj 8136771: Implement the license-swap logic as a make target
Thu, 23 Jun 2016 20:35:12 +0000 lana Added tag jdk-9+124 for changeset 4c952b4cc533
Wed, 05 Jul 2017 21:52:02 +0200 duke Added tag jdk-9+124 for changeset 2a5697a98620
Wed, 05 Jul 2017 21:52:00 +0200 duke Mergejdk-9+124
Wed, 05 Jul 2017 21:51:56 +0200 duke Merge
Mon, 20 Jun 2016 07:02:42 -0700 ksrini 8159756: javadoc tests needs a tool invoker
Fri, 17 Jun 2016 17:53:00 -0700 jjg 8059631: Use of '#' to represent MethodHandle kind is confusing
Fri, 17 Jun 2016 17:40:01 -0700 jjg 8159749: Update toolbox ModuleBuilder for doc comments
Fri, 17 Jun 2016 17:09:21 -0600 dlsmith 8158992: langtools/test/Makefile: improve support for control via variables
Fri, 17 Jun 2016 14:33:54 -0700 mchung 8159524: jdeps -jdkinternals throws NPE when no replacement is known
Fri, 17 Jun 2016 18:17:16 +0100 mcimadamore 8159680: Inference failure with unchecked subtyping and arrays
Thu, 16 Jun 2016 20:57:32 +0000 lana Merge
Wed, 15 Jun 2016 12:47:50 -0700 ddehaven Merge
Wed, 15 Jun 2016 09:24:06 -0700 ddehaven Merge
Mon, 06 Jun 2016 13:16:46 -0700 ddehaven Merge
Wed, 01 Jun 2016 15:27:52 -0700 ddehaven Merge
Fri, 20 May 2016 00:03:52 -0700 lana 8157778: JDK9 preparation message drop resource updates
Tue, 14 Jun 2016 15:34:10 -0700 ksrini 8158836: langtools build.xml needs some adjustments
Tue, 14 Jun 2016 12:46:35 -0700 vromero 8058244: missing error in qualified default super call
Tue, 14 Jun 2016 11:13:14 -0700 vromero 8068460: Pretty printing for loops
Tue, 14 Jun 2016 08:18:53 -0700 ksrini 8159396: javadoc getSupportedVersion returns 8 instead of 9
Thu, 16 Jun 2016 19:07:29 +0000 lana Added tag jdk-9+123 for changeset 88f6e6f58798
Wed, 05 Jul 2017 21:51:42 +0200 duke Merge
Thu, 16 Jun 2016 19:07:27 +0000 lana Added tag jdk-9+123 for changeset eb31fc6b71a7
Wed, 05 Jul 2017 21:51:35 +0200 duke Merge
Thu, 16 Jun 2016 20:57:35 +0000 lana Merge
Wed, 15 Jun 2016 09:24:04 -0700 ddehaven Merge
Mon, 06 Jun 2016 13:16:44 -0700 ddehaven Merge
Wed, 01 Jun 2016 15:27:49 -0700 ddehaven Merge
Fri, 20 May 2016 00:03:38 -0700 lana 8157775: JDK9 preparation message drop resource updates
Tue, 14 Jun 2016 16:14:24 -0700 joehw 8158204: accessExternalSchema property handling is inconsistent and differs from spec.
Thu, 16 Jun 2016 19:07:27 +0000 lana Added tag jdk-9+123 for changeset 3a36994e91a2
Wed, 05 Jul 2017 21:51:23 +0200 duke Merge
Mon, 20 Jun 2016 12:21:51 +0200 hannesw 8156614: Lazy parsing of ES6 shorthand method syntax is broken
Mon, 20 Jun 2016 11:44:29 +0200 hannesw 8150219: ReferenceError in 1.8.0_72
Thu, 16 Jun 2016 20:57:01 +0000 lana Merge
Wed, 15 Jun 2016 14:18:22 +0200 sdama 8158817: add documentation for NativeMath
Thu, 16 Jun 2016 19:07:29 +0000 lana Added tag jdk-9+123 for changeset 28e775c6e08e
Wed, 05 Jul 2017 21:51:13 +0200 duke Merge
Thu, 16 Jun 2016 20:56:57 +0000 lana Merge
Wed, 15 Jun 2016 09:24:04 -0700 ddehaven Merge
Mon, 06 Jun 2016 13:16:43 -0700 ddehaven Merge
Wed, 01 Jun 2016 15:27:49 -0700 ddehaven Merge
Fri, 20 May 2016 00:02:55 -0700 lana 8157776: JDK9 preparation message drop resource updates
Thu, 16 Jun 2016 19:07:26 +0000 lana Added tag jdk-9+123 for changeset 23d765900a30
Wed, 05 Jul 2017 21:51:02 +0200 duke Merge
Sat, 18 Jun 2016 16:50:19 -0700 mli 8159762: Some minor test bugs in java/lang/module/ModuleDescriptorTest.java
Fri, 17 Jun 2016 19:45:06 -0700 asmotrak 8159501: ShortRSAKey512.java intermittently times out
Fri, 17 Jun 2016 14:37:00 -0700 mchung 8159630: Add new test for jdk.internal.misc.VM::getRuntimeArguments
Fri, 17 Jun 2016 15:57:28 -0400 rriggs 8155808: Process.getInputStream().skip() method is faulty
Fri, 17 Jun 2016 10:08:39 -0700 psandoz 8159821: "PrimitiveStream.iterateFinite" methods contain incorrect code sample
Sat, 28 May 2016 13:57:30 +0530 psandoz 8158253: Collections: Implement a noop clear() for EmptyList, EmptyMap and EmptySet
Fri, 17 Jun 2016 17:17:21 +0100 alanb 8140449: (fs) Paths.get("x").relativize("") return ..\ on Windows
Fri, 17 Jun 2016 16:18:37 +0200 redestad 8159745: Remove java.net.Parts
Tue, 14 Jun 2016 10:44:59 +0200 goetz 8159690: [TESTBUG] Mark headful tests with @key headful.
Fri, 17 Jun 2016 21:08:03 +0800 weijun 8159805: sun/security/tools/jarsigner/warnings/NoTimestampTest.java fails after JDK-8027781
Fri, 17 Jun 2016 21:07:31 +0800 weijun 8158633: BASE64 encoded cert not correctly parsed with UTF-16
Fri, 17 Jun 2016 21:42:38 +0900 nishjain 8159420: The LanguageRange.parse() method is throwing IllegalArgumentException in Turkish Locale
Fri, 17 Jun 2016 04:35:09 -0700 mli 8159785: Add test that tests ClassLoader.getResource/getResources in Multi-Release Jar
Fri, 17 Jun 2016 17:06:16 +0900 okutsu 8158272: IncludeLocalesPluginTest.java fails with timeout
Fri, 17 Jun 2016 08:41:39 +0100 alanb 8158456: ModuleDescriptor.read does not verify dependence on java.base in module-info.class
Fri, 17 Jun 2016 10:53:13 +0800 weijun 8156471: test/sun/security/krb5/auto/TestHosts should not be modified in-place
Fri, 17 Jun 2016 09:46:36 +0800 weijun 8157387: StrongSecureRandom.java timeout after push for JDK-8141039
Fri, 17 Jun 2016 09:46:34 +0800 weijun 8146619: Re-examine supportness of public classes in com.sun.security.auth.**
Fri, 17 Jun 2016 09:46:27 +0800 weijun 6968542: keytool -importcert cannot deal with duplicate certs
Fri, 17 Jun 2016 09:46:03 +0800 weijun 8027781: New jarsigner timestamp warning is grammatically incorrect
Thu, 16 Jun 2016 20:56:45 +0000 lana Merge
Thu, 16 Jun 2016 13:00:34 -0700 darcy 8071859: AnnotationInvocationHandler.equals(Object) return true when apply to annotation
Thu, 16 Jun 2016 09:09:53 -0300 jlaskey 8159206: All jlink or jmod tests failing
Wed, 15 Jun 2016 23:24:08 +0000 valeriep 8154191: Deprivilege java.smartcardio module
Wed, 15 Jun 2016 13:44:16 -0700 dl 8159351: non-atomic "bulk" ops note in class javadoc for ConcurrentLinkedQueue, ConcurrentLinkedDeque, & LinkedTransferQueue should not include equals
Wed, 01 Jun 2016 19:03:15 -0700 dl 8066070: PriorityQueue corrupted when adding non-Comparable
Wed, 15 Jun 2016 12:47:50 -0700 ddehaven Merge
Wed, 15 Jun 2016 09:24:05 -0700 ddehaven Merge
Wed, 08 Jun 2016 09:56:56 +0530 psadhukhan 6212751: DOC: ServiceUI.printDialog() need to enhance the description for X,Y coordinates
Tue, 07 Jun 2016 20:15:01 +0400 alexsch 8158178: java.awt.SplashScreen.getSize() returns incorrect size for high dpi splash screens
Tue, 07 Jun 2016 11:57:59 +0300 ssadetsky 8151015: JTextArea.insert() does not behave as expected with invalid position
Tue, 07 Jun 2016 11:40:28 +0300 ssadetsky 8156121: "Fail forward" fails for GTK3 if no GTK2 available
Tue, 07 Jun 2016 11:29:42 +0300 ssadetsky 8154431: Allow source and target based validation for the focus transfer between two JComponents
Tue, 07 Jun 2016 11:02:21 +0530 psadhukhan 8158520: [TEST_BUG] java/awt/PrintJob/PrinterException.java fails on timeout
Mon, 06 Jun 2016 13:16:45 -0700 ddehaven Merge
Mon, 06 Jun 2016 18:28:46 +0300 serb 8146313: The java.beans.Statement.invoke() method handles 3-arg Class.forName incorrectly
Mon, 06 Jun 2016 16:23:37 +0300 avu 8158495: CCE: sun.java2d.NullSurfaceData cannot be cast to sun.java2d.opengl.OGLSurfaceData
Fri, 03 Jun 2016 12:27:06 +0530 rchamyal 8158358: [TEST_BUG] test/javax/swing/JPopupMenu/8147521/PopupMenuTest.java: compilation failed
Fri, 03 Jun 2016 11:55:46 +0530 rchamyal 8146319: JEditorPane function setPage leaves a file lock
Fri, 03 Jun 2016 11:37:45 +0530 aghaisas 8074829: Resolve disabled warnings for libawt_headless
Thu, 02 Jun 2016 15:36:15 +0300 bae 8078382: Wrong glyph is displayed for a derived font
Thu, 02 Jun 2016 15:20:31 +0530 psadhukhan 6842011: StackOverflowError printing landscape with scale and transform
Thu, 02 Jun 2016 15:16:07 +0530 aghaisas 8139192: Custom ImageFilters return blank images in Java 8(.45) while working in 7
Thu, 02 Jun 2016 13:15:00 +0530 aniyogi 8132771: [TEST_BUG][macosx] Test javax/swing/JTree/DnD/LastNodeLowerHalfDrop.java fails for MacOSX
Wed, 01 Jun 2016 20:40:11 -0700 prr 8158408: Font2DTest demo needs to use FontPanel resolution matching the screen
Wed, 01 Jun 2016 15:27:51 -0700 ddehaven Merge
Wed, 01 Jun 2016 11:16:22 +0530 aniyogi 8158230: [macosx] ActionEvent is not fired for menu item with option apple.laf.useScreenMenuBar
Tue, 31 May 2016 18:31:29 +0300 serb 8157320: The CheckboxMenuItem can not be selected
Tue, 31 May 2016 15:57:01 +0300 ssadetsky 8139218: Dialog that opens and closes quickly changes focus in original focusowner
Tue, 31 May 2016 16:03:21 +0530 aniyogi 8144161: [TESTBUG] [macosx] Test javax/swing/plaf/basic/BasicComboPopup/7072653/bug7072653.java fails for mac
Tue, 31 May 2016 12:29:57 +0530 psadhukhan 4957035: Code given in api is not compilable: docs/api/javax/print/package-summary.html
Mon, 30 May 2016 13:42:11 +0300 serb 8158072: Need a test for JDK-7172749
Mon, 30 May 2016 16:04:40 +0530 arapte 8145284: [Documentation] [TextField] Missing new line character handling
Mon, 30 May 2016 12:43:18 +0300 aivanov 8133731: [TEST_BUG] Unmappable in ASCII character such as Thai should be escaped in the regtests targeted for a regular non-I18n runs
Mon, 30 May 2016 11:08:27 +0300 ssadetsky 8157163: AWT FileDialog does not inherit icon image from parent Frame
Mon, 30 May 2016 10:50:32 +0300 ssadetsky 8147842: IME Composition Window is displayed at incorrect location
Sun, 29 May 2016 02:34:28 +0300 serb 8156043: Unstable behavior of PropertyDescriptor's getWriteMethod() in case of overloaded setters
Sun, 29 May 2016 02:10:14 +0300 serb 8028486: java/awt/Window/WindowsLeak/WindowsLeak.java fails
Fri, 27 May 2016 13:26:56 -0700 prr 8157339: Further stabilization for the SwingSet client sanity tests
Thu, 26 May 2016 19:58:46 +0300 avu 7172749: Xrender: Class cast exception in 2D code running an AWT regression test
Fri, 20 May 2016 00:03:45 -0700 lana 8155918: JDK9 preparation message drop resource updates
Thu, 26 May 2016 16:12:12 +0300 serb 8132973: @BeanProperty: what is the correct output in case of repeating annotations?
Thu, 26 May 2016 17:01:24 +0530 aghaisas 6827800: Default button is activated even when it is invisible
Thu, 26 May 2016 16:02:19 +0530 rchamyal 8147521: [macosx] Internal API Usage: setPopupType used to force creation of heavyweight popup
Wed, 25 May 2016 15:51:09 -0700 bpb 8156580: Make TIFFTagSet subclasses final
Wed, 25 May 2016 15:48:57 -0700 bpb 8149815: Misleading TIFFField#getAsNativeNode spec about native node name "TIFFIFD"
Wed, 25 May 2016 15:20:45 -0700 prr 8154860: ImageIO.getImageReadersByFormatName() fails when jai_imageio is in the classpath
Wed, 25 May 2016 13:38:38 -0700 ddehaven Merge
Wed, 25 May 2016 16:32:37 +0530 psadhukhan 8153184: BorderLayout javadoc says current version of JDK is 1.2
Wed, 25 May 2016 14:59:15 +0530 rchamyal 8152981: Double icons with JMenuItem setHorizontalTextPosition on Win 10
Tue, 24 May 2016 14:30:31 +0530 rchamyal 8153282: [TEST_BUG] some new JInternalFrame tests fail
Tue, 24 May 2016 14:23:36 +0530 rchamyal 7070795: High contrast colour scheme fails to be applied to JFormattedTextField
Tue, 24 May 2016 14:19:53 +0530 pkbalakr 8057574: inconsistent behavior for setBackground (Windows/Linux)
Mon, 23 May 2016 17:43:45 +0300 serb 8155103: [TEST_BUG] @BeanProperty: unwanted "declaringClass" descriptor when annotating an enum
Sun, 22 May 2016 12:31:56 +0400 alexsch 8136366: Add a public API to create a L&F without installation
Sat, 21 May 2016 02:53:37 +0300 serb 8156579: Two JavaBeans tests failed
Thu, 19 May 2016 22:24:00 +0300 serb 8148915: Intermittent failures of bug6400879.java
Fri, 20 May 2016 15:48:50 +0300 ant 8156116: [macosx] two JNI locals to delete in AWTWindow.m, CGraphicsEnv.m
Fri, 20 May 2016 10:48:48 +0300 dmarkov 8157322: Several typos in javadoc
Thu, 19 May 2016 16:45:58 +0530 aghaisas 7172750: Nimbus ScrollBar:ScrollBarThumb[Pressed].backgroundPainter is never invoked
Thu, 19 May 2016 16:34:36 +0530 pkbalakr 6587251: Import declaration not used in sun.java2d.*
Thu, 19 May 2016 16:32:38 +0530 psadhukhan 6509729: javax.print.ServiceUI.printDialog Border/Margin Evaluation is bugged
Wed, 18 May 2016 12:04:26 -0700 prr Merge
Wed, 18 May 2016 20:40:17 +0300 serb 8156169: Some sound tests rarely hangs because of incorrect synchronization
Mon, 16 May 2016 22:57:40 -0700 dtitov 8155785: Add @Deprecated annotations to the Applet API classes
Wed, 18 May 2016 19:23:39 +0300 serb 8156894: Cleanup of sun.java2d.pipe.Region
Wed, 18 May 2016 18:35:54 +0300 mcherkas 6882559: new JEditorPane("text/plain","") fails for null context class loader
Wed, 18 May 2016 15:51:19 +0300 aivanov 8136998: JComboBox prevents wheel mouse scrolling of JScrollPane
Wed, 18 May 2016 11:33:04 +0530 psadhukhan 6529030: Java Printing: Print range > Selection gets enabled
Tue, 17 May 2016 21:50:13 +0300 vadim 6477756: GraphicsDevice.getConfigurations() is slow taking 3 or more seconds
Tue, 17 May 2016 14:31:12 +0300 ssadetsky 8046031: UI of Java Web Start app isn't updated when changing Windows theme
Mon, 16 May 2016 18:12:53 +0300 alitvinov 8041694: JFileChooser removes trailing spaces in the selected directory name
Fri, 13 May 2016 18:08:54 +0300 serb 8156583: Typo in the spec of javax.sound.sampled.AudioFormat.Encoding.toString()
Fri, 13 May 2016 14:30:59 +0300 mcherkas 8078268: javax.swing.text.html.parser.Parser parseScript incorrectly optimized
Fri, 13 May 2016 14:25:29 +0300 dmarkov 8080729: [macosx] java 7 and 8 JDialogs on multiscreen jump to parent frame on focus
Wed, 15 Jun 2016 12:36:19 -0700 ksrini 8065831: Ensure the pack200/unpack200 help is consistent with man page
Wed, 15 Jun 2016 11:56:09 -0700 mchung 8068764: java/lang/ClassLoader/ExtDirs.java failed with java.lang.IllegalThreadStateException with fastdebug
Wed, 15 Jun 2016 19:18:19 +0100 chegar 8157045: NPE during websocket communication with wss
Wed, 15 Jun 2016 10:25:25 -0700 shurailine 8158855: Fix remaining module dependences in java/lang
Wed, 15 Jun 2016 09:24:16 -0700 naoto 8043387: java/time/test/java/util/TestFormatter.java failed.
Wed, 15 Jun 2016 14:21:24 +0200 srastogi 8039955: [TESTBUG] jdk/lambda/LambdaTranslationTest1 - java.lang.AssertionError: expected [d:1234.000000] but found [d:1234,000000]
Wed, 15 Jun 2016 09:11:12 +0000 xuelei 8150966: Typo in javax.net.ssl.SSLEngineResult.HandshakeStatus.NEED_UNWRAP_AGAIN
Tue, 14 Jun 2016 23:02:43 -0700 darcy 8159502: Mark ShortRSAKey512.java as intermittently failing
Wed, 15 Jun 2016 11:42:59 +0800 weijun 8158887: sun/security/tools/jarsigner/concise_jarsigner.sh timed out
Tue, 14 Jun 2016 20:17:41 -0700 amurillo Merge
Tue, 14 Jun 2016 10:22:07 -0700 amurillo Merge
Fri, 10 Jun 2016 15:13:40 -0700 amurillo Merge
Fri, 03 Jun 2016 13:07:00 +0300 dsamersoff 8155009: [TESTBUG] jstack subtest of BasicLauncherTest should not be executed under OS X
Fri, 03 Jun 2016 10:05:04 +0200 rehn 8156537: Tools using MonitoredVmUtil do not parse module in cmdline correctly
Wed, 15 Jun 2016 10:13:21 +0800 weijun 8157848: Mark deprecated javax.security.auth.Policy API with forRemoval=true
Tue, 14 Jun 2016 18:19:54 -0700 vromero 8159530: recent compiler change results in compile error in JapaneseDate.java
Tue, 14 Jun 2016 16:56:27 -0700 sherman 8139414: java.util.Scanner hasNext() returns true, next() throws NoSuchElementException
Tue, 14 Jun 2016 10:27:23 -0700 asmotrak 8159038: javax/net/ssl/SSLSession/SessionCacheSizeTests.java failed with java.net.SocketException: Address already in use
Tue, 14 Jun 2016 09:03:12 -0700 darcy 8159330: Improve deprecation text for Class.newInstance
Tue, 14 Jun 2016 12:29:49 +0900 nishjain 8135061: java.util.Locale#lookup throws java.lang.StringIndexOutOfBoundsException for range having '-' as second character
Mon, 13 Jun 2016 21:49:37 +0000 valeriep 8157489: AppleProvider in java.base/macosx/classes/module-info.java.extra
Mon, 13 Jun 2016 21:49:12 +0000 valeriep 8157881: security.provider property description needs to be updated for modules
Thu, 16 Jun 2016 19:07:28 +0000 lana Added tag jdk-9+123 for changeset ac9b9cc41b80
Wed, 05 Jul 2017 21:50:35 +0200 duke Merge
Thu, 16 Jun 2016 20:57:05 +0000 lana Merge
Fri, 10 Jun 2016 15:13:37 -0700 amurillo Merge
Fri, 03 Jun 2016 17:45:03 -0400 jiangli 8157189: 'iload_w' in shared class is not interpreted correctly.
Fri, 03 Jun 2016 13:26:43 -0500 gziemski 8155936: Boolean value should be set 1/0 or true/false via VM.set_flag jcmd
Fri, 03 Jun 2016 16:19:53 +0000 rprotacio Merge
Fri, 03 Jun 2016 11:53:55 -0400 rprotacio 8152404: Stabilize PackageEntry::package_exports_do
Fri, 03 Jun 2016 08:33:28 -0400 coleenp 8158397: Crash: assert(save_resolved_method == resolved_method()) failed: does this change?
Fri, 03 Jun 2016 04:34:08 +0000 dholmes Merge
Thu, 02 Jun 2016 23:37:09 -0400 dholmes 8154750: Add missing OrderAccess operations to ClassLoaderData lock-free data structures
Fri, 03 Jun 2016 05:38:08 +0200 mockner Merge
Thu, 02 Jun 2016 12:07:55 -0400 mockner 8138705: Kitchen sink stress test fails
Fri, 03 Jun 2016 01:31:01 +0000 amurillo Merge
Thu, 02 Jun 2016 15:07:51 -0700 amurillo Merge
Thu, 02 Jun 2016 23:57:07 +0000 coleenp Merge
Fri, 13 May 2016 15:22:48 +0200 goetz 8156923: [ppc] Implement "JEP 270: Reserved Stack Areas for Critical Sections".
Tue, 31 May 2016 20:31:08 +0300 mchernov 8157954: [TESTBUG] G1 tests fail with defined MaxGCPauseMillis
Thu, 02 Jun 2016 09:44:41 +0200 sjohanss 8152239: hotspot/test/gc/TestSmallHeap.java failed in jdk9
Thu, 16 Jun 2016 19:07:26 +0000 lana Added tag jdk-9+123 for changeset 407ee1280983
Thu, 16 Jun 2016 20:56:39 +0000 lana Merge
Wed, 15 Jun 2016 09:24:04 -0700 ddehaven Merge
Mon, 06 Jun 2016 13:16:43 -0700 ddehaven Merge
Fri, 03 Jun 2016 18:04:38 +0200 erikj 8157479: jdk-9_solaris-x64_bin-debug.tar.gz error - typeflag 'L' not recognized
Thu, 16 Jun 2016 19:07:26 +0000 lana Added tag jdk-9+123 for changeset 0bc7ed792590
Wed, 05 Jul 2017 21:50:09 +0200 duke Added tag jdk-9+123 for changeset d53037a90c44
Wed, 05 Jul 2017 21:50:08 +0200 duke Mergejdk-9+123
Wed, 05 Jul 2017 21:50:01 +0200 duke Merge
Mon, 13 Jun 2016 09:21:01 -0700 darcy 8159378: Correct wording of RoundEnvironment.getElementsAnnotatedWithAny
Mon, 13 Jun 2016 09:12:35 -0700 darcy 8155880: Fix langtools usage of the deprecated Class.newInstance method
Mon, 13 Jun 2016 12:04:09 +0100 mcimadamore 8158630: Langtools Intellij project is missing some source roots
Sat, 11 Jun 2016 09:47:59 +0900 shinyafox 8158123: NPE when the annotations is used in export-to of module-info
Fri, 10 Jun 2016 13:52:03 -0700 iris 8158458: Update references from "1.9" to "9"
Fri, 10 Jun 2016 16:43:38 -0600 dlsmith 8037804: Implement specified test for related functional interface types
Fri, 10 Jun 2016 15:08:00 -0600 dlsmith 8144767: Fix handling of capture variables in most-specific test
Fri, 10 Jun 2016 11:11:52 +0000 ntv 8155581: jshell tool: replace use of Option.get()
Thu, 09 Jun 2016 23:24:05 -0700 bpatel 8156077: Support javadoc tags in module documentation
Thu, 09 Jun 2016 19:06:36 +0000 lana Merge
Thu, 09 Jun 2016 14:20:11 +0200 jlahoda 8158174: jshell tool: leaks threads waiting on StopDetectingInputStream
Wed, 08 Jun 2016 00:32:31 -0700 rfield 8139829: JShell API: No use of fields to return information from public types
Thu, 09 Jun 2016 17:28:38 +0000 lana Added tag jdk-9+122 for changeset 3d6ea76b35d6
Wed, 05 Jul 2017 21:49:53 +0200 duke Merge
Thu, 09 Jun 2016 17:28:37 +0000 lana Added tag jdk-9+122 for changeset 59f8ee713e5f
Wed, 05 Jul 2017 21:49:47 +0200 duke Merge
Thu, 09 Jun 2016 17:28:37 +0000 lana Added tag jdk-9+122 for changeset 57f451f8c235
Wed, 05 Jul 2017 21:49:43 +0200 duke Merge
Mon, 13 Jun 2016 12:39:28 +0200 hannesw 8159220: Preserve position info in module import and export entries
Thu, 09 Jun 2016 19:07:12 +0000 lana Merge
Wed, 08 Jun 2016 20:35:23 +0530 sundar 8159034: 4 nashorn ant tests fail with latest jdk9-dev build with IncompatibleClassChangeError
Wed, 08 Jun 2016 15:53:22 +0200 hannesw 8159031: jjs throws NoSuchFileException if ~/.jjs.history does not exist
Tue, 07 Jun 2016 19:13:26 +0530 sundar 8158922: jjs tab completion of Java classes shows package-private, "hidden" classes too
Thu, 09 Jun 2016 17:28:39 +0000 lana Added tag jdk-9+122 for changeset 6155e509fca0
Wed, 05 Jul 2017 21:49:35 +0200 duke Merge
Thu, 09 Jun 2016 17:28:36 +0000 lana Added tag jdk-9+122 for changeset 4fe343030c2a
Wed, 05 Jul 2017 21:49:29 +0200 duke Merge
Mon, 13 Jun 2016 18:28:46 +0100 chegar 8041924: sun/net/www/http/ChunkedOutputStream/checkError.java fails on some systems
Sun, 12 Jun 2016 23:19:34 -0700 bgopularam 8062758: Update java/security/Security/ClassLoaderDeadlock/Deadlock2.sh with the removal of -Djava.ext.dirs
Mon, 13 Jun 2016 09:31:20 -0600 dlsmith 8159186: jdk/test/Makefile: allow users to set verbosity
Mon, 13 Jun 2016 15:48:17 +0100 prappo 8159039: sun/net/httpclient/hpack/HeaderTableTest.java fails on some locales
Mon, 13 Jun 2016 14:02:04 +0200 redestad 8159334: ModuleDescriptor retains overlapping sets for all and concealed packages
Mon, 13 Jun 2016 11:46:07 +0200 jlahoda 8139507: WARNING: Could not open/create prefs root node Software\JavaSoft\Prefs
Mon, 13 Jun 2016 00:47:32 -0700 fyuan 8158620: Enable debug option for sun/security/ec/TestEC.java
Mon, 13 Jun 2016 08:29:43 +0100 chegar 8158519: Incorrect network mask and broadcast address on Linux when there are multiple IPv4 addresses on an interface
Mon, 13 Jun 2016 08:20:34 +0100 dfuchs 8153666: Optimize Formatter.formatMessage
Sun, 12 Jun 2016 21:55:20 -0700 mli 8151913: Fix module dependencies in java/net tests
Sun, 12 Jun 2016 12:14:52 -0700 darcy 5041778: (ann) AnnotationFormatError if "default" Class type not found
Sun, 12 Jun 2016 10:48:19 +0800 weijun 8158534: DrbgParameters strength parameter is underspecified if < -1
Sat, 11 Jun 2016 18:33:53 -0700 mli 8157665: ProblemList.txt needs to be updated as 7041639 closed
Fri, 10 Jun 2016 13:47:19 -0700 iris 8158458: Update references from "1.9" to "9"
Fri, 10 Jun 2016 23:06:24 +0000 valeriep 8157627: Ucrypto prov need to workaround the renaming of CK_AES_GCM_PARAMS starting S11.3
Fri, 10 Jun 2016 22:39:40 +0000 valeriep 8157495: SHA-3 Hash algorithm performance improvements (~12x speedup)
Fri, 10 Jun 2016 10:54:34 -0700 darcy 8159263: Problem list tools/jmod/JmodTest.java
Fri, 10 Jun 2016 20:25:51 +0900 nishjain 8040211: Update LSR datafile for BCP 47
Fri, 10 Jun 2016 07:38:33 -0300 jlaskey 8159228: Exclude jlink tests until jrt-fs patterns are rectified
Fri, 10 Jun 2016 00:37:24 -0700 jnimeh 8157925: Typo in the API documentation of X509KeyManager
Thu, 09 Jun 2016 19:07:27 +0000 lana Merge
Thu, 09 Jun 2016 11:39:42 -0300 jlaskey 8158402: jlink: should use regex for all pattern operations (--order-resources or --exclude-resources)
Thu, 09 Jun 2016 11:39:42 -0300 jlaskey 8156995: jimage: extract specified contents
Thu, 09 Jun 2016 11:39:42 -0300 jlaskey 8156994: jimage --help is not helpful
Thu, 09 Jun 2016 16:13:09 +0200 redestad 8158933: String concat stringifiers setup should avoid unnecessary lookups
Thu, 09 Jun 2016 09:33:37 +0200 srastogi 8147585: Annotations with lambda expressions has parameter result in wrong behavior.
Wed, 08 Jun 2016 17:30:37 -0700 mli 8158881: Doc typo in src/../java/net/URI.java
Wed, 08 Jun 2016 11:28:13 -0700 wetmore 8158978: ALPN not working when values are set directly on a SSLServerSocket
Wed, 08 Jun 2016 15:19:58 +0100 prappo 8156693: Improve usability of CompletableFuture use in WebSocket API
Wed, 08 Jun 2016 15:50:11 +0200 hannesw 8159031: jjs throws NoSuchFileException if ~/.jjs.history does not exist
Wed, 08 Jun 2016 16:25:39 +0800 amlu 8159012: Problem list sun/net/www/http/ChunkedOutputStream/checkError.java
Wed, 08 Jun 2016 11:14:45 +0300 shade 8158851: MH.publicLookup() init circularity, triggered by custom SecurityManager with String concat and -limitmods java.base
Wed, 08 Jun 2016 12:54:37 +0900 nishjain 8047780: [Doc] Locale.LanguageRange() throws an undocumented IAE when range is ill-formed.
Tue, 07 Jun 2016 09:00:11 -0700 ssahoo 8157896: TestDSAGenParameterSpec.java test fails with timeout
Tue, 07 Jun 2016 08:54:46 -0700 akosarev 8157603: TestCipher.java doesn't check one of the decrypted message as expected
Tue, 07 Jun 2016 11:43:46 +0000 akolarkunnu 8073611: javax.script.ScriptEngineFactory: formatting error in javadoc of getParameter
Tue, 07 Jun 2016 12:29:19 +0100 prappo 8156650: Simplify Text message support in WebSocket API
Tue, 07 Jun 2016 10:33:38 +0800 weijun 8151836: keytool -importkeystore -help does not list option -destprotected
Tue, 07 Jun 2016 10:11:33 +0800 weijun 8158442: SecureRandomParameters missing "@since 9"
Tue, 07 Jun 2016 10:10:59 +0800 weijun 8157308: Make AbstractDrbg non-Serializable
Mon, 06 Jun 2016 16:46:54 -0700 darcy 8158870: Temporarily problem list DGCDeadLock.java on Mac
Thu, 09 Jun 2016 17:28:37 +0000 lana Added tag jdk-9+122 for changeset 29957ed01d97
Wed, 05 Jul 2017 21:49:19 +0200 duke Merge
Thu, 09 Jun 2016 17:28:36 +0000 lana Added tag jdk-9+122 for changeset 40c900f520ce
Fri, 10 Jun 2016 16:59:18 +0200 erikj 8144911: Consider having modifications to jdk.jlink trigger recreation of all jmods
Fri, 10 Jun 2016 16:56:29 +0200 erikj 8055735: JDK_FILTER is broken
Thu, 09 Jun 2016 19:06:34 +0000 lana Merge
Thu, 09 Jun 2016 11:12:18 -0300 jlaskey 8158402: jlink: should use regex for all pattern operations (--order-resources or --exclude-resources)
Thu, 09 Jun 2016 10:40:19 +0200 erikj 8159047: Disable redundant build steps when creating buildjdk
Tue, 07 Jun 2016 15:42:20 +0200 erikj 8158535: Configure script uses basic tools directly in many places
Thu, 09 Jun 2016 17:28:35 +0000 lana Added tag jdk-9+122 for changeset bbb89d6c08cc
Wed, 05 Jul 2017 21:49:01 +0200 duke Added tag jdk-9+122 for changeset 7693aa00e131
Wed, 05 Jul 2017 21:49:00 +0200 duke Mergejdk-9+122
Wed, 05 Jul 2017 21:48:54 +0200 duke Merge
Thu, 02 Jun 2016 17:31:38 -0700 ksrini 8157975: Remove duplicate files in sample API
Thu, 02 Jun 2016 21:14:40 +0000 lana Merge
Thu, 02 Jun 2016 14:05:13 -0700 rfield 8131029: JShell: recover from VMConnection launch failure
Thu, 02 Jun 2016 12:52:00 -0700 rfield 8131024: JShell: multi-line comment not detected as incomplete
Thu, 02 Jun 2016 15:39:10 -0400 vromero 8037947: functional interface causes ClassCastException when extending raw superinterface
Thu, 02 Jun 2016 11:06:20 -0700 ksrini 8158559: Fix for 8132216 breaks langtools build
Thu, 02 Jun 2016 16:08:24 +0100 mcimadamore 8158355: Inference graph dot support broken
Thu, 02 Jun 2016 15:25:20 +0530 sadayapalam 8132216: [Findbugs] Annotation$Array_element_value may expose internal representation
Thu, 02 Jun 2016 15:22:34 +0530 sadayapalam 8146167: Anonymous type declarations drop supertype type parameter annotations
Wed, 01 Jun 2016 12:39:24 +0100 mcimadamore 8145489: NPE while compiling annotations with qualified names in package-info.java
Tue, 31 May 2016 14:02:52 -0700 rfield 8080843: JShell tool: invalid key error occurs when external editor is used
Tue, 31 May 2016 13:00:17 -0400 vromero 8152062: obscure error message for bad 'provides'
Mon, 30 May 2016 16:36:41 +0200 robilad 8154469: Update FSF address
Thu, 02 Jun 2016 20:33:36 +0000 lana Added tag jdk-9+121 for changeset c95c5bc94fad
Wed, 05 Jul 2017 21:48:44 +0200 duke Merge
Thu, 02 Jun 2016 21:15:03 +0000 lana Merge
Mon, 30 May 2016 17:32:33 -0700 mchung 8153944: wsimport and wsgen usage messages not printed
Mon, 30 May 2016 16:31:56 +0200 robilad 8154469: Update FSF address
Thu, 02 Jun 2016 20:33:35 +0000 lana Added tag jdk-9+121 for changeset 328b05f311d6
Wed, 05 Jul 2017 21:48:35 +0200 duke Merge
Fri, 03 Jun 2016 11:38:38 -0700 joehw 8150187: NPE expected if the system identifier is null for CatalogResolver
Thu, 02 Jun 2016 23:26:41 -0700 joehw 8158246: Several api/org_xml/sax/helpers/XMLReader tests failed due to no SAXException occurs
Thu, 02 Jun 2016 21:15:28 +0000 lana Merge
Mon, 30 May 2016 16:28:01 +0200 robilad 8154469: Update FSF address
Thu, 02 Jun 2016 20:33:34 +0000 lana Added tag jdk-9+121 for changeset aab29ffdbd99
Wed, 05 Jul 2017 21:48:25 +0200 duke Merge
Mon, 06 Jun 2016 18:45:47 +0530 sundar 8158736: Adapter class loaders can avoid creating named dynamic modules
Fri, 03 Jun 2016 15:05:17 +0200 mhaupt 8148457: Remove jdk.nashorn.tools.FXShell class
Thu, 02 Jun 2016 21:14:32 +0000 lana Merge
Thu, 02 Jun 2016 14:56:20 +0530 sundar 8158467: AccessControlException is thrown on public Java class access if "script app loader" is set to null
Wed, 01 Jun 2016 15:17:37 +0530 sundar 8158338: Nashorn's ScriptLoader split delegation has to be adjusted
Tue, 31 May 2016 21:12:34 +0530 sundar 8158250: nashorn ant javadoc targets are broken
Tue, 31 May 2016 13:04:26 +0530 sundar 8158131: Nashorn should not use jdk.internal.module.Modules API
Mon, 30 May 2016 16:41:57 +0200 robilad 8154469: Update FSF address
Thu, 02 Jun 2016 20:33:36 +0000 lana Added tag jdk-9+121 for changeset 3e6c168b4edb
Wed, 05 Jul 2017 21:48:16 +0200 duke Merge
Thu, 02 Jun 2016 21:14:29 +0000 lana Merge
Mon, 30 May 2016 16:23:54 +0200 robilad 8154469: Update FSF address
Thu, 02 Jun 2016 20:33:33 +0000 lana Added tag jdk-9+121 for changeset 108280e801f9
Wed, 05 Jul 2017 21:48:06 +0200 duke Merge
Mon, 06 Jun 2016 12:45:17 -0700 amurillo Merge
Mon, 06 Jun 2016 09:58:04 -0700 amurillo Merge
Thu, 02 Jun 2016 14:58:53 -0700 amurillo Merge
Fri, 27 May 2016 19:31:41 +0300 dsamersoff 8152950: BasicLauncherTest.java fails due to type error
Thu, 26 May 2016 14:24:50 -0700 amurillo Merge
Wed, 25 May 2016 17:29:47 -0400 jiangli 8157716: jdk.internal.loader.ClassLoaders.addURLToUCP() should return converted real path URL.
Tue, 24 May 2016 14:14:18 +0300 vlivanov Merge
Fri, 20 May 2016 18:05:28 +0300 vlivanov Merge
Fri, 13 May 2016 08:31:23 +0200 thartmann 8155608: String intrinsic range checks are not strict enough
Wed, 11 May 2016 09:13:45 +0200 psandoz 8144826: [JVMCI] Remove jdk.vm.ci.hotspot.Stable and use jdk.internal.vm.annotation.Stable
Wed, 11 May 2016 00:38:26 +0300 vlivanov Merge
Tue, 24 May 2016 08:53:54 +0200 sla 8157555: com/sun/jdi/RedefineClearBreakpoint.sh times out due to Indify String Concat being slow in debug mode
Mon, 06 Jun 2016 10:52:21 -0700 naoto 8146156: Inconsistent default locale in string formatter methods
Mon, 06 Jun 2016 09:13:35 +0200 srastogi 8158171: MethodHandles.dropArgumentsToMatch(...) non-documented IAE
Fri, 03 Jun 2016 17:01:23 -0700 bchristi 8152893: StackWalker#getCallerClass is not filtering hidden/ reflection frames when walker is configured to show hidden /reflection frames
Fri, 03 Jun 2016 16:31:13 -0700 sherman 8074819: Resolve disabled warnings for libzip
Fri, 03 Jun 2016 12:26:45 -0700 mchung 8158604: test/java/util/ResourceBundle/modules/appbasic missing @test
Fri, 03 Jun 2016 16:28:53 +0100 michaelm 8158651: ConcurrentModification exceptions in httpclient
Fri, 03 Jun 2016 13:45:30 +0100 chegar 8158525: Update a few java/net tests to use the loopback address instead of the host address
Thu, 02 Jun 2016 16:39:14 -0700 mchung 8157892: StackFrame::getFileName returns null when a source file exists for native methods
Thu, 02 Jun 2016 21:15:12 +0000 lana Merge
Thu, 02 Jun 2016 14:03:50 -0700 sherman 8158482: regex UNICODE_CHARACTER_CLASS flag cannot be disabled with an embedded flag expression
Thu, 02 Jun 2016 12:25:17 -0700 rhalade 8158560: Mark java/rmi/transport/dgcDeadLock/DGCDeadLock.java as intermittently faiing
Thu, 02 Jun 2016 10:52:55 -0700 darcy 8158551: BigDecimal.sqrt javadoc typo
Thu, 02 Jun 2016 14:28:16 +0200 mhaupt 8156868: MethodHandles.zero(Class) doc issues
Wed, 01 Jun 2016 15:28:05 -0700 darcy 8158451: Problem list IncludeLocalesPluginTest.java
Wed, 01 Jun 2016 13:47:55 -0700 smarks 8059361: Properties.stringPropertyNames() returns a set inconsistent with the assertions from the spec
Wed, 01 Jun 2016 11:22:06 -0700 darcy 8158430: Push tests for JDK-5040830
Wed, 01 Jun 2016 11:16:58 -0700 darcy 5040830: (ann) please improve toString() for annotations containing exception proxies
Wed, 01 Jun 2016 09:52:08 -0700 sherman 8061777: (zipfs) IllegalArgumentException in ZipCoder.toString when using Shitft_JIS
Wed, 01 Jun 2016 14:33:44 +0100 rpatil 8151876: (tz) Support tzdata2016d
Wed, 01 Jun 2016 15:35:38 +0800 weijun 8152108: Correct jarsigner warning message about missing timestamp
Tue, 31 May 2016 22:04:00 -0700 mli 8158194: Rename the directory ?InstalledModuleDescriptors? and any reference to ?installed? to ?system? in the tests
Tue, 31 May 2016 19:13:21 -0700 darcy 8158312: Update String.join example code to use List convenience factory methods
Tue, 31 May 2016 21:27:28 -0400 lancea 8158281: java_sql_Timestamp.java fails with AssertionError
Tue, 31 May 2016 17:54:41 -0700 smarks 8157777: DeadCachedConnection doesn't wait for registry to die
Tue, 31 May 2016 16:42:32 -0700 anazarov 8157850: Jar tests should pass through VM options
Tue, 31 May 2016 22:41:56 +0000 amjiang 8156059: Update/Develop new tests for JEP 287: SHA-3 Hash Algorithms
Tue, 31 May 2016 13:15:48 -0700 amurillo Merge
Tue, 31 May 2016 09:41:18 -0700 amurillo Merge
Thu, 26 May 2016 14:17:06 -0700 amurillo Merge
Fri, 20 May 2016 11:30:52 -0700 amurillo Merge
Thu, 19 May 2016 03:49:41 -0400 dholmes 8157188: 2 test failures in demo/jvmti due to unexpected class file version 53
Tue, 31 May 2016 14:58:53 -0400 rriggs 8158254: Put java/time/test/java/time/TestClock_System on the problem list for Solaris
Tue, 31 May 2016 19:16:35 +0100 chegar 8085785: sun/net/www/protocol/http/ZoneId.java timeouts intermittently
Tue, 31 May 2016 10:59:31 -0700 mchung 8152721: Java Web Start splash mechanism is not working in JDK9
Tue, 31 May 2016 13:43:15 -0400 lancea 8154189: Deprivilege java.sql and java.sql.rowset module
Tue, 31 May 2016 13:10:46 +0530 sundar 8158131: Nashorn should not use jdk.internal.module.Modules API
Tue, 31 May 2016 16:19:32 +0900 nishjain 8072099: Format "ha" is unable to parse hours 10-12
Tue, 31 May 2016 00:15:04 -0700 mli 8158190: Add test that checks -Xpatch with both Jar and exploded patches
Mon, 30 May 2016 21:35:58 -0700 mli 8158149: test bug for SystemModuleFinder when fast path is supported
Tue, 31 May 2016 13:00:48 +0900 rgoel 8145136: Upgrade CLDR locale data
Tue, 31 May 2016 10:09:34 +0800 amlu 8154980: Remove intermittent key from test BandIntegrity.java
Mon, 30 May 2016 17:49:04 -0700 xiaofeya 8157816: Mark 4 httpclient tests as intermittently failing
Mon, 30 May 2016 16:03:48 -0700 mli 8158044: Add test that checks uri of upgradeable modules
Mon, 30 May 2016 17:55:53 +0100 alanb Merge
Mon, 30 May 2016 17:38:05 +0100 alanb 8066258: Re-examine com.sun.nio.file to see if it should be a supported API
Mon, 30 May 2016 18:39:43 +0300 igerasim 8158111: Make handling of 3rd party providers more stable
Mon, 30 May 2016 16:33:17 +0200 robilad 8154469: Update FSF address
Mon, 30 May 2016 15:28:48 +0900 nishjain 8158025: Typo in java.util.Locale
Thu, 02 Jun 2016 20:33:35 +0000 lana Added tag jdk-9+121 for changeset 2435017e82ff
Wed, 05 Jul 2017 21:47:36 +0200 duke Merge
Mon, 06 Jun 2016 09:58:03 -0700 amurillo Merge
Thu, 02 Jun 2016 14:58:50 -0700 amurillo Merge
Fri, 13 May 2016 15:20:06 +0200 goetz 8156922: [ppc] Implement template interpreter stack overflow checks as on x86/sparc.
Wed, 01 Jun 2016 11:14:58 -0400 hseigel 8156156: Add module specific NMT MemoryType
Wed, 01 Jun 2016 07:44:43 -0400 hseigel 8158060: BasicLayerTest causes fatal error: Thread holding lock at safepoint that vm can block on: Module_lock
Tue, 31 May 2016 15:21:56 -0400 ctornqvi 8158106: native/GTestWrapper.java gets SIGABR
Tue, 31 May 2016 17:09:45 +0200 rehn Merge
Tue, 31 May 2016 12:40:42 +0200 rehn 8158150: LogConfiguration::describe output can get truncated
Fri, 27 May 2016 12:57:38 +0200 sjohanss 8157153: TestStressRSetCoarsening fails with OOM
Mon, 30 May 2016 19:56:27 +0400 dfazunen 8154096: Extend WhiteBox API with methods which retrieve from VM information about available GC
Fri, 27 May 2016 17:48:56 +0300 mchernov 8157452: [TESTBUG] PLAB tests don't handle unexpected GC
Fri, 27 May 2016 19:43:58 +0000 asmotrak Merge
Fri, 27 May 2016 09:25:49 -0700 asmotrak 8152207: Perform array bound checks while getting a length of bytecode instructions
Fri, 27 May 2016 17:56:49 +0000 dsamersoff Merge
Fri, 27 May 2016 19:31:17 +0300 dsamersoff 8152950: BasicLauncherTest.java fails due to type error
Fri, 27 May 2016 16:39:49 +0000 coleenp Merge
Fri, 27 May 2016 14:57:11 +0000 coleenp Merge
Fri, 27 May 2016 10:52:39 -0400 coleenp 8145148: InterfaceMethod CP entry pointing to a class should cause ICCE
Fri, 27 May 2016 14:49:05 +0000 vlivanov Merge
Fri, 27 May 2016 16:56:23 +0300 vlivanov Merge
Thu, 26 May 2016 14:17:50 +0200 neliasso 8153352: Crash with assert(pd != 0L) failed: PcDesc must not be NULL
Thu, 26 May 2016 14:17:49 +0200 neliasso 8157717: MultiCommand breaks directives amount limit
Wed, 25 May 2016 13:30:07 +0000 enevill 8157841: aarch64: prefetch ignores cache line size
Wed, 25 May 2016 15:05:26 +0000 enevill 8157834: aarch64: Hello World crashes with fastdebug build
Wed, 25 May 2016 16:22:31 +0300 dpochepk 8156470: [JITtester] EOL on Windows
Wed, 25 May 2016 16:20:02 +0300 dpochepk 8156585: Cosmetic: AARCH64 defines in c1_LIRAssembler_aarch64.hpp
Wed, 25 May 2016 10:46:21 +0200 psandoz 8157683: Thread.onSpinWait intrinsification doesn't have sufficient test coverage
Fri, 27 May 2016 05:49:24 -0700 iklam 8145247: incorrect comment in SystemDictionary::load_shared_class
Thu, 26 May 2016 20:43:13 -0400 dholmes 8154589: assert(k != NULL) failed: preloaded klass not initialized
Thu, 26 May 2016 14:24:50 -0700 amurillo Merge
Wed, 25 May 2016 23:45:17 +0200 dholmes Merge
Wed, 25 May 2016 16:23:15 -0400 dholmes 8157175: GetNanoTimeAdjustment.java fails with excessive adjustment error
Wed, 25 May 2016 13:46:05 -0400 kbarrett 8156548: gc/gctests/StringInternSyncWithGC2 fails with Test level exit status: 151
Tue, 24 May 2016 12:42:43 -0500 gziemski 8152856: Xcode 7.3 -Wshift-negative-value compile failure on Mac OS X
Tue, 24 May 2016 13:39:18 +0000 vlivanov Merge
Tue, 24 May 2016 14:13:57 +0300 vlivanov Merge
Mon, 23 May 2016 17:33:39 +0300 dpochepk 8157438: JVMCI: MaterializeVirtualObjectTest fails w/ "CASE: invalidate=true: has no virtual object before"
Fri, 20 May 2016 14:17:55 -0700 vdeshpande 8154473: Update for CompilerDirectives to control stub generation and intrinsics
Fri, 20 May 2016 18:27:03 +0300 vlivanov 8154831: CastII/ConvI2L for a range check is prematurely eliminated
Fri, 20 May 2016 18:05:09 +0300 vlivanov Merge
Thu, 19 May 2016 10:40:19 +0200 neliasso 8155108: CompilerControl: tests incorrectly set states for excluded methods
Wed, 18 May 2016 21:50:27 +0000 dnsimon 8156835: [JVMCI] clean up and minimize JVMCI
Wed, 18 May 2016 19:16:14 +0000 tpivovarova Merge
Wed, 18 May 2016 20:19:23 +0300 tpivovarova 8141149: [jittester] create Visitor for generating bytecode
Wed, 18 May 2016 17:01:01 +0000 rschatz 8156942: [JVMCI] replace LIRKind with abstract base class
Mon, 16 May 2016 17:01:53 +0300 dpochepk 8152343: JVMCI test tasks: Unit tests for MetaAccessProvider
Mon, 16 May 2016 17:00:08 +0300 dpochepk 8152342: JVMCI test task: Unit tests for MethodHandleAccessProvider
Mon, 16 May 2016 16:58:02 +0300 dpochepk 8152341: JVMCI test task: Unit tests for MemoryAccessProvider
Mon, 16 May 2016 16:54:09 +0300 dpochepk 8139703: [TESTBUG] compiler/jvmci/compilerToVM/MaterializeVirtualObjectTest fails using -Xcomp
Fri, 13 May 2016 21:26:06 +0000 twisti Merge
Wed, 11 May 2016 10:23:59 -1000 twisti 8156159: replace CompilerToVM.readUncompressedOop with Unsafe.getUncompressedObject
Fri, 13 May 2016 22:21:54 +0300 mdoerr 8141635: Implement VarHandles/Unsafe intrinsics on POWER
Fri, 13 May 2016 06:36:52 +0000 thartmann Merge
Fri, 13 May 2016 08:32:20 +0200 thartmann 8155608: String intrinsic range checks are not strict enough
Fri, 13 May 2016 01:06:46 +0000 rschatz 8156552: [JVMCI] remove final and stable field handling from ConstantReflectionProvider
Thu, 12 May 2016 22:06:55 +0000 never 8155047: [JVMCI] findLeafConcreteSubtype should handle arrays of leaf concrete subtype
Thu, 12 May 2016 18:11:14 +0000 rschatz Merge
Wed, 11 May 2016 13:27:56 +0200 rschatz 8156741: [JVMCI] remove LocationIdentity interface
Thu, 12 May 2016 12:59:35 +0200 rschatz 8156768: [JVMCI] remove support for patching Symbol pointers
Thu, 12 May 2016 12:46:07 +0300 shade 8153792: EA: assert(ptn->as_LocalVar()->edge_count() > 0) failed: sanity when compiling compareAndExchange
Thu, 12 May 2016 08:25:42 +0200 thartmann 8155241: Crash with assert in Xcomp mode and with disabled ReduceBulkZeroing
Thu, 12 May 2016 08:23:25 +0200 thartmann 8155643: Java crash with assert in Xcomp mode and disabled ReduceInitialCardMarks
Thu, 12 May 2016 04:17:00 +0000 never 8156034: [JVMCI] Notify the jvmci compiler on completion of a bootstrap