log

age author description
Wed, 04 Jun 2014 17:14:56 +0400 serb 8043979: Javadoc cleanup of javax.sound.sampled package
Wed, 04 Jun 2014 16:55:06 +0400 serb 8041129: [OGL] surface->sw blit is extremely slow
Tue, 03 Jun 2014 17:03:29 -0700 darcy 8044698: Fix finally lint warnings in javax.swing
Tue, 03 Jun 2014 12:32:25 -0700 darcy 8044694: Fix finally lint warnings in sun.print
Tue, 03 Jun 2014 21:03:35 +0400 malenkov 7084904: Introspector returns isX() from base package-private class that throws exception
Tue, 03 Jun 2014 09:22:59 -0700 darcy 8042860: Fix raw and unchecked warnings in java.beans
Tue, 03 Jun 2014 11:18:03 -0400 rriggs 8044460: Cleanup new Boolean and single character strings
Mon, 02 Jun 2014 15:25:43 +0400 pchelko 8043807: Incorrect StackTrace in IOException thrown from ClipboardTransferable
Mon, 02 Jun 2014 14:20:02 +0400 dmarkov 8042465: Applet menus not rendering when browser is full screen on Mac
Fri, 30 May 2014 13:16:51 +0400 azvegint 8031471: Test closed/java/awt/dnd/FileDialogDropTargetTest/FileDialogDropTargetTest.java fails on Solaris zones virtual hosts
Fri, 30 May 2014 15:24:42 +0400 malenkov 8007563: When checking the default behaviour for a scroll tab layout and checking the 'opaque' checkbox, the area behind tabs is not red.
Fri, 30 May 2014 14:23:25 +0400 yan 8044172: [TEST_BUG] Move regtests for 4523758 and AltPlusNumberKeyCombinationsTest to jdk
Fri, 30 May 2014 14:06:50 +0400 serb 8040113: File not initialized in src/share/native/sun/awt/giflib/dgif_lib.c
Fri, 30 May 2014 11:20:03 +0400 anashaty 8032788: ImageIcon constructor throws an NPE and hangs when passed a null String parameter
Thu, 29 May 2014 17:31:41 +0400 anashaty 8028617: Dvorak keyboard mapping not honored when ctrl key pressed
Wed, 28 May 2014 15:36:10 +0400 alexsch 8043705: Can't exit color chooser dialog when running as an applet
Tue, 27 May 2014 13:58:00 -0700 prr Merge
Tue, 27 May 2014 12:50:51 -0700 prr 8035301: Eliminate dependency on sun.text from font code
Mon, 26 May 2014 18:01:59 +0400 malenkov 8019180: Use JComboBox as it's own ActionListener leads to unexpected behaviour
Mon, 26 May 2014 16:37:25 +0400 serb 8009883: REGRESSION: test/closed/javax/swing/AbstractButton/4246045/bug4246045.java fails
Mon, 26 May 2014 15:50:10 +0400 yan 8041915: Move 8 awt tests to OpenJDK regression tests tree
Mon, 26 May 2014 14:33:49 +0400 alexsch 8040291: [macosx] Http-Images are not fully loaded when using ImageIcon
Fri, 23 May 2014 11:13:54 -0700 prr Merge
Fri, 23 May 2014 19:48:25 +0400 pchelko 8031485: [macosx] Combo box consuming escape key events
Fri, 23 May 2014 19:43:14 +0400 pchelko 8043610: Sorting columns in JFileChooser fails with AppContext NPE
Fri, 23 May 2014 11:04:37 -0400 omajid 8043805: Allow using a system-installed libjpeg
Thu, 22 May 2014 13:54:52 -0700 prr 8042850: [parfait]: Extra unused entries in ICU ScriptCodes enum
Thu, 22 May 2014 13:54:08 -0700 prr 8042855: [parfait] Potential null pointer dereference in IndicLayoutEngine.cpp
Thu, 22 May 2014 21:05:30 +0400 malenkov 8043627: NPE in SynthContext in plugin mode
Thu, 22 May 2014 15:46:50 +0400 pchelko 8043646: libosxapp.dylib fails to build on Mac OS 10.9 with clang
Wed, 21 May 2014 11:12:18 -0700 prr 8039394: Compiler warnings about C++ exceptions in windows printing code
Wed, 21 May 2014 10:50:14 -0700 prr 8016451: Scary messages emitted by build.tools.generatenimbus.PainterGenerator during build
Wed, 21 May 2014 16:48:04 +0400 malenkov 8043456: KSS: javax.swing.plaf.basic.BasicInternalFrameTitlePane#postClosingEvent
Wed, 21 May 2014 14:13:17 +0400 alexsch 8041561: Inconsistent opacity behaviour between JCheckBox and JRadioButton
Wed, 21 May 2014 14:07:06 +0400 alexsch 8036110: In TextField can only select text visible or to the left of the cursor
Tue, 20 May 2014 09:36:22 -0700 darcy 8042864: Fix raw and unchecked warnings in javax.print
Mon, 19 May 2014 23:21:39 +0400 ddehaven 8026385: [macosx] (awt) setjmp/longjmp changes the process signal mask on OS X
Mon, 19 May 2014 10:03:58 -0700 darcy 8042871: Fix raw and unchecked warnings in sun.audio
Mon, 19 May 2014 16:48:41 +0400 anashaty 8038000: java.awt.image.RasterFormatException: Incorrect scanline stride
Fri, 16 May 2014 15:57:06 +0400 malenkov 8043153: KSS: javax.swing.plaf.synth.SynthParser#startColor
Fri, 16 May 2014 15:51:57 +0400 malenkov 8043152: KSS: javax.swing.plaf.synth.SynthContext
Fri, 16 May 2014 15:46:24 +0400 malenkov 8043151: KSS: javax.swing.plaf.nimbus.AbstractRegionPainter#getComponentColor
Wed, 18 Jun 2014 12:52:14 -0700 ddehaven 8043340: [macosx] Fix hard-wired paths to JavaVM.framework
Thu, 03 Jul 2014 11:37:18 -0700 katleman Added tag jdk9-b21 for changeset 843911d61b95
Wed, 05 Jul 2017 19:47:36 +0200 duke Merge
Wed, 09 Jul 2014 10:42:04 -0700 lana Merge
Tue, 01 Jul 2014 14:26:52 -0700 lana Merge
Fri, 20 Jun 2014 11:10:18 -0700 amurillo Merge
Thu, 19 Jun 2014 12:50:52 -0700 twisti Merge
Mon, 16 Jun 2014 16:27:41 -0700 mikael 8046769: Set T family feature bit on Niagara systems
Mon, 16 Jun 2014 15:12:24 +0400 iignatyev 8044742: testlibrary_tests/whitebox/vm_flags/BooleanTest.java NoClassDefFoundError: com/oracle/java/testlibrary/JDKToolFinder
Thu, 19 Jun 2014 09:44:12 -0700 jmasa Merge
Wed, 18 Jun 2014 12:39:57 -0700 jmasa Merge
Wed, 18 Jun 2014 13:02:33 +0000 jwilhelm Merge
Thu, 12 Jun 2014 20:15:51 +0200 jwilhelm 8046715: Add a way to verify an extended set of command line options
Wed, 18 Jun 2014 13:25:40 +0200 tschatzl 8043722: Swapped usage of idx_t and bm_word_t types in parMarkBitMap.cpp
Fri, 13 Jun 2014 17:07:39 -0400 jwilhelm 8046408: Build failure from multiple ptrace.h
Fri, 13 Jun 2014 19:05:56 -0700 amurillo Merge
Fri, 13 Jun 2014 13:46:06 +0200 pliden 8044796: G1: Enable G1CollectedHeap::stop()
Wed, 18 Jun 2014 14:21:28 -0700 dcubed 8047156: cleanup more non-indent white space issues prior to Contended Locking cleanup bucket
Wed, 18 Jun 2014 12:21:39 -0700 iveresov Merge
Wed, 18 Jun 2014 10:54:32 -0700 iveresov 8046684: sharedRuntime.cpp...assert(((nmethod*)cb)->is_at_poll_or_poll_return(pc)) failed: safepoint polling: type must be poll
Wed, 18 Jun 2014 13:58:13 -0400 coleenp 8039150: host_klass invariant fails when verifying newly loaded JSR-292 anonymous classes
Tue, 17 Jun 2014 11:18:10 -0700 ddehaven 8043340: [macosx] Fix hard-wired paths to JavaVM.framework
Tue, 17 Jun 2014 12:54:01 -0700 dcubed 8046758: cleanup non-indent white space issues prior to Contended Locking cleanup bucket
Fri, 13 Jun 2014 19:07:11 -0700 dcubed Merge
Fri, 13 Jun 2014 05:10:44 -0700 dsamersoff 8038392: Generating prelink cache breaks JAVA 'jinfo' utility normal behaviour
Thu, 12 Jun 2014 15:57:16 -0700 dcubed 8046287: [TESTBUG] runtime/Thread/TestThreadDumpMonitorContention.java failed error_cnt=12
Thu, 12 Jun 2014 13:37:53 -0400 lfoltan 6961433: Revisit need to disable Windows C++ compiler optimisation of sharedRuntimeTrig.cpp.
Thu, 12 Jun 2014 11:34:35 +0200 dsimms 8046662: Check JNI ReleaseStringChars / ReleaseStringUTFChars verify_guards test inverted
Wed, 11 Jun 2014 18:34:09 +0200 dsimms 8043224: -Xcheck:jni improvements to exception checking and excessive local refs
Wed, 11 Jun 2014 09:58:23 -0400 hseigel 8031819: Remove legacy jdk checks and code
Wed, 11 Jun 2014 12:09:12 +0200 dsimms 6311046: -Xcheck:jni should support checking of GetPrimitiveArrayCritical.
Tue, 10 Jun 2014 20:24:48 -0700 dcubed Merge
Tue, 10 Jun 2014 14:04:37 -0400 hseigel 8044738: Check attribute_length of EnclosingMethod attribute
Mon, 09 Jun 2014 11:03:09 +0200 sla 8044797: Building with clang gives: fatal error: file '...' has been modified since the precompiled header was built
Fri, 06 Jun 2014 14:46:42 +0200 ctornqvi 8043492: ad_x86_64_misc.obj : error LNK2011: precompiled object not linked in; image may not run
Wed, 04 Jun 2014 11:05:30 +0200 sla 8044107: Add Diagnostic Command to list all ClassLoaders
Mon, 02 Jun 2014 17:21:15 +0200 miauno 8044540: serviceability/sa/jmap-hashcode/Test8028623.java should be quarantined
Thu, 03 Jul 2014 11:36:49 -0700 katleman Added tag jdk9-b21 for changeset 783e13910e74
Wed, 09 Jul 2014 10:41:00 -0700 lana Merge
Tue, 01 Jul 2014 14:26:31 -0700 lana Merge
Tue, 01 Jul 2014 10:20:34 -0700 prr Merge
Fri, 20 Jun 2014 13:35:56 -0700 mchung 8044063: Remove com.sun.java.browser.* from jdk repo
Mon, 30 Jun 2014 18:04:13 -0700 joehw 8023276: Java SE should include the full DOM API from JAXP
Mon, 30 Jun 2014 14:27:37 -0700 darcy 8048302: Update bug reporting URL in make/Javadoc.gmk
Tue, 24 Jun 2014 20:29:52 -0700 mikael 8047740: Add hotspot testset to jprt.properties
Tue, 24 Jun 2014 15:21:47 -0700 mduigou 8047925: Add mercurial version checks to get_source.sh
Mon, 23 Jun 2014 14:08:45 -0700 mikael 8047763: Recognize sparc64 as a sparc platform
Wed, 18 Jun 2014 13:12:58 -0700 prr Merge
Mon, 09 Jun 2014 11:58:07 -0700 prr Merge
Tue, 27 May 2014 13:57:42 -0700 prr Merge
Fri, 23 May 2014 11:16:31 -0700 prr Merge
Fri, 23 May 2014 11:04:32 -0400 omajid 8043805: Allow using a system-installed libjpeg
Wed, 18 Jun 2014 12:52:13 -0700 ddehaven 8043340: [macosx] Fix hard-wired paths to JavaVM.framework
Thu, 03 Jul 2014 11:36:33 -0700 katleman Added tag jdk9-b21 for changeset 4b8db1aec2a3
Wed, 05 Jul 2017 19:47:11 +0200 duke Added tag jdk9-b21 for changeset 28dd0c7beb3c
Wed, 05 Jul 2017 19:47:10 +0200 duke Mergejdk9-b21
Wed, 05 Jul 2017 19:47:07 +0200 duke Merge
Thu, 26 Jun 2014 12:51:49 -0700 katleman Added tag jdk9-b20 for changeset d77065991eb8
Wed, 05 Jul 2017 19:47:04 +0200 duke Merge
Thu, 26 Jun 2014 12:51:36 -0700 katleman Added tag jdk9-b20 for changeset 02490297734b
Wed, 05 Jul 2017 19:47:01 +0200 duke Merge
Thu, 26 Jun 2014 12:51:35 -0700 katleman Added tag jdk9-b20 for changeset 6dbc3c71c0e2
Wed, 05 Jul 2017 19:46:58 +0200 duke Merge
Thu, 26 Jun 2014 12:51:50 -0700 katleman Added tag jdk9-b20 for changeset 7fb8003ec760
Wed, 05 Jul 2017 19:46:55 +0200 duke Merge
Thu, 26 Jun 2014 12:51:17 -0700 katleman Added tag jdk9-b20 for changeset c9ca62c6a329
Wed, 05 Jul 2017 19:46:52 +0200 duke Merge
Thu, 26 Jun 2014 12:51:38 -0700 katleman Added tag jdk9-b20 for changeset 8c82c02495e7
Wed, 05 Jul 2017 19:46:49 +0200 duke Merge
Thu, 26 Jun 2014 12:51:26 -0700 katleman Added tag jdk9-b20 for changeset e9f01656f118
Thu, 26 Jun 2014 12:51:14 -0700 katleman Added tag jdk9-b20 for changeset 3abb2de3cdb3
Wed, 05 Jul 2017 19:46:41 +0200 duke Added tag jdk9-b20 for changeset 89731ae72a76
Wed, 05 Jul 2017 19:46:40 +0200 duke Mergejdk9-b20
Wed, 05 Jul 2017 19:46:37 +0200 duke Merge
Fri, 20 Jun 2014 10:15:13 -0700 lana Merge
Wed, 18 Jun 2014 10:54:24 -0700 lana Merge
Wed, 18 Jun 2014 13:51:50 +0100 mcimadamore 8043253: Slow javac compile times in JDK 8
Wed, 18 Jun 2014 10:44:16 +0200 jlahoda 8046916: Type parameter annotations don't work with multiple type parameters
Tue, 17 Jun 2014 17:33:01 +0100 vromero 8036953: Fix timing of varargs access check, per JDK-8016205
Tue, 17 Jun 2014 11:11:59 -0400 pgovereau 8038975: Access control in enhanced for
Mon, 16 Jun 2014 11:30:31 -0700 jjg 8046369: sjavac should not use javac internal API for starting javac
Thu, 12 Jun 2014 14:29:09 +0200 alundblad 8042830: A recently added Xprefer test fails on Windows
Thu, 22 May 2014 12:16:53 -0700 ksrini 8042829: [javadoc] index-file output is not sorted correctly
Thu, 19 Jun 2014 11:22:49 -0700 katleman Added tag jdk9-b19 for changeset 26e23230009a
Wed, 05 Jul 2017 19:46:31 +0200 duke Merge
Thu, 19 Jun 2014 11:22:36 -0700 katleman Added tag jdk9-b19 for changeset 9ed534348756
Wed, 05 Jul 2017 19:46:27 +0200 duke Merge
Thu, 19 Jun 2014 11:22:33 -0700 katleman Added tag jdk9-b19 for changeset 12e7286572ef
Wed, 05 Jul 2017 19:46:23 +0200 duke Merge
Fri, 20 Jun 2014 10:14:50 -0700 lana Merge
Wed, 18 Jun 2014 10:54:57 -0700 lana Merge
Tue, 17 Jun 2014 18:23:35 +0530 sundar 8047057: Add a regression test for the passing test cases from JDK-8042304
Tue, 17 Jun 2014 15:55:39 +0530 sundar 8047035: (function() "hello")() crashes in Lexer with jdk9
Tue, 17 Jun 2014 11:37:03 +0200 lagergren 8046898: Make sure that lazy compilation is the default, remove redundant "enable lazy compilation" flags, added warning message if compile logging is enabled and lazy is switched off. Verified existing test suite code coverage equivalence between lazy and eager.
Thu, 19 Jun 2014 11:22:50 -0700 katleman Added tag jdk9-b19 for changeset a7c5ef3bb9d4
Wed, 05 Jul 2017 19:46:17 +0200 duke Merge
Thu, 19 Jun 2014 11:22:18 -0700 katleman Added tag jdk9-b19 for changeset 7056eab40723
Wed, 05 Jul 2017 19:46:13 +0200 duke Merge
Fri, 20 Jun 2014 10:15:30 -0700 lana Merge
Wed, 18 Jun 2014 10:55:17 -0700 lana Merge
Wed, 11 Jun 2014 08:25:33 +0100 scolebourne 8046416: Unable to parse an Instant from fields
Thu, 12 Jun 2014 00:31:27 +0100 scolebourne 8046707: Performance of java.time could be better
Wed, 18 Jun 2014 15:05:29 +0100 vinnie 8047085: PKCS11/NSS tests failing intermittently on Windows
Wed, 18 Jun 2014 17:34:05 +0400 yan 8046596: fix doclint issues in swing classes, part 3 of 4
Wed, 18 Jun 2014 17:31:01 +0400 yan 8046595: fix doclint issues in swing classes, part 2 of 4
Wed, 18 Jun 2014 03:29:58 -0700 dsamersoff 8044762: com/sun/jdi/OptionTest.java test time out
Wed, 18 Jun 2014 09:04:20 +0200 sla 8046778: Better error messages when starting JMX agent via attach or jcmd
Tue, 17 Jun 2014 10:47:07 +0100 chegar 8046902: Remove sun.misc.Timer
Mon, 09 Jun 2014 17:18:14 +0200 sla 8046355: sun/tools/jstatd/TestJstatdExternalRegistry.java should be quarantined
Mon, 09 Jun 2014 17:12:18 +0200 sla 8046352: com/sun/tools/attach/TempDirTest.java should be quarantined
Mon, 09 Jun 2014 17:04:11 +0200 sla 8046351: com/sun/management/GarbageCollectorMXBean/GarbageCollectionNotification[Content]Test.java should be quarantined
Fri, 13 Jun 2014 11:58:34 +0200 sla 8046348: com/sun/jdi/OptionTest.java should be quarantined
Tue, 17 Jun 2014 13:06:05 +0400 vlivanov 8046903: VM anonymous class members can't be statically invocable
Tue, 17 Jun 2014 10:01:16 +0200 sla 6622468: TEST_BUG: Time to retire the @debuggeeVMOptions mechanism used in the com.sun.jdi infrastructure
Mon, 16 Jun 2014 17:52:21 -0700 smarks 8044730: small errors in ConcurrentHashMap and LongAdder docs
Mon, 16 Jun 2014 13:48:58 -0400 mullan Merge
Mon, 16 Jun 2014 13:47:42 -0400 mullan 8046044: Fix raw and unchecked lint warnings in XML Signature Impl
Mon, 16 Jun 2014 17:45:26 +0100 psandoz 8041679: Replace uses of StringBuffer with StringBuilder within core library classes
Mon, 16 Jun 2014 08:09:30 -0700 henryjen 8046389: Add missing @since tag under javax.sql.**
Mon, 16 Jun 2014 07:25:11 -0700 dsamersoff 8041498: Remove npt library
Mon, 16 Jun 2014 13:40:49 +0100 vinnie 8036613: [parfait] JNI exception pending in jdk/src/windows/native/sun/security/provider/WinCAPISeedGenerator.c
Mon, 16 Jun 2014 13:52:25 +0200 sla 8043939: Remove management-agent.jar
Mon, 16 Jun 2014 11:03:54 +0200 ykantser 6545295: TEST BUG: The test HatHeapDump1Test uses wrong path in exec call.
Fri, 13 Jun 2014 14:32:49 +0100 michaelm Merge
Fri, 13 Jun 2014 14:30:41 +0100 michaelm 8046588: test for SO_FLOW_SLA availability does not check for EACCESS
Thu, 19 Jun 2014 11:22:38 -0700 katleman Added tag jdk9-b19 for changeset 40b2b32fa541
Wed, 05 Jul 2017 19:46:03 +0200 duke Merge
Fri, 20 Jun 2014 10:15:08 -0700 lana Merge
Wed, 18 Jun 2014 10:56:06 -0700 lana Merge
Fri, 13 Jun 2014 12:04:33 -0700 amurillo Merge
Fri, 13 Jun 2014 10:21:30 -0700 kvn Merge
Thu, 12 Jun 2014 16:31:07 -0700 mduigou 8032045: Enable compiler and linker safety switches for debug builds
Thu, 12 Jun 2014 10:15:43 -0700 kvn 8046516: Segmentation fault in JVM (easily reproducible)
Wed, 11 Jun 2014 11:05:10 -0700 kvn 8035968: Leverage CPU Instructions to Improve SHA Performance on SPARC
Wed, 11 Jun 2014 09:16:19 +0200 thartmann 8044538: assert(which != imm_operand) failed: instruction is not a movq reg, imm64
Tue, 10 Jun 2014 20:53:23 +0000 iignatyev Merge
Tue, 10 Jun 2014 23:18:25 +0400 iignatyev 8044575: testlibrary_tests/whitebox/vm_flags/UintxTest.java failed: assert(!res || TypeEntriesAtCall::arguments_profiling_enabled()) failed: no profiling of arguments
Tue, 10 Jun 2014 12:57:50 -0700 kvn Merge
Tue, 10 Jun 2014 12:28:06 -0700 kvn 8035605: Expand functionality of PredictedIntrinsicGenerator
Mon, 09 Jun 2014 10:32:49 +0200 neliasso 8040244: compiler/whitebox/IsMethodCompilableTest.java fails
Tue, 10 Jun 2014 13:37:16 +0200 roland 8026796: Make replace_in_map() on parent maps generic
Tue, 10 Jun 2014 10:00:59 +0000 vlivanov 8033626: assert(ex_map->jvms()->same_calls_as(_exceptions->jvms())) failed: all collected exceptions must come from the same place
Tue, 10 Jun 2014 08:53:22 +0200 thartmann 8033145: Runtime1::arraycopy_count_address uses wrong _oop_arraycopy_cnt variable
Wed, 11 Jun 2014 18:56:01 +0400 iignatyev 8044673: Create jtreg groups to list GC specific tests
Tue, 10 Jun 2014 20:46:28 -0700 jmasa Merge
Fri, 02 May 2014 02:11:34 +0200 jwilhelm 8042298: Remove the names gen0 and gen1 from the GC code
Wed, 30 Apr 2014 02:41:00 +0200 jwilhelm 8026396: Remove information duplication in the collector policy
Mon, 09 Jun 2014 15:42:31 -0700 kvn 8046275: Fastdebug build failing on jdk9/hs/ control jobs after pulling some hs-comp changes
Mon, 09 Jun 2014 11:49:02 +0000 vlivanov 8046226: assert(_thread == Thread::current()) failed: thread must be current w/ -XX:+TraceDeoptimization -XX:+Verbose
Fri, 06 Jun 2014 13:31:55 -0700 amurillo Merge
Fri, 06 Jun 2014 11:37:23 -0700 kvn Merge
Thu, 05 Jun 2014 10:43:16 +0200 thartmann 8031389: On x86 C1 emits two relocations for polls
Thu, 22 May 2014 13:42:44 +0200 rbackman 8030976: Untaken paths should be more vigorously pruned at highest optimization level
Wed, 04 Jun 2014 10:01:28 +0200 rbackman 8031994: java/lang/Character/CheckProp test times out
Tue, 03 Jun 2014 18:24:38 -0700 mikael 8044735: Print format/argument warnings
Wed, 04 Jun 2014 00:25:21 +0400 iignatyev 8044339: Update FilterSpuriousWakeups documentation. Review "Solaris only" vm options descriptions
Mon, 02 Jun 2014 15:48:34 -0700 mikael 8044242: Remove dead NativeMovRegMemPatching class
Mon, 02 Jun 2014 13:53:52 -0700 twisti Merge
Mon, 02 Jun 2014 10:48:02 -0700 twisti Merge
Mon, 02 Jun 2014 15:49:53 -0400 drchase Merge
Mon, 02 Jun 2014 14:32:29 -0400 drchase 8029381: assert(is_method_type()) failed: bad cast
Mon, 02 Jun 2014 07:26:52 -1000 iveresov 8044496: 8034812 broke build with clang
Mon, 02 Jun 2014 10:01:15 +0200 roland 8043413: REGRESSION: Hotspot causes segmentation fault in jdk8ux, but not in jdk7ux
Mon, 02 Jun 2014 08:07:29 +0200 thartmann 8034812: remove IDX_INIT macro hack in Node class
Fri, 30 May 2014 20:01:11 +0000 iignatyev Merge
Fri, 30 May 2014 17:20:48 +0400 iignatyev 8038756: new WB API :: get/setVMFlag
Fri, 30 May 2014 19:21:42 +0000 anoll Merge
Fri, 30 May 2014 09:26:48 +0200 thartmann 8021775: compiler/8009761/Test8009761.java "Failed: init recursive calls: 51. After deopt 50"
Fri, 30 May 2014 09:49:50 -0700 twisti Merge
Thu, 29 May 2014 16:01:13 -0700 mikael 8044071: Print format/argument warnings
Fri, 30 May 2014 06:50:38 +0200 anoll 8011646: SEGV in compiled code with loop predication
Thu, 19 Jun 2014 11:22:25 -0700 katleman Added tag jdk9-b19 for changeset 718694e51e25
Fri, 20 Jun 2014 10:14:33 -0700 lana Merge
Wed, 18 Jun 2014 10:54:13 -0700 lana Merge
Fri, 13 Jun 2014 12:35:18 -0700 amurillo Merge
Thu, 12 Jun 2014 16:33:32 -0700 mduigou 8032045: Enable compiler and linker safety switches for debug builds
Thu, 19 Jun 2014 11:22:16 -0700 katleman Added tag jdk9-b19 for changeset db769f12fe54
Wed, 05 Jul 2017 19:45:37 +0200 duke Added tag jdk9-b19 for changeset 2dcf544eb7ed
Wed, 05 Jul 2017 19:45:37 +0200 duke Mergejdk9-b19
Wed, 05 Jul 2017 19:45:33 +0200 duke Merge
Wed, 18 Jun 2014 10:09:04 -0700 lana Merge
Thu, 12 Jun 2014 15:37:29 -0700 lana Merge
Thu, 12 Jun 2014 11:32:23 -0400 emc 8043484: DPrinter does not compile
Wed, 11 Jun 2014 12:49:10 -0400 pgovereau 8027886: javac allows illegal receiver parameters
Tue, 10 Jun 2014 15:25:01 -0600 dlsmith 8015101: Covariance of return type implied by upper bounding on type parameter is ignored
Tue, 10 Jun 2014 12:41:39 -0600 dlsmith 8037385: constant pool errors with -target 1.7 and static default methods
Mon, 09 Jun 2014 15:46:44 -0400 emc 8046296: java/util/concurrent/BlockingQueue/PollMemoryLeak.java fails in nightly on all platform due to compiler issue
Mon, 09 Jun 2014 12:54:02 +0100 mcimadamore 8043725: javac fails with StackOverflowException
Mon, 09 Jun 2014 10:17:16 +0200 jlahoda 8033414: javac Plugin to receive notification (before and) after the compilation.
Sun, 08 Jun 2014 15:02:34 -0700 jjg 7026941: 199: path options ignored when reusing filemanager across tasks
Fri, 06 Jun 2014 16:08:46 -0400 aeremeev 8042451: Write tests for all possible kinds of type annotation
Fri, 06 Jun 2014 16:00:59 -0400 emc 8027262: Determine location for type annotations earlier in compiler pipeline
Fri, 13 Jun 2014 11:21:39 -0700 katleman Added tag jdk9-b18 for changeset d38c730b86c1
Wed, 05 Jul 2017 19:45:26 +0200 duke Merge
Fri, 13 Jun 2014 11:21:28 -0700 katleman Added tag jdk9-b18 for changeset ce20b74c4195
Wed, 05 Jul 2017 19:45:23 +0200 duke Merge
Wed, 18 Jun 2014 10:08:42 -0700 lana Merge
Thu, 12 Jun 2014 15:39:03 -0700 lana Merge
Wed, 11 Jun 2014 22:26:30 -0700 joehw 8041523: Xerces Update: Serializer improvements from Xalan
Wed, 11 Jun 2014 09:26:03 -0700 joehw 8046443: A few typos in JAXP JavaDoc
Fri, 13 Jun 2014 11:21:26 -0700 katleman Added tag jdk9-b18 for changeset 3a82fb0d8a15
Wed, 05 Jul 2017 19:45:17 +0200 duke Merge
Wed, 18 Jun 2014 10:08:47 -0700 lana Merge
Thu, 12 Jun 2014 15:37:37 -0700 lana Merge
Thu, 12 Jun 2014 17:39:09 +0530 sundar 8044517: Run & debug single Nashorn test
Wed, 11 Jun 2014 08:53:35 +0530 sundar 8044798: API for debugging Nashorn
Mon, 09 Jun 2014 16:00:06 +0200 attila 8046025: AccessorProperty.getGetter is not threadsafe
Fri, 06 Jun 2014 16:51:53 +0200 hannesw 8046215: Running uncompilable scripts throws NullPointerException
Fri, 13 Jun 2014 11:21:41 -0700 katleman Added tag jdk9-b18 for changeset 6ff236765d3b
Wed, 05 Jul 2017 19:45:12 +0200 duke Merge
Fri, 13 Jun 2014 11:21:15 -0700 katleman Added tag jdk9-b18 for changeset ab3f668fd6e3
Wed, 05 Jul 2017 19:45:08 +0200 duke Merge
Wed, 18 Jun 2014 10:09:22 -0700 lana Merge
Fri, 13 Jun 2014 08:25:50 +0800 weijun 8046702: default_options.sh test failure on Solaris
Thu, 12 Jun 2014 15:38:24 -0700 lana Merge
Thu, 12 Jun 2014 10:32:19 +0200 sjiang 8044865: Fix raw and unchecked lint warnings in management-related code
Wed, 11 Jun 2014 15:47:53 +0200 sla 8044135: Add API to start JMX agent from attach framework
Tue, 10 Jun 2014 11:15:23 +0100 prappo 8027308: HttpURLConnection should better handle URLs with literal IPv6 addresses
Wed, 11 Jun 2014 18:27:10 +0800 weijun 8023197: Pre-configured command line options for keytool and jarsigner
Tue, 10 Jun 2014 14:40:20 +0200 jfranck 8029674: (reflect) getMethods returns default methods that are not members of the class
Wed, 11 Jun 2014 16:33:23 +0800 weijun 8046499: nativecache.c prints to stdout in debug build
Tue, 10 Jun 2014 16:18:54 -0700 henryjen 8044740: Convert all JDK versions used in @since tag to 1.n[.n] in jdk repo
Tue, 10 Jun 2014 14:17:32 -0700 ascarpino 8046368: Code cleanup in SeedGenerator.java
Tue, 10 Jun 2014 12:04:42 -0700 ascarpino 8039212: SecretKeyBasic.sh needs to avoid NSS libnss3 and libsoftokn3 version mismatches
Tue, 10 Jun 2014 08:07:39 -0700 martin 8004807: java/util/Timer/Args.java failing intermittently in HS testing
Tue, 10 Jun 2014 15:49:53 +0100 vinnie 8040812: Uninitialised memory in jdk/src/share/native/sun/security/ec/impl/mpi.c
Mon, 09 Jun 2014 15:40:40 +0400 vlivanov 8032400: JSR292: invokeSpecial: InternalError attempting to lookup a method
Fri, 06 Jun 2014 14:23:08 -0700 mduigou 8046085: inserting null key into HashMap treebin fails.
Sat, 07 Jun 2014 00:17:02 +0800 luchsh 8043954: Add async connect() support to NET_Connect() for AIX platform
Fri, 06 Jun 2014 22:31:53 +0800 weijun 8044747: [TESTBUG] Test sun/security/tools/policytool/i18n.sh fails after clicking 'Done' button in test frame
Fri, 06 Jun 2014 10:47:30 +0100 chegar 8043613: Update .properties files for serialver tool
Fri, 13 Jun 2014 11:21:30 -0700 katleman Added tag jdk9-b18 for changeset fa91157087a5
Wed, 05 Jul 2017 19:45:00 +0200 duke Merge
Wed, 18 Jun 2014 10:08:52 -0700 lana Merge
Thu, 12 Jun 2014 19:03:25 -0700 lana Merge
Thu, 12 Jun 2014 15:36:49 -0700 lana Merge
Fri, 06 Jun 2014 10:19:50 -0700 amurillo Merge
Thu, 05 Jun 2014 10:34:57 -0700 jmasa Merge
Wed, 04 Jun 2014 14:16:20 +0200 pliden 8044768: Backout fix for JDK-8040807
Thu, 29 May 2014 14:31:28 +0200 ehelin 8042933: assert(capacity_until_gc >= committed_bytes) failed
Tue, 03 Jun 2014 09:34:04 +0000 brutisso Merge
Tue, 03 Jun 2014 10:44:36 +0200 brutisso 8043239: G1: Missing post barrier in processing of j.l.ref.Reference objects
Tue, 03 Jun 2014 10:37:46 +0200 pliden 8040807: G1: Enable G1CollectedHeap::stop()
Mon, 02 Jun 2014 06:29:34 -0700 jmasa Merge
Fri, 30 May 2014 10:43:51 +0200 pliden 8042310: TestStringDeduplicationMemoryUsage test failing
Fri, 30 May 2014 10:37:39 +0200 pliden 8044132: Quarantine unstable/broken GC tests
Mon, 02 Jun 2014 21:36:59 -0400 mseledtsov 8038587: [TESTBUG] Create CDS tests to exercise region sizes and base address
Tue, 03 Jun 2014 09:44:54 +0200 mgronlun 8044531: Event based tracing locks to rank as leafs where possible
Mon, 02 Jun 2014 18:15:18 +0000 ctornqvi Merge
Mon, 02 Jun 2014 19:08:18 +0200 ctornqvi 8044364: runtime/RedefineFinalizer test fails on windows
Mon, 02 Jun 2014 09:30:08 -0700 rdurbin 8038132: jprt bundles have libjsig.dylib in different place on OSX
Mon, 02 Jun 2014 11:20:14 +0200 ykantser 8043915: Tests get ClassNotFoundException: com.oracle.java.testlibrary.StreamPumper
Sun, 01 Jun 2014 11:56:15 -0400 coleenp Merge
Fri, 30 May 2014 19:13:07 +0200 sla 8044398: Attach code should propagate errors in Diagnostic Commands as errors
Fri, 30 May 2014 07:20:51 -0700 dcubed 8036823: Stack trace sometimes shows 'locked' instead of 'waiting to lock'
Thu, 29 May 2014 08:58:51 -0400 lfoltan 8041623: Solaris Studio 12.4 C++ 5.13, CHECK_UNHANDLED_OOPS use of class oop's copy constructor definitions causing error level diagnostic.
Wed, 28 May 2014 22:59:29 +0200 ctornqvi 8043786: [TESTBUG] runtime/CommandLine/TestHexArguments.java test fails in nightly
Wed, 28 May 2014 15:03:36 +0000 dsamersoff Merge
Wed, 28 May 2014 07:36:32 -0700 dsamersoff 6904403: assert(f == k->has_finalizer(),"inconsistent has_finalizer") with debug VM
Wed, 28 May 2014 06:26:05 -0700 poonam 8043086: Hotspot is expected to report OOM which is occurred String.intern(), but crashes in JDK8u5
Tue, 27 May 2014 21:58:23 -0700 minqi 8043896: Error reporting for insufficient shared region size is incorrect
Fri, 13 Jun 2014 11:21:19 -0700 katleman Added tag jdk9-b18 for changeset f41278d32da8
Fri, 13 Jun 2014 11:21:13 -0700 katleman Added tag jdk9-b18 for changeset 09ca10d317fc
Wed, 05 Jul 2017 19:44:42 +0200 duke Added tag jdk9-b18 for changeset c5495e25c725
Wed, 05 Jul 2017 19:44:42 +0200 duke Mergejdk9-b18
Wed, 05 Jul 2017 19:44:39 +0200 duke Merge
Thu, 12 Jun 2014 10:32:42 -0700 katleman Added tag jdk9-b17 for changeset abd9a49d0b9c
Wed, 05 Jul 2017 19:44:35 +0200 duke Merge
Thu, 12 Jun 2014 10:32:30 -0700 katleman Added tag jdk9-b17 for changeset f67a670502cb
Wed, 05 Jul 2017 19:44:33 +0200 duke Merge
Thu, 12 Jun 2014 10:32:27 -0700 katleman Added tag jdk9-b17 for changeset a190ad71abdc
Wed, 05 Jul 2017 19:44:29 +0200 duke Merge
Thu, 12 Jun 2014 10:32:44 -0700 katleman Added tag jdk9-b17 for changeset 681b70d49d8d
Wed, 05 Jul 2017 19:44:26 +0200 duke Merge
Thu, 12 Jun 2014 10:32:11 -0700 katleman Added tag jdk9-b17 for changeset 51596e763410
Wed, 05 Jul 2017 19:44:23 +0200 duke Merge
Thu, 12 Jun 2014 10:32:32 -0700 katleman Added tag jdk9-b17 for changeset e2e5f24869d5
Wed, 05 Jul 2017 19:44:20 +0200 duke Merge
Thu, 12 Jun 2014 18:42:33 +0000 tbell Merge
Thu, 12 Jun 2014 18:09:29 +0000 tbell 8046474: Source changes needed to build JDK 9 with new platforms and compilers on Solaris and Linux
Thu, 12 Jun 2014 10:32:21 -0700 katleman Added tag jdk9-b17 for changeset b14260e7f98f
Thu, 12 Jun 2014 18:42:29 +0000 tbell Merge
Thu, 12 Jun 2014 18:08:39 +0000 tbell 8046474: Source changes needed to build JDK 9 with new platforms and compilers on Solaris and Linux
Thu, 12 Jun 2014 10:32:09 -0700 katleman Added tag jdk9-b17 for changeset 4f048ac42b56
Wed, 05 Jul 2017 19:44:08 +0200 duke Added tag jdk9-b17 for changeset 410bccbded9e
Wed, 05 Jul 2017 19:44:08 +0200 duke Mergejdk9-b17
Wed, 05 Jul 2017 19:44:04 +0200 duke Merge
Thu, 05 Jun 2014 19:38:17 -0700 lana Merge
Thu, 05 Jun 2014 13:22:37 -0700 jjg 8046067: test/tools/javac/api/6410643/T6410643.java is broken
Thu, 05 Jun 2014 10:57:10 -0700 sogoel 8044072: Group 2: create .out files for OverrideChecks tests in tools/javac dir
Thu, 05 Jun 2014 10:44:38 -0700 sogoel 8044064: Group 1: create .out files for cast and capture negative tests in tools/javac dir
Thu, 05 Jun 2014 12:21:38 +0100 mcimadamore 8043893: Inference doesn't report error on incompatible upper bounds
Wed, 04 Jun 2014 20:01:13 +0100 vromero 8041713: Type inference of non-existent method references crashes the compiler
Mon, 02 Jun 2014 22:36:40 +0100 vromero 8044487: Fix for 8042785 causes regression tests to fail with java.lang.VerifyError
Fri, 30 May 2014 18:21:05 +0100 vromero 8042785: javac, bridge methods are not getting the flags from the original method
Wed, 04 Jun 2014 20:20:42 -0700 katleman Added tag jdk9-b16 for changeset f75464f610f6
Wed, 05 Jul 2017 19:43:59 +0200 duke Merge
Wed, 04 Jun 2014 20:20:26 -0700 katleman Added tag jdk9-b16 for changeset 1fe6db2229a0
Wed, 05 Jul 2017 19:43:55 +0200 duke Merge
Wed, 04 Jun 2014 20:20:16 -0700 katleman Added tag jdk9-b16 for changeset 799f78314361
Wed, 05 Jul 2017 19:43:51 +0200 duke Merge
Thu, 05 Jun 2014 19:38:45 -0700 lana Merge
Thu, 05 Jun 2014 12:16:09 +0200 attila 8044816: On-demand compiled top-level program doesn't need :createProgramFunction
Thu, 05 Jun 2014 12:15:45 +0200 attila 8046014: MultiGlobalCompiledScript should cache :createProgramFunction handle
Wed, 04 Jun 2014 20:43:37 +0200 attila 8038413: NPE in unboxInteger
Wed, 04 Jun 2014 16:52:50 +0200 attila 8044803: Unnecessary restOf check
Wed, 04 Jun 2014 19:01:24 +0530 sundar 8044695: __stack__ becomes visible in Error properties
Wed, 04 Jun 2014 14:32:23 +0200 attila 8044502: Get rid of global optimistic flag
Wed, 04 Jun 2014 13:08:57 +0200 attila 8044638: Tidy up Nashorn codebase for code standards
Wed, 04 Jun 2014 13:55:21 +0530 sundar 8044750: megamorphic getter for scope objects does not call __noSuchProperty__ hook
Tue, 03 Jun 2014 12:05:59 +0200 attila 8044518: Ensure exceptions related to optimistic recompilation are not serializable
Tue, 03 Jun 2014 12:05:42 +0200 attila 8044534: Constant folding for unary + should produce int for boolean literals
Tue, 03 Jun 2014 12:04:36 +0200 attila 8044533: Deoptimizing negation produces wrong result for zero
Tue, 03 Jun 2014 11:31:06 +0200 attila 8044171: Make optimistic exception handlers smaller
Tue, 03 Jun 2014 14:13:03 +0530 sundar 8044520: Nashorn cannot execute node.js's express module
Tue, 03 Jun 2014 13:57:52 +0530 sundar 8044612: StringIndexOutOfBoundException in NativeRegExp.appendReplacement
Mon, 02 Jun 2014 17:36:43 +0200 attila Merge
Wed, 28 May 2014 16:53:43 +0200 attila Merge
Wed, 28 May 2014 13:58:46 +0200 lagergren 8044102: Ensure bechmark exclude list for Octane benchmarks is in only one place, project.properties, and fix benchmark harness
Tue, 27 May 2014 21:25:07 +0200 lagergren 8044012: Integrate the latest best known performance flags int ant octane jobs, and make sure that it's easy to compare 'ant octane-nashorn' and 'ant octane-v8' at the push of a button. (or rather; the entry of a command line)
Wed, 21 May 2014 16:12:40 +0200 lagergren 8043632: Parallelize class installation and various script fixes.
Wed, 21 May 2014 16:12:40 +0200 lagergren 8043611: Move timing dependent benchmark for apply2call specialization to currently_failing. It is dependent that nothing takes machine time when doing the two runs, causing spurious assertions. Suggest running octane.raytrace manually instead to verify that this works, or incorporating it in the nightly test suite
Wed, 21 May 2014 16:12:40 +0200 lagergren 8043633: In order to remove global state outside of contexts, make sure Timing class is an instance and not a static global collection of data. Move into Context. Move -Dnashorn.timing to an official logging option.
Wed, 21 May 2014 15:38:11 +0200 attila 8043605: Enable history for empty property maps
Wed, 21 May 2014 12:52:58 +0200 attila 8043608: Make equality tests inline better
Tue, 20 May 2014 10:40:28 +0200 lagergren 8043504: Octane test harness was missing argument to print_always at one callsite, causing erroneous logging
Mon, 19 May 2014 18:24:12 +0200 attila 8043431: Fix yet another corner case of JDK-8041995
Mon, 19 May 2014 15:29:42 +0200 lagergren 8034206: Make parts of code pipeline reusable in order to facilitate faster warmup and faster lazy compilation.
Thu, 15 May 2014 15:28:51 +0200 attila 8043235: Type-based optimizations interfere with continuation methods
Wed, 14 May 2014 17:05:08 +0200 attila 8043133: Fix corner cases of JDK-8041995
Wed, 14 May 2014 15:50:04 +0200 mnunez 8044154: Nashorn : all tests failed with java.security.AccessControlException
Wed, 14 May 2014 16:29:14 +0200 attila 8043137: Collapse long sequences of NOP in Nashorn bytecode output
Wed, 14 May 2014 15:55:27 +0200 attila 8043004: Reduce variability at JavaAdapter call sites
Wed, 14 May 2014 10:51:39 +0200 attila 8043003: Use strongly referenced generic invokers
Tue, 13 May 2014 14:54:21 +0200 attila 8043002: Improve performance of Nashorn equality operators
Tue, 13 May 2014 11:30:40 +0200 attila 8042118: Separate types from symbols
Mon, 05 May 2014 14:17:20 +0200 mnunez 8037572: Add more test cases to check static types
Fri, 02 May 2014 18:22:29 +0200 lagergren 8041625: AccessorProperty currentType must only by Object.class when non-primitive, and scoping followup problem for lazily generated with bodies
Tue, 29 Apr 2014 16:00:53 +0200 mnunez 8038398: OptimisticRecompilationTest fails on staging repo nashorn/jdk9/nashorn due to test framework
Mon, 28 Apr 2014 16:37:36 +0200 lagergren 8041995: Problems when loading tree expressions with several optimistic program points when optimistically initializing ObjectNodes
Fri, 25 Apr 2014 14:26:07 +0200 lagergren 8041905: Fix apply2call bug that prevented avatar.js unit tests from running correctly
Wed, 23 Apr 2014 17:37:41 +0200 lagergren 8041434: Add synchronization to the common global constants structure
Wed, 23 Apr 2014 16:13:47 +0200 lagergren 8038426: Move all loggers from process wide scope into Global scope
Tue, 22 Apr 2014 14:09:46 +0200 lagergren 8033105: Make sure Nashorn test harness can run zlib benchmark
Fri, 18 Apr 2014 21:24:34 +0200 lagergren 8040655: When processing a RewriteException debug object, the return value has already been reset to null. We need to catch this value before that.
Fri, 18 Apr 2014 20:12:21 +0200 lagergren 8040102: Remove all references to Unsafe and definition of anonymous clases from the code
Thu, 17 Apr 2014 20:01:19 +0200 lagergren 8040089: Apply to call transform was incomplete. Now passes all tests and performance is back
Fri, 11 Apr 2014 16:52:56 +0200 lagergren Merge
Fri, 11 Apr 2014 16:52:14 +0200 lagergren 8039746: Transform applies to calls wherever possible, for ScriptFunctions and JSObjects.
Fri, 11 Apr 2014 16:40:06 +0200 attila 8040024: BranchOptimizer produces bad code for NaN FP comparison
Wed, 02 Apr 2014 10:52:39 +0200 lagergren 8039044: Expand undefined intrinsics for all commutative combinators of scrict undefined checks
Tue, 01 Apr 2014 16:12:38 +0200 lagergren 8038945: Simplify strict undefined checks
Tue, 01 Apr 2014 11:19:32 +0200 lagergren 8038799: Guard and unbox boxed primitives types on setting them in Properties to avoid megamorphisism
Mon, 31 Mar 2014 14:13:34 +0200 lagergren 8027043: Turn global accesses into MethodHandle.constant, with one chance of reassignment, e.g. x = value occuring once in the global scope is ok, twice is not.
Thu, 27 Mar 2014 14:09:40 +0100 attila 8038416: Access to undefined scoped variables deoptimized too much
Thu, 27 Mar 2014 11:45:54 +0100 lagergren 8038406: Testability: as a first step of moving loggers away from the process global space, the Debug object now supports logging POJOs from log entries as an event queue, which can be introspected from test scripts. This is way better than screen scraping brittle and subject-to-change log output.
Wed, 26 Mar 2014 15:00:32 +0100 attila 8038396: fix for the compiler expression evaluator to be more inquisitive about types
Mon, 24 Mar 2014 18:41:06 +0100 attila 8037534: Use scope types to determine optimistic types
Mon, 24 Mar 2014 18:40:11 +0100 attila 8038223: Symbol trace debug output takes time
Fri, 21 Mar 2014 17:52:03 +0100 attila Merge
Thu, 20 Mar 2014 16:26:54 +0100 lagergren 8037967: Broke the build, by commiting without saving the last review comment
Thu, 20 Mar 2014 16:16:42 +0100 lagergren 8033334: Make sure that scope depth information is maintained in the RecompilableScriptFunctionDatas, to avoid unnecessary slow proto linkage when doing on demand compilation
Mon, 17 Mar 2014 15:05:18 +0100 mnunez 8037086: Check that deoptimizing recompilations are correct
Fri, 14 Mar 2014 14:27:32 +0100 lagergren 8036986: Test should check that correctly type is returned running with optimistic. If optimistic assumption was wrong we should get the right one.
Wed, 12 Mar 2014 10:31:22 +0100 lagergren 8037177: -Dnashorn.optimistic should be enabled by default, meaning that it has to be explicitly set to false to run with the jdk 8 style conservative types
Wed, 05 Mar 2014 09:51:00 +0100 lagergren 8036127: Prototype filter needs to be applied to getter guard as well, not just getter
Mon, 03 Mar 2014 11:24:44 +0100 lagergren 8035836: Array performance improvements
Wed, 26 Feb 2014 13:17:57 +0100 attila 8035820: Optimistic recompilation
Wed, 04 Jun 2014 20:20:44 -0700 katleman Added tag jdk9-b16 for changeset e3b9d834796d
Wed, 05 Jul 2017 19:43:34 +0200 duke Merge
Wed, 04 Jun 2014 20:20:02 -0700 katleman Added tag jdk9-b16 for changeset 87bc69dea937
Wed, 05 Jul 2017 19:43:31 +0200 duke Merge
Thu, 05 Jun 2014 19:37:32 -0700 lana Merge
Thu, 05 Jun 2014 12:13:50 +0100 michaelm 8044766: New jdk.net classes have @since 1.9 tags in 8u20
Thu, 05 Jun 2014 15:27:51 +0800 weijun 8044755: Add a test for algorithm constraints check in jarsigner
Wed, 04 Jun 2014 14:00:19 -0700 sherman 8044727: Problem reading the contents of some zip files
Wed, 04 Jun 2014 11:25:13 -0700 sherman 8044725: Bug in zlib 1.2.5 prevents inflation of some gzipped files
Wed, 04 Jun 2014 14:42:48 +0200 jfranck 8039916: AnnotatedType.getType() of a Executable parameters may return wrong type
Wed, 04 Jun 2014 13:37:16 +0100 chegar 8044590: Broken links in jre.api.net.socketoptions
Wed, 04 Jun 2014 13:12:16 +0200 mtobiass 8036006: [TESTBUG] sun/tools/native2ascii/NativeErrors.java fails: Process exit code was 0, but error was expected.
Wed, 04 Jun 2014 16:26:11 +0400 aefimov 8032901: WaitForMultipleObjects() return value not handled appropriately
Mon, 02 Jun 2014 17:59:08 +0200 miauno 8044495: Remove test demo/jvmti/mtrace/TraceJFrame.java
Wed, 04 Jun 2014 09:48:02 +0000 xuelei 8044771: PKIXValidator indent cleanup
Tue, 03 Jun 2014 21:21:32 +0530 sundar 8044647: sun/tools/jrunscript/jrunscriptTest.sh start failing: Output of jrunscript -l nashorn differ from expected output
Tue, 03 Jun 2014 18:31:13 +0400 kizune 8044206: LambdaMetafactory.altMetafactory javadoc refers to wrong method
Tue, 03 Jun 2014 17:55:58 +0400 yan 8040081: Tidy warnings cleanup for java.applet
Tue, 03 Jun 2014 10:55:27 +0200 erikj 8044480: JDK image target overwrites lib/server/libjsig.dylib symlink with a copy of lib/libjsig.dylib
Tue, 03 Jun 2014 10:52:53 +0200 erikj 8043160: JDK 9 Build failure in accessbridge
Tue, 03 Jun 2014 07:35:35 -0400 mullan Merge
Tue, 03 Jun 2014 07:34:35 -0400 mullan 8036841: Reuse no-perms AccessControlContext object when performing isAuthorized check
Tue, 03 Jun 2014 14:58:47 +0400 thartmann 8005873: JRuby test_respond_to.rb asserts with: MT-unsafe modification of inline cache
Tue, 03 Jun 2014 12:52:59 +0400 yan 8032527: fix a couple doclint errors in java/awt/geom/Path2D
Mon, 02 Jun 2014 17:14:35 -0700 ascarpino 8037742: Re-enabling PKCS11 HMAC mechanisms in Solaris
Mon, 02 Jun 2014 17:08:40 -0700 ascarpino 8041142: Re-enabling CBC_PAD PKCS11 mechanisms for Solaris
Mon, 02 Jun 2014 19:49:57 +0400 igerasim 8037866: Replace the Fun class in tests with lambdas
Mon, 02 Jun 2014 09:19:59 +0100 alanb 8043753: Drop javax.transaction from compact2 and compact3
Sun, 01 Jun 2014 11:54:04 -0400 omajid 8044235: src.zip should include all sources
Fri, 30 May 2014 16:45:30 -0700 darcy 8039865: Add fallthrough lint warning to build of jdk repository
Fri, 30 May 2014 16:41:18 -0700 darcy 8044477: Fix fallthrough lint warning in ASM
Fri, 30 May 2014 13:37:35 -0700 ksrini 8044046: [asm] refresh internal ASM version to v5.0.3
Fri, 30 May 2014 09:25:18 -0700 mikael 8044363: Remove special build options for unpack200 executable
Fri, 30 May 2014 15:46:12 -0400 rriggs 8044461: Cleanup new Boolean and single character strings
Wed, 04 Jun 2014 20:20:28 -0700 katleman Added tag jdk9-b16 for changeset 68a979478ffb
Wed, 05 Jul 2017 19:43:24 +0200 duke Merge
Thu, 05 Jun 2014 19:39:08 -0700 lana Merge
Fri, 30 May 2014 13:46:02 -0700 amurillo Merge
Fri, 30 May 2014 10:07:19 -0700 twisti Merge
Fri, 30 May 2014 09:49:53 -0700 twisti Merge
Thu, 29 May 2014 09:41:07 +0000 vlivanov 8034935: JSR 292 support for PopFrame has a fragile coupling with DirectMethodHandle
Wed, 28 May 2014 07:59:23 -1000 iveresov 8044090: C1: Old value instead of new one is passed to post-barrier in UnsafeGetAndSetObject
Wed, 28 May 2014 14:42:00 +0400 iignatyev 8043899: compiler/5091921/Test7005594.java fails if specified -Xmx is less than 1600m
Tue, 27 May 2014 16:05:29 -0700 mikael 8043206: Fix signed vs. unsigned comparison warning in copy_sparc.hpp
Mon, 26 May 2014 19:05:01 +0400 iignatyev 8038924: Test bit-instructions fails with unexpected exit value on sparc
Mon, 26 May 2014 14:27:01 +0200 roland 8043638: Multiple compilation attempts break LogCompulation, lead to confusing PrintInlining output
Mon, 26 May 2014 10:48:58 +0200 roland 8042557: compiler/uncommontrap/TestSpecTrapClassUnloading.java fails with: GC triggered before VM initialization completed
Sat, 24 May 2014 00:04:21 +0400 iignatyev 8032970: Add stack size check methods to WhiteBox API
Fri, 23 May 2014 09:22:01 -0700 twisti Merge
Wed, 21 May 2014 11:25:25 +0200 neliasso 8031475: Missing oopmap in patching stubs
Thu, 29 May 2014 13:01:54 -0700 jmasa Merge
Mon, 26 May 2014 19:21:01 +0400 iignatyev 8040250: The test test/gc/parallelScavenge/TestDynShrinkHeap.java fails with OOME
Mon, 26 May 2014 09:31:43 +0200 tschatzl 8043723: max_heap_for_compressed_oops() declared with size_t, but defined with uintx
Tue, 27 May 2014 08:44:23 -0700 minqi 8038422: CDS test failed: assert((size % os::vm_allocation_granularity()) == 0) failed when limiting SharedMiscDataSize
Fri, 23 May 2014 21:34:49 +0000 coleenp Merge
Fri, 23 May 2014 16:54:01 -0400 coleenp 8043925: Fix typo in verifier.cpp
Fri, 23 May 2014 16:43:47 -0400 coleenp Merge
Thu, 22 May 2014 13:22:09 -0700 dsamersoff 8042155: [TESTBUG] Tests for stack guard pages have to be cleaned up
Thu, 22 May 2014 11:36:23 -0400 lfoltan 8043301: Duplicate definitions in vm/runtime/sharedRuntimeTrans.cpp versus math.h in VS2013
Thu, 22 May 2014 09:12:29 +0200 allwin 8027230: Overflow in java.lang.instrument.Instrumentation.getObjectSize() method
Wed, 21 May 2014 14:36:18 -0400 coleenp 8042727: nsk/jdb/unwatch/unwatch001 crash in InstanceKlass::methods_do(void (*)(Method*))
Wed, 04 Jun 2014 20:20:09 -0700 katleman Added tag jdk9-b16 for changeset f1f02d5f465a
Thu, 05 Jun 2014 19:37:09 -0700 lana Merge
Wed, 04 Jun 2014 10:03:17 -0700 mduigou 8044733: common/autoconf/configure script doesn't properly detect missing tools
Wed, 04 Jun 2014 20:20:00 -0700 katleman Added tag jdk9-b16 for changeset 46c176c94864
Wed, 05 Jul 2017 19:43:07 +0200 duke Added tag jdk9-b16 for changeset 4a09f5d30be8
Wed, 05 Jul 2017 19:43:07 +0200 duke Mergejdk9-b16
Wed, 05 Jul 2017 19:43:03 +0200 duke Merge
Fri, 30 May 2014 09:25:52 -0700 lana Merge
Fri, 30 May 2014 12:54:16 +0200 jlahoda 8031967: For some sources compiler compiles for ever