log

age author description
Wed, 12 Sep 2018 11:13:09 +0200 mbaesken 8207768: Improve exception messages during manifest parsing of jar archives
Wed, 26 Sep 2018 14:28:37 +0200 mbaesken 8211146: fix problematic elif-tests after recent gcc warning changes Werror=undefjdk-12+13
Fri, 21 Sep 2018 18:57:18 +0200 lkorinth 8196341: Add JFR events for parallel phases of G1
Tue, 25 Sep 2018 18:26:46 -0700 iignatyev 8211134: problem list compiler/whitebox/ForceNMethodSweepTest.java
Wed, 26 Sep 2018 06:26:54 +0800 fyang 8210413: AArch64: Optimize div/rem by constant in C1
Tue, 25 Sep 2018 13:57:24 -0700 naoto 8210633: Cannot parse JapaneseDate string with DateTimeFormatterBuilder Mapped-values
Tue, 25 Sep 2018 13:31:51 -0700 darcy 8211127: TestNewLanguageFeatures.java fails after JDK-8173730
Tue, 25 Sep 2018 11:31:55 -0700 darcy 8173730: Stop including enhanced for-loop tip for enum values() method
Tue, 25 Sep 2018 10:30:32 -0700 jjg 8210839: Improve interaction between source launcher and classpath
Tue, 25 Sep 2018 09:34:51 -0700 jcbeyler 8210689: Remove the multi-line old C style for string literals
Tue, 25 Sep 2018 11:31:55 -0400 dcubed 8211103: ProblemList runtime/XCheckJniJsig/XCheckJSig.java on MacOS X
Tue, 25 Sep 2018 16:41:25 +0200 rkennke 8211061: Tests fail with assert(VM_Version::supports_sse4_1()) on ThreadRipper CPU
Tue, 25 Sep 2018 15:35:31 +0100 chegar 8211099: ProblemList two networking tests until jtreg b14 is promoted
Mon, 24 Sep 2018 18:19:46 +0100 aph 8211064: [AArch64] Interpreter and c1 don't correctly handle jboolean results in native calls
Mon, 24 Sep 2018 18:44:39 +0200 rkennke 8132849: Increased stop time in cleanup phase because of single-threaded walk of thread stacks in NMethodSweeper::mark_active_nmethods()
Tue, 25 Sep 2018 14:23:37 +0200 plevart 8205461: Create Collector which merges results of two other collectors
Tue, 25 Sep 2018 14:16:33 +0200 thartmann 8210152: Optimize integer divisible by power-of-2 check
Tue, 25 Sep 2018 13:58:54 +0530 pmuthuswamy 8202462: {@index} may cause duplicate labels
Tue, 25 Sep 2018 12:36:45 +0530 pmuthuswamy 8205593: Javadoc -link makes broken links if module name matches package name
Mon, 24 Sep 2018 22:12:07 -0700 mikael 8210848: Obsolete SyncKnobs
Tue, 25 Sep 2018 11:24:59 +0800 fyuan 8210934: Move sun/net/www/protocol/http/GetErrorStream.java to OpenJDK
Tue, 25 Sep 2018 11:18:36 +0800 mli 8210443: Migrate Locale matching tests to JDK Repo.
Mon, 24 Sep 2018 16:37:28 -0700 kvn 8210764: Update avx512 implementation
Mon, 24 Sep 2018 13:51:22 -0700 erikj 8211037: Load jib jars dynamically from JibArtifactManager
Mon, 24 Sep 2018 20:45:06 +0200 ihse 8210705: Stop exporting all symbols on macosx
Mon, 24 Sep 2018 10:41:41 -0700 bchristi 8072130: java/lang/instrument/BootClassPath/BootClassPathTest.sh fails on Mac OSX
Mon, 24 Sep 2018 19:26:48 +0200 ihse 8211029: Have a common set of enabled warnings for all native libraries
Mon, 24 Sep 2018 13:05:59 -0400 dcubed 8209019: Remove tests affected by JDK-8208690 from the ProblemList
Mon, 24 Sep 2018 12:18:51 -0400 dholmes 8211045: [Testbug] Fix for 8144279 didn't define a test case!
Fri, 14 Sep 2018 14:43:40 +0200 rkennke 8210752: Remaining explicit barriers for C2
Fri, 21 Sep 2018 16:58:36 +0200 sgehwolf 8210761: libjsig is being compiled without optimization
Mon, 24 Sep 2018 16:54:42 +0300 avoitylov 8209697: ARM: Explicit barriers for C1/assembler
Mon, 24 Sep 2018 16:52:12 +0300 avoitylov 8209695: ARM: Explicit barriers for interpreter
Mon, 24 Sep 2018 16:44:24 +0300 avoitylov 8210466: Modularize allocations in assembler
Mon, 24 Sep 2018 16:39:02 +0300 avoitylov 8210465: ARM: Object equals abstraction for BarrierSetAssembler
Mon, 24 Sep 2018 00:13:02 -0700 jnimeh 8210918: Add test to exercise server-side client hello processing
Fri, 21 Sep 2018 08:13:55 -0400 gadams 8208471: nsk/jdb/unwatch/unwatch002/unwatch002.java fails with "Prompt is not received during 300200 milliseconds"
Sat, 22 Sep 2018 14:12:48 -0700 cjplummer 8210987: Extra newlines on Windows when running nsk jdb tests
Fri, 21 Sep 2018 15:38:43 -0700 jjg 8210275: Source Launcher should fail if --source is used without a source file
Fri, 21 Sep 2018 14:50:06 -0700 iignatyev 8210894: remove jdk/testlibrary/Asserts
Fri, 21 Sep 2018 21:35:12 +0200 ihse 8210988: Improved handling of compiler warnings in the build
Fri, 21 Sep 2018 12:08:13 -0700 tbell 8190985: .jcheck/conf files contain 'project=jdk10'
Fri, 21 Sep 2018 11:28:14 -0700 amenkov 8210760: [TEST] rewrite com/sun/jdi shell tests to java version - step4
Fri, 21 Sep 2018 10:18:12 -0700 amenkov 8210725: com/sun/jdi/RedefineClearBreakpoint.java fails with waitForPrompt timed out after 60 seconds
Fri, 21 Sep 2018 15:11:09 +0200 tschatzl 8210557: G1 next bitmap verification at the end of concurrent mark sometimes fails
Thu, 20 Sep 2018 13:59:39 +0200 mbaesken 8210961: [aix] enhance list of environment variables reported in error log file on AIX
Fri, 21 Sep 2018 12:29:46 +0200 jlahoda 8209058: Cannot find annotation method 'value()' in type 'Profile+Annotation'
Fri, 21 Sep 2018 12:29:31 +0200 jlahoda 8209865: Incorrect 'multiple elements' notes with Elements#getTypeElement and --release
Fri, 21 Sep 2018 16:13:49 +0800 xyin 8169246: java/net/DatagramSocket/ReportSocketClosed.java fails intermittently with BindException
Fri, 21 Sep 2018 15:49:59 +0800 xyin 8199931: java/net/MulticastSocket/UnreferencedMulticastSockets.java fails with "incorrect data received"
Thu, 20 Sep 2018 14:19:53 -0700 xuelei 8210974: No extensions debug log for ClientHello
Wed, 12 Sep 2018 16:38:13 +0200 roland 8210390: C2 still crashes with "assert(mode == ControlAroundStripMined && use == sfpt) failed: missed a node"
Thu, 20 Sep 2018 12:49:58 -0700 vromero 8209022: Missing checkcast when casting to type parameter bounded by intersection type
Thu, 20 Sep 2018 21:14:38 +0200 shade 8210963: Build failures after "8210829: Modularize allocations in C2"
Thu, 20 Sep 2018 21:05:00 +0200 ihse 8210931: JLI and launchers normalization and cleanup
Thu, 20 Sep 2018 20:54:19 +0200 ihse 8210962: Deprecate jdk-variant
Tue, 18 Sep 2018 21:47:14 -0700 iklam 8210875: Refactor CompactHashtable
Thu, 20 Sep 2018 18:39:53 +0200 ihse 8210960: Allow --with-boot-jdk-jvmargs to work during configure
Thu, 20 Sep 2018 18:38:34 +0200 ihse 8210941: Stop filtering out -xregs=no%appl for libsunec
Thu, 20 Sep 2018 18:37:25 +0200 ihse 8210944: Stop replacing -MD with -MT in libwindowsaccessbridge
Thu, 20 Sep 2018 18:33:19 +0200 ihse 8210949: Stop filtering out -xc99=%none for liblcms
Thu, 20 Sep 2018 14:04:44 +0200 pliden 8210883: ZGC: Parallel retire/resize/remap of TLABs
Thu, 20 Sep 2018 14:04:43 +0200 pliden 8210857: Allow retiring TLABs and collecting statistics in parallel
Thu, 20 Sep 2018 08:11:21 -0400 coleenp 8202201: All oop stores in the x64 interpreter are treated as volatile when using G1
Wed, 12 Sep 2018 14:08:15 +0200 phedlin 8210284: "assert((av & 0x00000001) == 0) failed: unsupported V8" on Solaris 11.4
Thu, 20 Sep 2018 08:59:03 +0200 ihse 8210920: Native C++ tests are not using CXXFLAGS
Wed, 19 Sep 2018 20:07:02 -0400 kbarrett 8210889: Some service thread cleanups can be starved
Wed, 19 Sep 2018 16:07:03 -0700 jnimeh 8210846: TLSv.1.3 interop problems with OpenSSL 1.1.1 when used on the client side with mutual auth
Thu, 20 Sep 2018 00:19:46 +0200 ihse 8210924: Remove PACKAGE_PATH
Thu, 20 Sep 2018 00:16:23 +0200 jwilhelm Added tag jdk-12+12 for changeset 15094d12a632
Wed, 19 Sep 2018 16:51:22 -0400 zgu 8210879: ClassLoaderStatsClosure does raw oop comparison
Wed, 19 Sep 2018 22:42:34 +0200 ihse 8210919: Remove statically linked libjli on Windows
Wed, 19 Sep 2018 15:25:05 -0400 coleenp 8198717: Remove compute_optional_offset
Wed, 19 Sep 2018 21:31:33 +0200 rkennke 8210829: Modularize allocations in C2
Wed, 19 Sep 2018 10:51:06 -0700 martin 8209817: stack is executable when building with Clang on Linux
Wed, 19 Sep 2018 19:12:20 +0200 pliden 8210884: ZGC: Remove insertion of filler objects
Wed, 19 Sep 2018 19:12:18 +0200 pliden 8210881: ZGC: Introduce ZRootsIteratorClosure
Sun, 23 Sep 2018 15:42:21 -0700 mikael Merge
Wed, 19 Sep 2018 09:24:40 -0700 mikael 8210912: Build error in src/jdk.crypto.cryptoki/share/native/libj2pkcs11/p11_convert.c after JDK-8029661jdk-12+12
Wed, 19 Sep 2018 14:09:11 +0200 pliden 8210713: Let CollectedHeap::ensure_parsability() take care of TLAB statistics gathering
Wed, 12 Sep 2018 13:09:51 +0200 mbalao 8029661: Support TLS v1.2 algorithm in SunPKCS11 provider
Wed, 19 Sep 2018 10:50:25 +0200 jlahoda 8207954: Data for --release 11
Wed, 19 Sep 2018 08:49:07 +0100 alanb 8210496: Improve filtering for classes with security sensitive fields
Wed, 19 Sep 2018 12:14:53 +0530 pmuthuswamy 8210047: some pages contain content outside of landmark region
Tue, 18 Sep 2018 21:46:17 -0700 iklam 8210864: Reduce the use of metaspaceShared.hpp
Tue, 18 Sep 2018 19:44:27 -0700 sherman 8210899: (zipfs) ZipFileSystem.EntryOutputStreamCRC32 mistakenly set the crc32 value into size field
Tue, 18 Sep 2018 22:46:35 +0200 pliden 8210753: Make ThreadLocalAllocBuffer::resize() public
Tue, 18 Sep 2018 16:11:36 -0400 coleenp 8210861: Move assert to help diagnose rare RedefineStress crash
Tue, 18 Sep 2018 22:32:25 +0200 dnsimon 8210793: [JVMCI] AllocateCompileIdTest.java failed to find DiagnosticCommand.class
Tue, 18 Sep 2018 13:31:30 -0700 joehw 8210874: Test for JDK-8209615
Tue, 18 Sep 2018 13:18:54 -0700 bpb 8210817: Minor typo in java.nio.file.attribute package summary
Tue, 18 Sep 2018 12:42:40 -0700 naoto 8209880: tzdb.dat is not reproducibly built
Tue, 18 Sep 2018 23:20:17 +0530 jgeorge 8210836: Build fails with warn_unused_result in openjdk/src/jdk.hotspot.agent/linux/native/libsaproc/ps_core.c
Tue, 18 Sep 2018 10:43:01 -0700 sherman 8034802: (zipfs) newFileSystem throws UOE when the zip file is located in a custom file system
Tue, 18 Sep 2018 09:44:20 -0700 joehw 8207760: SAXException: Invalid UTF-16 surrogate detected: d83c ?
Tue, 18 Sep 2018 11:55:33 -0400 jiangli 8210237: [TESTBUG]gc/stress/TestStressIHOPMultiThread.java fails with 'Unexpected exit from test [exit code: 1]' in CDS mode
Tue, 18 Sep 2018 08:27:01 -0400 coleenp 8203466: intermittent crash at jdk.internal.misc.Unsafe::getObjectVolatile (native)
Tue, 18 Sep 2018 13:32:40 +0200 ihse 8210729: Clean up macosx static library handling
Tue, 11 Sep 2018 18:18:51 +0200 sgehwolf 8210425: [x86] sharedRuntimeTrig/sharedRuntimeTrans compiled without optimization
Tue, 18 Sep 2018 10:35:42 +0200 ihse 8210750: Clean up compare.sh exceptions
Tue, 18 Sep 2018 10:29:56 +0200 ihse 8210723: Better information in configure for invalid Xcode
Mon, 17 Sep 2018 22:56:31 -0700 mchung 8210841: test/jdk/vm/runtime/ReflectStackOverflow.java fails with NoClassDefFoundError
Tue, 18 Sep 2018 13:24:25 +0800 mli 8210802: temp files left by tests in jdk/java/net/httpclient
Mon, 17 Sep 2018 23:35:00 -0400 mhorie 8210660: PPC64: Mapping floating point registers to vsx registers in ppc.ad
Tue, 18 Sep 2018 11:09:18 +0800 fyuan 8210819: Update the host name in CNameTest.java
Mon, 17 Sep 2018 19:48:35 -0700 jcbeyler 8210700: Clean up JNI_ENV_ARG and factorize the macros for vmTestbase/jvmti/unit tests
Mon, 17 Sep 2018 19:36:09 -0700 jcbeyler 8210481: Remove #ifdef cplusplus from vmTestbase
Mon, 17 Sep 2018 15:25:42 -0700 jnimeh 8140466: ChaCha20 and Poly1305 TLS Cipher Suites
Mon, 17 Sep 2018 15:22:46 -0700 mchung 8210721: Replace legacy serial exception field with Throwable::cause
Mon, 17 Sep 2018 14:04:46 -0700 ascarpino 8209031: SSLSocket should throw an exception when configuring DTLS
Mon, 17 Sep 2018 13:43:22 -0700 kvn 8209574: [AOT] breakpoint events are generated in different threads does not meet expected count
Mon, 17 Sep 2018 11:50:39 -0700 iignatyev 8210779: 8182404 and 8210732 haven't updated copyright years
Mon, 17 Sep 2018 10:14:31 -0700 iris 8210775: JVM TI Spec missing copyright
Mon, 17 Sep 2018 09:07:40 -0700 jcbeyler 8210726: Fix up a few minor nits forgotten by JDK-8210665
Mon, 17 Sep 2018 08:37:47 -0700 rfield 8210596: jshell does not support raw string literals
Mon, 17 Sep 2018 10:53:56 +0200 sgehwolf 8210416: [linux] Poor StrictMath performance due to non-optimized compilation
Mon, 17 Sep 2018 11:49:20 +0200 jlahoda 8193561: Cyclic hierarchy causes a NullPointerException when setting DEFAULT flag
Mon, 17 Sep 2018 14:16:31 +0530 rgoel 8210490: TimeZone.getDisplayName given Locale.US doesn't always honor the Locale.
Fri, 14 Sep 2018 14:47:50 +0200 sgehwolf 8210647: libsaproc is being compiled without optimization.
Mon, 17 Sep 2018 14:52:44 +0800 weijun 8210736: jdk/javax/xml/crypto/dsig/GenerationTests.java slow on linux
Mon, 17 Sep 2018 13:49:55 +0800 xyin 8210695: Create test to cover JDK-8205330 InitialDirContext ctor sometimes throws NPE if the server has sent a disconnection
Sat, 15 Sep 2018 22:02:08 -0700 igerasim 8210786: Typo s/overriden/overridden/ in several places
Sat, 15 Sep 2018 13:53:43 -0700 igerasim 8210787: Object.wait(long, int) throws inappropriate IllegalArgumentException
Sat, 15 Sep 2018 22:16:16 +0200 bsrbnd 8183548: Comma-expressions shouldn't use any temporary variable
Fri, 14 Sep 2018 22:35:44 -0700 mikael 8210676: Remove some unused Label variables
Fri, 14 Sep 2018 20:30:28 -0700 xuelei 8210785: Trivial typo fix in X509ExtendedKeyManager javadoc
Fri, 14 Sep 2018 14:02:57 -0700 iignatyev 8210732: remove jdk.testlibrary.Utils
Fri, 14 Sep 2018 15:32:22 -0400 gromero 8209972: [GRAAL] Don't run RTM tests with Graal
Fri, 14 Sep 2018 08:48:36 -0700 jcbeyler 8210724: Change the verbosity threshold of logging for [oopstorage,ref]
Thu, 13 Sep 2018 07:46:41 -0400 gadams 8208468: [TESTBUG] nsk/jdb/locals/locals002: fails with "Prompt is not received during ... milliseconds"
Fri, 14 Sep 2018 11:17:25 -0700 ccheung 8190737: use unicode version of the canonicalize() function to handle long path on windows
Tue, 11 Sep 2018 22:16:47 -0700 akolarkunnu 8210056: Enable different look and feel tests in SwingSet3 demo test TextFieldDemoTest
Fri, 14 Sep 2018 12:53:07 -0400 rriggs 8098798: Thread.join(ms) on Linux still affected by changes to the time-of-day clock
Fri, 14 Sep 2018 12:10:28 -0400 coleenp 8210559: ClassLoaderData Symbols can leak
Fri, 14 Sep 2018 09:00:22 -0700 bpb 8210741: Typo in Java API documentation of java.nio.file.Paths
Fri, 14 Sep 2018 16:56:09 +0100 alanb 8208780: (se) test SelectWithConsumer.testReadableAndWriteable(): failure
Fri, 14 Sep 2018 14:44:11 +0200 pliden 8210714: ZGC: ZWeakRootsIterator should no longer call reset/finish_dead_counter()
Fri, 14 Sep 2018 14:44:11 +0200 pliden 8210711: Remove unused offset getters in ThreadLocalAllocBuffer
Fri, 14 Sep 2018 14:44:11 +0200 pliden 8210710: Rename ThreadLocalAllocBuffer::myThread() to thread()
Fri, 14 Sep 2018 14:44:11 +0200 pliden 8209163: SA: Show Object Histogram asserts with ZGC
Fri, 14 Sep 2018 14:45:31 +0200 hannesw 8209914: javadoc search sometimes generates bad URIs
Fri, 14 Sep 2018 14:24:00 +0300 dpochepk 8210461: AArch64: Math.cos intrinsic gives incorrect results
Thu, 13 Sep 2018 11:07:40 +0200 sgehwolf 8210703: vmStructs.cpp compiled with -O0
Fri, 14 Sep 2018 09:16:51 +0200 ihse 8210731: PropertiesParser does not produce reproducible output
Thu, 13 Sep 2018 22:45:12 -0700 iveresov 8210478: Update Graal
Fri, 14 Sep 2018 13:18:52 +0800 amlu 8209772: Refactor shell test java/util/ServiceLoader/basic/basic.sh to java
Thu, 13 Sep 2018 15:29:44 -0700 cushon 8193037: package-info annotations are not reported when annotation processing is enabled
Thu, 13 Sep 2018 17:11:04 -0700 xuelei 8209916: NPE in SupportedGroupsExtension
Thu, 13 Sep 2018 07:54:38 -0400 gadams 8210252: com/sun/jdi/DebuggerThreadTest.java fails with NPE
Thu, 13 Sep 2018 15:27:21 -0700 kvn 8210220: [AOT] jdwp test cases are failing with error # ERROR: TEST FAILED: Cought IOException while receiving event packet
Thu, 13 Sep 2018 13:41:17 -0700 naoto 8209167: Use CLDR's time zone mappings for Windows
Thu, 13 Sep 2018 13:03:50 -0700 jcbeyler 8210665: Clean up JNI_ENV_ARG and factorize the macros for vmTestbase/jvmti[R-U] tests
Thu, 13 Sep 2018 21:14:04 +0200 ihse 8207264: solaris-sparcv9-cmp-baseline fails
Thu, 13 Sep 2018 21:12:22 +0200 ihse 8210702: Remove dtrace mapfiles
Thu, 13 Sep 2018 13:30:07 -0400 jiangli 8210193: [TESTBUG]gc/g1/mixedgc/TestOldGenCollectionUsage.java fails intermittently with OutOfMemoryError in CDS mode.
Thu, 13 Sep 2018 14:15:27 -0300 jlaskey 8210674: Need to add examples for use of javac properties introduced by Raw String Literals
Thu, 13 Sep 2018 12:07:01 +0100 michaelm 8210311: IllegalArgumentException in CookieManager - Comparison method violates its general contract
Thu, 13 Sep 2018 12:41:42 +0200 ihse 8210704: Remove dead build tools
Wed, 12 Sep 2018 21:56:59 -0700 iignatyev 8210699: Problem list tests which times out in Xcomp mode
Mon, 10 Sep 2018 16:59:41 -0700 cushon 8210483: AssertionError in DeferredAttr at setOverloadKind caused by JDK-8203679
Wed, 12 Sep 2018 17:45:22 -0700 iklam 8210523: runtime/appcds/cacheObject/DifferentHeapSizes.java crash
Wed, 12 Sep 2018 16:28:06 -0700 vromero 8207160: ClassReader::adjustMethodParams can potentially return null if the args list is empty
Thu, 13 Sep 2018 01:41:24 +0200 jwilhelm Added tag jdk-12+11 for changeset f0f5d23449d3
Wed, 12 Sep 2018 17:14:08 -0300 jlaskey 8210671: CheckExamples.java fail after Raw String Literals checkin
Wed, 12 Sep 2018 12:29:40 -0700 amenkov 8210560: [TEST] convert com/sun/jdi redefineClass-related tests
Wed, 12 Sep 2018 10:27:03 -0700 jcbeyler 8210593: Clean up JNI_ENV_ARG and factorize the macros for vmTestbase/jvmti[N-R] tests
Wed, 12 Sep 2018 14:19:36 -0300 jlaskey 8200434: String::align, String::indent
Wed, 12 Sep 2018 14:19:36 -0300 jlaskey 8206981: Compiler support for Raw String Literals
Wed, 12 Sep 2018 08:46:25 -0700 erikj 8210519: build/releaseFile/CheckSource.java failed additional sources foundjdk-12+11
Wed, 12 Sep 2018 14:24:17 +0200 mhorie 8208171: PPC64: Enrich SLP support
Wed, 12 Sep 2018 12:54:16 +0200 mdoerr 8210497: [PPC64] Vector registers not saved across safepoint
Wed, 12 Sep 2018 12:23:58 +0200 ihse 8059019: sdp.conf.template should be copied on linux too
Wed, 12 Sep 2018 11:08:42 +0200 tschatzl 8209843: Optimize oop scan closure closures wrt to reference processing in G1
Wed, 12 Sep 2018 09:12:42 +0100 adinn 8210578: AArch64: Invalid encoding for fmlsvs instruction
Wed, 12 Sep 2018 09:23:36 +0200 thartmann 8210387: C2 compilation fails with "assert(node->_last_del == _last) failed: must have deleted the edge just produced"
Fri, 31 Aug 2018 16:28:52 +0200 rkennke 8210187: Explicit barriers for C2
Tue, 11 Sep 2018 20:37:47 -0700 mikael 8210513: Obsolete SyncFlags
Tue, 11 Sep 2018 14:51:45 -0700 igerasim 8210347: Combine subsequent calls to Set.contains() and Set.add()
Tue, 11 Sep 2018 13:54:34 -0700 mikael 8210514: Obsolete SyncVerbose
Wed, 05 Sep 2018 18:14:45 -0700 iklam 8210289: ArchivedKlassSubGraphInfoRecord is incomplete
Tue, 11 Sep 2018 13:34:13 -0400 pchilanomate 8210300: runtime/MemberName/MemberNameLeak.java fails with RuntimeException
Tue, 11 Sep 2018 10:12:50 -0700 jcbeyler 8210385: Clean up JNI_ENV_ARG and factorize the macros for vmTestbase/jvmti[A-N] tests
Tue, 11 Sep 2018 09:42:27 -0400 coleenp 8210422: runtime/modules/ModuleStress/ExportModuleStressTest.java - assertion failed: address not aligned: 0x00000008baadbabe
Tue, 11 Sep 2018 09:53:41 -0400 hseigel 8210470: Remove unused Verifier::verify() Verifier::Mode argument
Tue, 11 Sep 2018 17:48:24 +0530 vtewari 8205330: InitialDirContext ctor sometimes throws NPE if the server has sent a disconnection
Tue, 11 Sep 2018 09:14:36 +0200 tschatzl 8210467: Remove unused G1CollectedHeap::_max_heap_capacity
Tue, 11 Sep 2018 09:13:37 +0200 tschatzl 8210463: Recalculate_used() always sets time taken in G1GCPhaseTimes
Tue, 11 Sep 2018 09:27:47 +0800 xyin 8209773: Refactor shell test javax/naming/module/basic.sh to java
Tue, 11 Sep 2018 08:48:26 +0800 weijun 8205507: jdk/javax/xml/crypto/dsig/GenerationTests.java timed out
Mon, 10 Sep 2018 16:33:05 -0700 dlong 8210434: [Graal] 8209301 prevents GitHub Graal from compiling with latest JDK
Mon, 10 Sep 2018 19:18:04 -0400 kbarrett 8210511: TestSingleWriterSynchronizer can deadlock
Mon, 10 Sep 2018 18:57:44 -0400 dholmes 8210512: [Testbug] vmTestbase/nsk/jdi/ObjectReference/referringObjects/referringObjects002/referringObjects002.java fails with unexpected size of ClassLoaderReference.referringObjects
Mon, 10 Sep 2018 18:30:24 -0400 jiangli 8210515: [TESTBUG]CheckArchivedModuleApp.java needs to check if EnableJVMCI is set.
Mon, 10 Sep 2018 14:23:37 -0700 iignatyev 8182404: remove jdk.testlibrary.JDKToolFinder and JDKToolLauncher
Mon, 10 Sep 2018 16:33:55 -0400 coleenp 8208697: vmTestbase/metaspace/stressHierarchy/stressHierarchy012/TestDescription.java fails with OutOfMemoryError: Metaspace
Mon, 10 Sep 2018 12:48:57 -0700 mchung 8210502: jdeps does not handle properly on analyzing a mixture of MR JARs and non-MR JARs
Mon, 10 Sep 2018 16:40:59 +0200 lucy 8210319: [s390]: Use of shift operators not covered by cpp standard
Mon, 10 Sep 2018 20:17:26 +0800 amlu 8209930: Refactor java/util/zip/ZipFile/deletetempjar.sh to plain java test
Mon, 10 Sep 2018 13:07:42 +0200 eosterlund 8210321: Create NO_KEEPALIVE CLD holder accessor
Mon, 10 Sep 2018 13:07:42 +0200 eosterlund 8210233: Prepare Klass::is_loader_alive() for concurrent class unloading
Mon, 10 Sep 2018 11:24:26 +0200 eosterlund 8210236: Prepare ciReceiverTypeData::translate_receiver_data_from for concurrent class unloading
Mon, 10 Sep 2018 10:02:48 +0200 ihse 8056217: Remove awt_makecube.cpp
Mon, 10 Sep 2018 09:59:27 +0200 ihse 8081858: make dist-clean does not delete all log files
Mon, 10 Sep 2018 09:58:23 +0200 ihse 8200609: Proper fix for mapfile removal for libjsig
Fri, 07 Sep 2018 14:54:15 -0700 erikj 8210283: Support git as an SCM alternative in the build
Fri, 07 Sep 2018 14:01:52 -0700 iignatyev 8210112: remove jdk.testlibrary.ProcessTools
Fri, 07 Sep 2018 15:18:14 -0400 jiangli 8209971: TestOptionsWithRanges.java crashes in CDS mode with G1UpdateBufferSize=1.
Fri, 07 Sep 2018 14:44:52 -0400 kbarrett 8210131: vmTestbase/nsk/jvmti/scenarios/allocation/AP10/ap10t001/TestDescription.java failed with ObjectFree: GetCurrentThreadCpuTimerInfo returned unexpected error code
Fri, 07 Sep 2018 09:50:02 -0700 jcbeyler 8210429: Clean up JNI_ENV_ARG for vmTestbase/jvmti/Get[G-Z] tests
Fri, 07 Sep 2018 10:17:49 -0700 sherman 8210345: The Japanese message of FileNotFoundException garbled
Fri, 07 Sep 2018 15:56:21 +0100 mcimadamore 8210495: compiler crashes because of illegal signature in otherwise legal code
Fri, 07 Sep 2018 11:24:59 +0200 aleonard 8209786: JDK12 fails to build on s390x with gcc 7.3
Fri, 07 Sep 2018 08:14:47 -0400 dholmes 8210486: Unused code in check_nest_attributes function
Fri, 07 Sep 2018 08:02:51 -0400 mullan 6899533: SecureClassLoader and URLClassLoader have unnecessary check for createClassLoader permission
Thu, 06 Sep 2018 16:27:07 +0200 roland 8209544: AES encrypt performance regression in jdk11b11
Thu, 06 Sep 2018 17:45:15 -0700 dlong 8209361: [AOT] Unexpected number of references for JVMTI_HEAP_REFERENCE_CONSTANT_POOL [111-->111]: 0 (expected at least 1)
Fri, 07 Sep 2018 09:09:31 +0800 xyin 8042902: Test java/net/Inet6Address/serialize/Inet6AddressSerializationTest.java fails intermittently
Thu, 06 Sep 2018 18:06:24 -0700 mikael 8210381: Obsolete EmitSync
Thu, 06 Sep 2018 16:15:32 -0700 jjg 8210009: Source Launcher classloader should support getResource and getResourceAsStream
Thu, 06 Sep 2018 12:10:59 -0700 igerasim 8210285: CharsetDecoder/Encoder's constructor does not reject NaN
Thu, 06 Sep 2018 10:49:17 -0700 naoto 8210142: java.util.Calendar.clone() doesn't respect sharedZone flag
Thu, 06 Sep 2018 09:30:47 -0700 ccheung 8185145: AppCDS custom loader support on Mac OS X
Thu, 06 Sep 2018 05:44:47 -0700 vromero 8210435: don't add local variable spots if they are DCE'ed by the compiler
Thu, 06 Sep 2018 13:13:35 +0100 mcimadamore 8210318: idea.sh script doesn't work on Mac
Thu, 06 Sep 2018 02:01:20 -0400 dholmes 8199874: [TESTBUG] runtime/Thread/ThreadPriorities.java fails with "expected 0 to equal 10"
Wed, 05 Sep 2018 21:06:01 -0700 rhalade 8210432: Add additional TeliaSonera root certificate
Wed, 05 Sep 2018 21:01:39 -0700 xuelei 8210334: TLS 1.3 server fails if ClientHello doesn't have pre_shared_key and psk_key_exchange_modes
Wed, 05 Sep 2018 19:40:52 -0700 jcbeyler 8210198: Clean up JNI_ENV_ARG for vmTestbase/jvmti/Get[A-F] tests
Thu, 06 Sep 2018 02:50:04 +0200 jwilhelm Added tag jdk-12+10 for changeset 8f594f75e054
Wed, 05 Sep 2018 11:12:15 -0700 jcbeyler 8208352: Merge HeapMonitorTest and HeapMonitorGCTest code
Fri, 10 Aug 2018 13:36:10 -0700 iignatyev 8209386: [error-prone] StreamResourceLeak in jdk.internal.ed module
Wed, 05 Sep 2018 13:10:40 -0700 dlong 8187078: -XX:+VerifyOops finds numerous problems when running JPRTjdk-12+10
Wed, 05 Sep 2018 10:39:16 -0700 amenkov 8210243: [TEST] rewrite com/sun/jdi shell tests to java version - step3
Wed, 05 Sep 2018 10:17:11 -0700 jcbeyler 8208186: SetHeapSamplingInterval handles 1 explicitly
Wed, 05 Sep 2018 09:12:50 -0700 sherman 8210394: (zipfs) jdk/nio/zipfs/ZFSTests.java rootdir.zip: The process cannot access the file because it is being used by another process
Wed, 05 Sep 2018 12:48:51 +0200 mbaesken 8209942: [epsilon] range function for EpsilonTLABElasticity causes compiler warning
Wed, 05 Sep 2018 14:00:36 +0200 ihse 8182733: aarch64 build documentation misleading
Wed, 05 Sep 2018 10:11:42 +0200 eosterlund 8210158: Accessorize JFR getEventWriter() intrinsics
Wed, 05 Sep 2018 11:52:08 +0100 alanb 8209152: (so) ServerSocketChannel::supportedOptions includes IP_TOS
Wed, 05 Sep 2018 11:15:28 +0200 glaubitz 8165440: Add Zero support for x86_64-linux-gnux32 target
Wed, 05 Sep 2018 11:52:15 +0530 pmuthuswamy 8209052: Low contrast in docs/api/constant-values.html
Wed, 05 Sep 2018 12:34:08 +0800 amlu 8209832: Refactor jdk/internal/reflect/Reflection/GetCallerClassTest.sh to plain java test
Tue, 04 Sep 2018 17:04:10 -0700 sherman 8197398: (zipfs) Files.walkFileTree walk indefinitelly while processing JAR file with "/" as a directory inside.
Tue, 04 Sep 2018 14:35:59 -0700 iignatyev 8210039: move OSInfo to top level testlibrary
Tue, 04 Sep 2018 15:00:08 -0700 ccheung 8209736: runtime/RedefineTests/ModifyAnonymous.java fails with NullPointerException when running in CDS mode
Tue, 04 Sep 2018 14:17:45 -0700 jcbeyler 8210192: Hsperf counter ParNew::CMS should be ParNew:CMS
Fri, 31 Aug 2018 22:55:34 -0700 jcbeyler 8210182: Remove macros for C compilation from vmTestBase but non jvmti
Tue, 04 Sep 2018 12:44:02 -0700 kvn 8209594: guarantee(this->is8bit(imm8)) failed: Short forward jump exceeds 8-bit offset
Tue, 04 Sep 2018 18:32:28 +0100 dfuchs 8210366: Typo in MethodHandles.Lookup: must be either be
Tue, 04 Sep 2018 18:03:44 +0100 alanb 8210087: Classes in jdk.unsupported not accessible from jconsole plugin
Tue, 04 Sep 2018 09:07:06 -0700 bpb 8210279: (bf) Remove unused package private method java.nio.Buffer.truncate()
Tue, 04 Sep 2018 11:46:23 -0400 gromero 8210320: PPC64: Fix uninitialized variable in C1 LIR assembler code
Tue, 04 Sep 2018 13:19:38 +0200 shade 8210357: Zero builds fail after JDK-8207343 (Automate vtable/itable stub size calculation)
Tue, 04 Sep 2018 13:19:37 +0200 shade 8210355: Minimal and Zero non-PCH builds fail after JDK-8207343 (Automate vtable/itable stub size calculation)
Tue, 04 Sep 2018 11:35:35 +0100 alanb 8210341: (fs) Typos in PosixFileAttributeView javadoc
Tue, 04 Sep 2018 12:18:35 +0200 tschatzl 8207200: Committed > max memory usage when getting MemoryUsage
Tue, 04 Sep 2018 12:17:23 +0200 tschatzl 8210265: Crash in HSpaceCounters::update_used()
Tue, 04 Sep 2018 14:47:55 +0800 weijun 8210338: Better output for GenerationTests.java
Tue, 04 Sep 2018 08:06:31 +0200 stuefe 8210307: 8210246 broke NMT jtreg tests
Mon, 03 Sep 2018 14:27:03 +0200 stuefe 8210314: [aix] NMT does not show "Safepoint" memory type
Mon, 03 Sep 2018 13:42:58 +0300 bulasevich 8209408: Primitive heap access for interpreter BarrierSetAssembler/arm32
Mon, 03 Sep 2018 13:39:35 +0300 avoitylov 8207247: AARCH64: Enable Minimal and Client VM builds
Mon, 03 Sep 2018 09:43:08 +0200 lucy 8207343: Automate vtable/itable stub size calculation
Sat, 01 Sep 2018 12:02:07 -0700 iklam 8210246: NMTUtil::_memory_type_names should be in sync with MemoryType
Sat, 01 Sep 2018 18:15:27 +0200 goetz 8210259: [testbug] IncompatibleOptions.java fails if VM configured without ZGC
Fri, 31 Aug 2018 14:54:42 -0700 jjg 8208608: Update --module-source-path to allow explicit source paths for specific modules
Fri, 31 Aug 2018 16:29:49 -0400 kbarrett 8210235: JvmtiTrace::safe_get_current_thread_name is unsafe in debug builds
Fri, 31 Aug 2018 11:56:43 -0700 dtitov 8209585: [Graal] vmTestbase/nsk/jvmti/scenarios/sampling tests fail with "Too small stack of resumed thread"
Fri, 31 Aug 2018 18:01:47 +0100 mcimadamore 8210226: Add support for multiple project folders to idea.sh
Fri, 31 Aug 2018 09:53:37 -0700 amenkov 8067354: com/sun/jdi/GetLocalVariables4Test.sh failed
Fri, 31 Aug 2018 10:22:04 -0400 pchilanomate 8206424: Use locking for cleaning ProtectionDomainTable
Fri, 31 Aug 2018 09:10:27 -0400 coleenp 8207793: [TESTBUG] runtime/Metaspace/FragmentMetaspace.java fails: heap needs to be increased
Fri, 31 Aug 2018 07:03:46 -0400 coleenp 8210155: Lock ClassLoaderDataGraph
Fri, 31 Aug 2018 12:41:00 +0200 hannesw 8176453: Javadoc search: there are issues with generics in parameters
Fri, 31 Aug 2018 11:43:06 +0200 dnsimon 8210066: [JVMCI] iterateFrames uses wrong GrowableArray API for appending
Fri, 31 Aug 2018 09:37:03 +0200 ihse 6657100: Rename sparcWorks to solstudio in HotSpot
Thu, 30 Aug 2018 13:12:38 +0200 mbaesken 8210205: build fails on AIX in hotspot cpp tests (for example getstacktr001.cpp)
Fri, 31 Aug 2018 10:32:47 +0800 jjiang 8209362: sun/security/ssl/SSLSocketImpl/ReuseAddr.java failed due to "BindException: Address already in use (Bind failed)"
Fri, 31 Aug 2018 10:00:22 +0800 mli 8208280: java/nio/channels/Selector/RegisterDuringSelect.java fails with "key not removed from key set"
Thu, 30 Aug 2018 17:59:40 -0700 cjplummer 8210118: better jdb test diagnostics when getting "Prompt is not received during ... milliseconds" failures
Thu, 30 Aug 2018 17:03:46 -0400 kbarrett 8209975: Some GCThreadLocalData not initialized
Thu, 30 Aug 2018 16:33:14 -0400 avoitylov 8210164: building Minimal VM fails with error: comparison of unsigned expression < 0 is always false [-Werror=type-limits]
Thu, 30 Aug 2018 16:16:19 -0400 kbarrett 8210119: Rename SubTasksDone::is_task_claimed
Thu, 30 Aug 2018 12:39:26 -0700 bpb 8207744: Clean up inconsistent use of opendir/closedir versus opendir64/closedir64
Thu, 30 Aug 2018 11:53:49 -0700 amenkov 8209604: [TEST] rewrite com/sun/jdi shell tests to java version - step2
Thu, 30 Aug 2018 03:01:49 -0700 akolarkunnu 8209993: Create a test for SwingSet3 ToolTipDemo
Thu, 30 Aug 2018 09:47:12 -0700 jcbeyler 8203356: VM Object Allocation Collector can infinite recurse
Thu, 30 Aug 2018 08:01:13 -0700 iklam 8210194: [TESTBUG] jvmti_FollowRefObjects.cpp missing initializer for member _jvmtiHeapCallbacks::heap_reference_callback
Thu, 30 Aug 2018 09:08:23 -0400 hseigel 8210168: JCK test .vm.classfmt.ins.code__002.code__00201m1.code__00201m1 hangs with -noverify
Thu, 30 Aug 2018 09:34:10 +0200 lucy 8209950: SIGBUS in CodeHeapState::print_names()
Thu, 30 Aug 2018 09:25:38 +0200 eosterlund 8210065: ZGC: Remove mode for treating weaks as strong
Wed, 29 Aug 2018 10:11:51 +0200 mbaesken 8210147: adjust some WSAGetLastError usages in windows network coding
Thu, 30 Aug 2018 09:12:07 +0200 eosterlund 8210063: ZGC: Enable load barriers for IN_NATIVE runtime barriers
Thu, 30 Aug 2018 08:59:23 +0200 eosterlund 8210061: ZGC: Remove STW weak processor mode
Thu, 30 Aug 2018 08:19:13 +0200 ihse 8210160: Remove deprecated configure arguments
Thu, 30 Aug 2018 08:15:10 +0200 ihse 8210150: Allow custom-hook.m4 to include files from CUSTOM_CONFIG_DIR
Wed, 29 Aug 2018 20:13:53 -0700 cjplummer 8199811: com/sun/jdi/ProcessAttachTest.java fails intermittently: Remote thread failed for unknown reason
Tue, 28 Aug 2018 08:06:59 -0400 gadams 8170089: nsk/jdi/EventSet/resume/resume008: ERROR: suspendCounts don't match for : Common-Cleaner
Wed, 29 Aug 2018 19:14:08 -0700 ljiang 8210153: localized currency symbol of VES
Thu, 30 Aug 2018 03:49:23 +0200 jwilhelm Added tag jdk-12+9 for changeset 31b159f30fb2
Wed, 29 Aug 2018 13:50:55 -0700 mikael 8210167: ProblemList vmTestbase/nsk/jvmti/scenarios/allocation/AP10/ap10t001/TestDescription.java
Wed, 29 Aug 2018 13:04:50 -0700 mikael 8209856: Obsolete error reporter
Thu, 30 Aug 2018 21:56:19 -0700 mikael Merge
Wed, 29 Aug 2018 20:15:09 +0200 rkennke 8180193: Make marking bitmap code available to other GCsjdk-12+9
Wed, 29 Aug 2018 19:48:28 +0200 jwilhelm Merge
Wed, 22 Aug 2018 21:50:12 +0200 jwilhelm Added tag jdk-11+28 for changeset 76072a077ee1
Tue, 21 Aug 2018 12:48:10 -0700 jjg 8209806: API docs should be updated to refer to javase11jdk-11+28
Tue, 21 Aug 2018 11:30:48 -0700 wetmore 8207317: SSLEngine negotiation fail exception behavior changed from fail-fast to fail-lazy
Tue, 21 Aug 2018 13:44:59 +0100 aph 8207838: AArch64: Float registers incorrectly restored in JNI call
Tue, 21 Aug 2018 17:47:59 +0200 thartmann 8209670: CompilerThread releasing code buffer in destructor is unsafe
Tue, 21 Aug 2018 09:25:06 +0200 simonis 8209637: [s390x] Interpreter doesn't call result handler after native calls
Mon, 20 Aug 2018 15:10:20 -0700 kvn 8209735: Disable avx512 by default
Wed, 29 Aug 2018 12:00:47 -0400 apetcher 8201317: X25519/X448 code improvements
Tue, 28 Aug 2018 14:55:06 +0200 ghaug 8209996: [PPC64] Fix JFR profiling
Wed, 29 Aug 2018 10:46:59 -0400 pchilanomate 8209844: MemberNameLeak.java fails when ResolvedMethod entry is not removed
Wed, 22 Aug 2018 10:29:17 +0200 roland 8209691: Allow MemBar on single memory slice
Wed, 29 Aug 2018 11:25:51 +0100 mcimadamore 8209064: Make intellij support more robust after changes for 2018.2
Wed, 29 Aug 2018 14:10:19 +0530 vtewari 8176553: LdapContext follows referrals infinitely ignoring set limit
Wed, 29 Aug 2018 09:36:17 +0200 jlahoda 8206986: Compiler support for Switch Expressions (Preview)
Tue, 28 Aug 2018 09:01:54 +0200 mbaesken 8209994: windows: Java_java_net_NetworkInterface_getAll misses releasing interface-list
Tue, 28 Aug 2018 20:05:41 -0700 ljiang 8208746: ISO 4217 Amendment #168 update
Wed, 29 Aug 2018 08:00:00 +0200 pliden 8210045: Allow using a subset of worker threads even when UseDynamicNumberOfGCThreads is not set
Tue, 28 Aug 2018 21:25:37 -0700 jcbeyler 8210035: Fix copyrights for files created for the HeapMonitor work
Tue, 28 Aug 2018 16:01:12 -0700 iklam 8210040: TestOptionsWithRanges.java is very slow
Tue, 28 Aug 2018 16:01:01 -0700 iklam 8210043: Invalid assert(HeapBaseMinAddress > 0) in ReservedHeapSpace::initialize_compressed_heap
Tue, 28 Aug 2018 16:18:58 -0700 ccheung 8209743: [TESTBUG] java/lang/management/MemoryMXBean/LowMemoryTest2.sh fails with OutOfMemoryError running in CDS mode
Tue, 28 Aug 2018 18:31:14 -0400 coleenp Merge
Tue, 28 Aug 2018 18:17:01 -0400 coleenp 8209958: Clean up duplicate basic array type statics in Universe
Tue, 28 Aug 2018 15:17:52 -0700 twisti 8210008: custom extension for make/SourceRevision.gmk
Tue, 28 Aug 2018 18:03:33 -0400 coleenp 8210088: ProblemList gc/epsilon/TestMemoryMXBeans.java
Tue, 28 Aug 2018 14:37:34 -0700 iignatyev 8209611: use C++ compiler for hotspot tests
Tue, 28 Aug 2018 14:33:18 -0700 iignatyev 8210108: sun/tools/jstatd test build failures after JDK-8210022
Tue, 28 Aug 2018 07:30:36 -0400 gadams 8019927: [TESTBUG] nsk/jvmti/GetThreadInfo/thrinfo001 intermittently fails with 'invalid thread group' when running with JFR
Tue, 28 Aug 2018 16:04:54 -0400 kbarrett 8209976: Improve iteration over non-JavaThreads
Tue, 28 Aug 2018 14:45:34 -0400 jiangli 8209534: [TESTBUG]runtime/appcds/cacheObject/ArchivedModuleCompareTest.java fails with EnableJVMCI.
Tue, 28 Aug 2018 12:57:40 -0400 kbarrett 8072498: Multi-thread JNI weak reference processing
Wed, 22 Aug 2018 09:33:18 -0700 jcbeyler 8201224: Make string buffer size dynamic in mlvmJvmtiUtils.c
Tue, 28 Aug 2018 17:03:16 +0200 goetz 8209939: [testbug][ppc] Test SafepointPollingPages fails after 8208499 with UseSIGTRAP on.
Tue, 28 Aug 2018 10:10:11 -0400 hseigel 8202578: Revisit location for class unload events
Tue, 28 Aug 2018 09:06:23 +0200 pliden 8209894: ZGC: Cap number of GC workers based on heap size
Mon, 27 Aug 2018 21:50:52 -0700 iignatyev 8210022: remove jdk.testlibrary.ProcessThread, TestThread and XRun
Mon, 27 Aug 2018 17:01:15 -0700 iignatyev 8186548: move jdk.testlibrary.JcmdBase closer to tests
Mon, 27 Aug 2018 16:45:18 -0700 amenkov 8203393: com/sun/jdi/JdbMethodExitTest.sh and JdbExprTest.sh fail due to timeout
Mon, 27 Aug 2018 03:48:41 -0700 akolarkunnu 8209494: Create a test for SwingSet InternalFrameDemo
Mon, 27 Aug 2018 17:20:29 -0400 zgu 8209852: Counters in StringCleaningTask should be type of size_t
Mon, 27 Aug 2018 12:45:31 -0700 lmesnik 8209920: runtime/logging/RedefineClasses.java fail with OOME with ZGC
Mon, 27 Aug 2018 03:46:44 -0700 akolarkunnu 8209789: Synchronize test/jdk/sanity/client/lib/jemmy with code-tools/jemmy/v2
Mon, 27 Aug 2018 09:46:24 -0700 xuelei 8209965: The "supported_groups" extension in ServerHellos
Mon, 27 Aug 2018 23:14:17 +0800 weijun 8209995: java.base does not need to export sun.security.ssl to java.security.jgss
Mon, 27 Aug 2018 12:33:03 +0100 dfuchs 8209987: Minor cleanup in Level.java
Mon, 27 Aug 2018 10:25:13 +0530 jgeorge 8204308: SA: serviceability/sa/TestInstanceKlassSize*.java fails when running in CDS mode
Sat, 25 Aug 2018 11:10:21 -0400 coleenp 8209821: Make JVMTI GetClassLoaderClasses not walk CLDG
Sat, 25 Aug 2018 14:23:21 +0200 shade 8209911: More blob types in hs_err printout
Fri, 24 Aug 2018 18:56:41 -0700 igerasim 6474858: CardChannel.transmit(CommandAPDU) throws unexpected ArrayIndexOutOfBoundsException
Thu, 23 Aug 2018 21:16:45 -0700 iklam 8208658: Make CDS archived heap regions usable even if compressed oop encoding has changed
Fri, 24 Aug 2018 13:30:56 -0700 vromero 8209173: javac fails with completion exception while reporting an error
Fri, 24 Aug 2018 13:23:39 -0700 mikael 8209915: Fix license headers
Fri, 24 Aug 2018 15:49:21 -0400 zgu 8209841: [REDO] Refactor G1ParallelCleaningTask into shared
Fri, 24 Aug 2018 15:33:28 -0400 jiangli 8208061: runtime/LoadClass/TestResize.java fails with "Load factor too high" when running in CDS mode.
Fri, 24 Aug 2018 11:56:14 -0700 dlong 8209825: guarantee(false) failed: wrong number of expression stack elements during deopt
Fri, 17 Aug 2018 17:13:12 +0200 roland 8209639: assert failure in coalesce.cpp: attempted to spill a non-spillable item
Fri, 24 Aug 2018 09:12:51 -0500 gziemski 8209622: applications/kitchensink/Kitchensink.java failed with Kitchensink failed with exit code = 138
Mon, 20 Aug 2018 12:08:07 +0200 ghaug 8208480: Test failure: assert(is_bound() || is_unused()) after JDK-8206075 in C1
Mon, 23 Jul 2018 18:08:46 +0200 sgehwolf 8208091: SA: jhsdb jstack --mixed throws UnmappedAddressException on i686
Fri, 24 Aug 2018 14:04:34 +0200 redestad 8209837: Avoid initializing ExpiringCache during bootstrap
Fri, 06 Jul 2018 16:04:19 +0200 rkennke 8206457: Code paths from oop_iterate() must use barrier-free access
Fri, 24 Aug 2018 09:38:11 +0200 shade 8208665: Amend cross-compilation docs with qemu-debootstrap recipe
Fri, 24 Aug 2018 08:17:23 +0200 thartmann 8209833: C2 compilation fails with "assert(ex_map->jvms()->same_calls_as(_exceptions->jvms())) failed: all collected exceptions must come from the same place"
Thu, 23 Aug 2018 16:47:53 -0700 lmesnik 8209150: [TESTBUG] Add logging to verify JDK-8197901 to a different test
Thu, 23 Aug 2018 07:54:19 -0400 gadams 8034084: nsk.nsk/jvmti/ThreadStart/threadstart003 Wrong number of thread end events
Thu, 23 Aug 2018 18:14:53 -0400 kbarrett 8209850: Allow NamedThreads to use GlobalCounter critical sections
Thu, 23 Aug 2018 12:57:40 -0700 joehw 8209873: Typo in javax.xml.validation.Validator.validate documentation
Thu, 23 Aug 2018 12:09:46 -0700 igerasim 8209171: Simplify Java implementation of Integer/Long.numberOfTrailingZeros()
Thu, 23 Aug 2018 09:36:13 -0700 igerasim 8209851: Algorithm name is compared via reference identity
Thu, 23 Aug 2018 09:35:09 -0700 ccheung 8207211: [TESTBUG] Remove excessive output from CDS/AppCDS tests
Thu, 23 Aug 2018 11:33:51 -0400 pchilanomate 8209854: ProblemList MemberNameLeak
Thu, 23 Aug 2018 14:31:27 +0200 pliden 8209883: ZGC: Compile without C1 broken
Thu, 23 Aug 2018 11:37:14 +0100 coffeys 8209129: Further improvements to cipher buffer management
Thu, 23 Aug 2018 10:52:27 +0200 pliden 8209831: ZGC: Clean up ZRelocationSetSelectorGroup::semi_sort()
Wed, 22 Aug 2018 14:28:47 -0700 joehw 8209615: ParseError in XMLEventReader on a valid input
Wed, 22 Aug 2018 13:53:48 -0700 dlong 8209651: better TLS poll for x64 C2
Wed, 22 Aug 2018 21:48:39 +0200 jwilhelm Added tag jdk-12+8 for changeset 492b366f8e57
Wed, 22 Aug 2018 13:47:47 -0500 mchung 8167314: Enable the check to detect duplicate provides in in GenModuleInfoSource
Wed, 22 Aug 2018 20:37:07 +0200 tschatzl 8209062: Clean up G1MonitoringSupport
Wed, 22 Aug 2018 20:37:07 +0200 tschatzl 8209061: Move G1 serviceability functionality to G1MonitoringSupport
Wed, 22 Aug 2018 20:37:07 +0200 tschatzl 8209700: Remove HeapRegionSetBase::RegionSetKind for a more flexible approach
Wed, 22 Aug 2018 20:37:07 +0200 tschatzl 8209698: Remove "Pinned" from HeapRegionTraceType
Wed, 22 Aug 2018 20:37:07 +0200 tschatzl 8208498: Put archive regions into a first-class HeapRegionSet
Wed, 22 Aug 2018 10:28:34 -0700 amenkov 8209605: com/sun/jdi/BreakpointWithFullGC.java fails with ZGC
Wed, 22 Aug 2018 08:31:15 -0700 dtitov 8202342: [Graal] fromTonga/nsk/jvmti/unit/FollowReferences/followref003/TestDescription.java fails with "Location mismatch" errors
Tue, 14 Aug 2018 09:59:37 -0700 iklam 8208658: Make CDS archived heap regions usable even if compressed oop encoding has changed
Wed, 22 Aug 2018 16:06:51 +0100 adinn 8209783: AArch64: Combine Multiply and Neg operations in C2
Wed, 22 Aug 2018 10:36:39 +0200 roland 8209686: cleanup arguments to PhaseIdealLoop() constructor
Wed, 22 Aug 2018 16:01:29 +0200 tschatzl 8209839: [Backout] Backout JDK-8206467 Refactor G1ParallelCleaningTask into shared
Sun, 19 Aug 2018 20:00:57 +0200 rkennke 8209667: Explicit barriers for C1/LIR
Wed, 22 Aug 2018 07:51:07 -0400 coleenp 8208172: SIGSEGV when owner of invokedynamic bootstrap method throws an exception - Symbol::increment_refcount()+0x0
Wed, 22 Aug 2018 13:06:33 +0200 eosterlund 8208601: Introduce native oop barriers in C2 for OopHandle
Wed, 22 Aug 2018 13:01:26 +0200 rkennke 8209801: Rename C1_WRITE_ACCESS and C1_READ_ACCESS decorators to ACCESS_READ and ACCESS_WRITE
Wed, 22 Aug 2018 10:09:06 +0200 roland 8209684: Intrinsics that assume some input non null should use GraphKit::must_be_not_null()
Tue, 14 Aug 2018 16:54:47 +0200 roland 8209420: Track membars for volatile accesses so they can be properly optimized
Wed, 22 Aug 2018 15:10:40 +0800 weijun 8209829: SpnegoUnknownMech.java does not contain the SpnegoUnknownMech class
Tue, 21 Aug 2018 20:23:34 -0700 iklam 8209826: Undefined reference to os::write after JDK-8209657 (filemap.hpp cleanup)
Tue, 21 Aug 2018 20:19:46 -0700 igerasim 8186186: GSSContext.isEstablished() can return true on error state
Wed, 22 Aug 2018 11:10:45 +0800 weijun 8209771: jdk.test.lib.Utils::runAndCheckException error
Fri, 17 Aug 2018 13:53:53 -0700 iklam 8209657: Refactor filemap.hpp to simplify integration with Serviceability Agent
Tue, 21 Aug 2018 20:29:57 -0400 zgu 8206467: Refactor G1ParallelCleaningTask into shared
Tue, 21 Aug 2018 13:17:29 -0700 lmesnik 8209758: 2 classes with same name G1PrintCollectionSetClosure cause crash when logging is enabledjdk-12+8
Tue, 21 Aug 2018 14:14:28 +0200 twisti 8209689: Compiler.isGraalEnabled should not check jvmci.Compiler property
Tue, 21 Aug 2018 08:38:02 -0700 never 8209624: [JVMCI] Invalidate nmethods instead of directly unloading them when the InstalledCode is dropped
Tue, 21 Aug 2018 10:37:02 -0400 pchilanomate 8206423: Use locking for cleaning ResolvedMethodTable
Tue, 21 Aug 2018 10:03:22 -0400 coleenp 8209792: Remove ClassLoaderDataGraph::keep_alive_cld_do
Tue, 21 Aug 2018 09:33:41 -0400 coleenp 8209738: Remove ClassLoaderDataGraph::*oops_do functions
Tue, 21 Aug 2018 13:12:15 +0200 rkennke 8209668: Explicit barriers for C1/assembler
Tue, 21 Aug 2018 11:41:54 +0530 pmuthuswamy 8203792: Remove "compatibility" features from Head.java
Mon, 20 Aug 2018 13:58:23 -0700 iklam 8209647: constantPoolHandle::constantPoolHandle(ConstantPool*) when precompiled header is disabled
Mon, 20 Aug 2018 16:18:56 -0700 tbell 8209760: merge error: restore ea in make/conf/jib-profiles.js
Mon, 20 Aug 2018 15:37:47 -0700 jnimeh 8208350: Disable all DES cipher suites
Mon, 20 Aug 2018 14:19:30 -0700 mikael Merge
Fri, 17 Aug 2018 09:51:28 -0700 mikael Added tag jdk-11+27 for changeset 9d7d74c6f2cb
Thu, 16 Aug 2018 10:22:48 +0100 michaelm 8207966: HttpClient response without content-length does not return bodyjdk-11+27
Thu, 16 Aug 2018 02:00:31 +0800 jjiang 8209537: Two security tests failed after JDK-8164639 due to dependency was missed
Wed, 15 Aug 2018 18:41:18 +0800 jjiang 8164639: Configure PKCS11 tests to use user-supplied NSS libraries
Wed, 15 Aug 2018 00:48:12 -0700 vdeshpande 8207746: C2: Lucene crashes on AVX512 instruction
Tue, 14 Aug 2018 17:21:44 -0700 rhalade 8206176: Remove the temporary tls13VN field
Tue, 14 Aug 2018 16:36:17 -0700 diazhou 8209451: Please change jdk 11 milestone to FCS
Tue, 14 Aug 2018 16:47:56 -0700 xuelei 8207009: TLS 1.3 half-close and synchronization issues
Tue, 14 Aug 2018 14:46:13 -0700 rhalade 8209506: Add Google Trust Services GlobalSign root certificates
Tue, 14 Aug 2018 12:50:39 -0700 kaddepalli 8208640: [a11y] [macos] Unable to navigate between Radiobuttons in Radio group using keyboard.
Tue, 14 Aug 2018 09:38:29 -0700 rhalade 8209452: VerifyCACerts.java failed with "At least one cacert test failed"
Tue, 14 Aug 2018 11:55:21 +0530 rgoel 8206965: java/util/TimeZone/Bug8149452.java failed on de_DE and ja_JP locale.
Mon, 13 Aug 2018 13:44:45 -0700 iignatyev 8205687: TimeoutHandler generates huge core files
Thu, 09 Aug 2018 11:33:47 -0700 epavlova 8194949: [Graal] gc/TestNUMAPageSize.java fail with OOM in -Xcomp
Thu, 09 Aug 2018 22:47:18 +0530 mhalder 8208125: Cannot input text into JOptionPane Text Input Dialog
Mon, 20 Aug 2018 11:37:57 -0700 iignatyev 8209740: typo in test/lib/jtreg/SkippedException.java
Mon, 20 Aug 2018 10:11:26 -0700 joehw 8209576: java.nio.file.Files.writeString writes garbled UTF-16 instead of UTF-8
Mon, 20 Aug 2018 17:25:45 +0200 lucy 8209588: SIGSEGV in MethodArityHistogram() with -XX:+CountCompiledCalls
Mon, 20 Aug 2018 14:25:02 +0200 redestad 8209633: Avoid creating WeakEntry wrappers when looking up cached MethodType
Mon, 20 Aug 2018 08:25:57 -0400 lfoltan 8209301: JVM rename is_anonymous, host_klass to unsafe specific terminology ahead of Unsafe.defineAnonymousClass deprecation
Mon, 20 Aug 2018 10:04:00 +0200 shade 8209573: [TESTBUG] gc/epsilon/TestMemoryMXBeans should retry on failure
Sun, 19 Aug 2018 22:41:49 -0700 iignatyev 8209456: [error-prone] ShortCircuitBoolean in java.logging
Sat, 18 Aug 2018 13:59:25 -0400 kbarrett 8154343: Make SATB related code available to other GCs
Fri, 17 Aug 2018 21:36:02 -0700 jnimeh 8203614: Java API SSLEngine example code needs correction
Fri, 17 Aug 2018 14:50:59 -0700 ccheung 8209385: CDS runtime classpath checking is too strict when only classes from the system modules are archived
Fri, 17 Aug 2018 22:20:47 +0100 coffeys 8208675: Remove legacy sun.security.key.serial.interop property
Fri, 17 Aug 2018 13:37:01 -0700 darcy 8209304: Deprecate serialVersionUID fields in interfaces
Fri, 17 Aug 2018 13:20:53 -0700 iveresov 8206992: Update Graal
Fri, 17 Aug 2018 11:56:59 -0500 gziemski 8209586: AARCH64: SymbolTable changes throw assert on aarch64
Fri, 17 Aug 2018 09:53:52 -0700 mikael Added tag jdk-12+7 for changeset ef57958c7c51
Fri, 17 Aug 2018 21:50:55 +0530 sballal 8209342: Problemlist SA tests on Solaris due to Error attaching to process: Can't create thread_db agent!
Fri, 17 Aug 2018 13:38:19 +0200 rehn 8207334: VM times out in VM_HandshakeAllThreads::doit() with RunThese30M
Fri, 17 Aug 2018 03:59:20 -0700 epavlova 8209587: Update test/hotspot/jtreg/ProblemList-graal.txt
Fri, 17 Aug 2018 08:21:20 +0200 thartmann 8208275: C2 crash in Node::add_req(Node*)
Wed, 15 Aug 2018 11:19:57 -0700 iklam 8209545: Simplify HeapShared::archive_module_graph_objects
Thu, 16 Aug 2018 19:49:25 -0400 kbarrett 8209607: Remove stale comment for JNI mutexes
Thu, 16 Aug 2018 16:44:51 -0700 amenkov 8209608: Problem list com/sun/jdi/BreakpointWithFullGC.java
Thu, 16 Aug 2018 16:28:03 -0700 iignatyev 8209549: remove VMPropsExt from TEST.ROOT
Thu, 16 Aug 2018 17:29:22 -0400 jiangli 8209389: SIGSEGV in WalkOopAndArchiveClosure::do_oop_work.
Thu, 16 Aug 2018 10:20:00 -0700 amenkov 8209517: com/sun/jdi/BreakpointWithFullGC.java fails with timeout
Thu, 16 Aug 2018 15:00:23 +0200 jlahoda 8208269: Javadoc does not support module-info in a multi-release jar
Wed, 15 Aug 2018 10:38:27 -0400 rriggs 8208715: Conversion of milliseconds to nanoseconds in UNIXProcess contains bug
Tue, 21 Aug 2018 01:21:58 -0700 mikael Merge
Thu, 16 Aug 2018 16:06:54 +0530 rgoel 8209047: "Illegal pattern character 'B'" IllegalArgumentException with Burmese localesjdk-12+7
Thu, 16 Aug 2018 09:46:09 +0200 dnsimon 8209535: [JVMCI] Do not swallow NoClassDefFoundError when converting JVMCI methods and fields to reflection objects
Thu, 16 Aug 2018 09:09:18 +0200 thartmann 8209511: C2 asserts with UseSSE < 4 and AVX enabled: "Label was never bound to a location, but it was used as a jmp target'
Wed, 15 Aug 2018 19:22:46 -0700 iklam 8207832: serviceability/sa/ClhsdbCDSCore.java failed with "Couldn't find core file location"
Tue, 14 Aug 2018 20:46:46 -0700 iklam 8206115: Use shared macros for JavaClasses::compute_offsets and MetaspaceShared::serialize_well_known_classes
Wed, 15 Aug 2018 13:39:32 -0700 vromero 8207320: Wrong type order for intersection lambdas with multiple abstract methods
Wed, 15 Aug 2018 16:01:48 -0400 coleenp 8209541: Fix merge problem in SymbolTable::do_check_concurrent_work
Wed, 15 Aug 2018 15:50:23 -0400 coleenp 8209447: vmTestbase/vm/mlvm/indy/func/jvmti/mergeCP_none2indy_b/TestDescription.java timed out
Wed, 15 Aug 2018 10:44:56 -0700 darcy 5075463: (enum) Serialized Form javadoc for java.lang.Enum is misleading
Wed, 15 Aug 2018 10:16:15 -0700 darcy 8176425: Add radix indication in NumberFormatException message for Integer.decode
Wed, 15 Aug 2018 10:00:16 -0700 mseledtsov 8209164: [TESTBUG] Apply jtreg skipped status to cds tests
Wed, 15 Aug 2018 14:35:33 +0200 thartmann 8209459: TestSHA512MultiBlockIntrinsics failed on AArch64
Wed, 15 Aug 2018 14:48:12 +0300 dpochepk 8209439: C2 library_call can potentially ignore Math.pow intrinsic or use null pointer
Wed, 15 Aug 2018 09:51:57 +0200 eosterlund 8208582: Introduce native oop barriers in C1 for OopHandle
Tue, 14 Aug 2018 18:16:47 -0700 xuelei 8207009: TLS 1.3 half-close and synchronization issues
Tue, 14 Aug 2018 19:52:34 -0400 coleenp 8209518: symbol table gtest fails with semaphore error
Tue, 14 Aug 2018 18:42:14 -0500 gziemski 8195100: Use a low latency hashtable for SymbolTable
Tue, 14 Aug 2018 14:08:04 -0700 kvn 8208463: jdk.internal.vm.compiler's module-info.java.extra contains duplicated provides of the same service interface
Tue, 14 Aug 2018 14:58:14 -0400 kbarrett 8209347: SATBMarkQueue.cpp should not need jvm.h
Tue, 14 Aug 2018 11:56:32 -0700 amenkov 8209109: [TEST] rewrite com/sun/jdi shell tests to java version - step1
Tue, 14 Aug 2018 13:16:26 -0400 kbarrett 8209346: Refactor SATBMarkQueue filter configuration
Tue, 14 Aug 2018 10:08:21 -0700 rhalade 8209452: VerifyCACerts.java failed with "At least one cacert test failed"
Mon, 13 Aug 2018 21:57:17 -0700 akolarkunnu 8209418: Synchronize test/jdk/sanity/client/lib/jemmy with code-tools/jemmy/v2
Tue, 14 Aug 2018 22:39:34 +0800 weijun 8209416: Refactoring GetPropertyAction calls in security libs
Tue, 14 Aug 2018 14:28:23 +0200 lucy 8209433: [s390] Fix build, broken by 8208672 (Enable -Wreorder)
Mon, 13 Aug 2018 09:19:21 -0700 jcbeyler 8061467: Add UseLargePages to TestNUMAPageSize
Mon, 13 Aug 2018 14:04:43 +0200 pliden 8209376: ZGC: Move ZMarkStackAllocator into a separate file
Mon, 13 Aug 2018 14:04:42 +0200 pliden 8209375: ZGC: Use dynamic base address for mark stack space
Tue, 14 Aug 2018 00:15:56 -0400 kbarrett 8209345: Merge SATBMarkQueueFilter into SATBMarkQueueSet
Tue, 14 Aug 2018 10:42:00 +0800 xiaofeya 8194230: jdk/internal/jrtfs/remote/RemoteRuntimeImageTest.java fails with java.lang.NullPointerException
Mon, 13 Aug 2018 17:39:27 -0700 iignatyev 8209382: [error-prone] HashtableContains in sun/rmi/server/ActivationGroupImpl.java
Mon, 13 Aug 2018 18:21:26 -0400 kbarrett 8209396: Make PtrQueueSets not statically allocated
Mon, 13 Aug 2018 13:24:55 -0700 kvn 8207153: Some intrinsic tests take long time to run
Mon, 13 Aug 2018 19:21:43 +0200 redestad 8209120: Archive the Integer.IntegerCache
Fri, 10 Aug 2018 09:16:10 +0200 mbaesken 8209115: adjust libsplashscreen linux ppc64le builds for easier libpng update
Mon, 13 Aug 2018 04:02:51 -0700 epavlova 8199486: [Graal] gc/g1/ihop/TestIHOPStatic.java fails by timeout with -Xcomp
Mon, 13 Aug 2018 12:24:25 +0200 tschatzl 8200365: TestOptionsWithRanges.java of '-XX:TLABWasteTargetPercent=100' fails intermittently
Mon, 13 Aug 2018 12:24:25 +0200 tschatzl 8205633: TestOptionsWithRanges.java of '-XX:TLABSize=2147483648' fails intermittently
Mon, 13 Aug 2018 12:24:25 +0200 tschatzl 8209193: Fix aarch64-linux compilation after -Wreorder changes
Mon, 13 Aug 2018 12:24:25 +0200 ghaug 8209357: [PPC64] Fix build which was broken by 8208672 (Enable -Wreorder)
Mon, 13 Aug 2018 12:24:25 +0200 avoitylov 8209380: ARM: cleanup maybe-uninitialized and reorder compiler warnings
Mon, 13 Aug 2018 10:28:01 +0200 shade 8209378: Fix Minimal VM after JDK-8208677
Sat, 11 Aug 2018 12:49:33 -0400 coleenp 8207924: serviceability/sa/TestUniverse.java#id0 intermittently fails with assert(get_instanceKlass()->is_loaded()) failed: must be at least loaded
Fri, 10 Aug 2018 22:38:18 -0400 coleenp 8209384: ProblemList stressHierarchy metaspace tests
Fri, 10 Aug 2018 12:05:53 -0700 bchristi 8205399: Set node color on pinned HashMap.TreeNode deletion
Fri, 10 Aug 2018 09:36:01 -0400 coleenp 8164683: Solaris: JVM abuses thread preemption control
Fri, 10 Aug 2018 09:30:26 -0400 hseigel 8207778: Add locking to ModuleEntry and PackageEntry tables
Fri, 10 Aug 2018 14:22:49 +0300 bulasevich 8206895: aarch64: rework error-prone cmp instuction
Fri, 10 Aug 2018 17:07:44 +0800 weijun 8201290: keytool importcert fails with CertificateParsingException if unknown certificate algorithms should be imported
Fri, 10 Aug 2018 13:07:21 +0800 xyin 8208483: Add 5 JNDI tests to com/sun/jndi/dns/FactoryTests/
Fri, 10 Aug 2018 00:35:57 -0400 jiangli 8207263: Store the Configuration for system modules into CDS archive.
Thu, 09 Aug 2018 15:52:23 -0700 ccheung 8208705: [TESTBUG] The -Xlog:cds,cds+hashtables vm option is not always required for appcds tests
Fri, 10 Aug 2018 00:20:15 +0200 redestad 8209186: Rename SimpleThresholdPolicy to TieredThresholdPolicy
Thu, 09 Aug 2018 22:51:48 +0200 rkennke 8209118: Abstract SATBMarkQueueSet's ThreadLocalData access
Thu, 09 Aug 2018 11:39:18 -0700 epavlova 8205078: [Graal] org.graalvm.compiler.core.test.VerifyDebugUsageTest fails with "Expected exception: VerificationError"
Thu, 09 Aug 2018 10:08:07 -0700 mikael Merge
Thu, 09 Aug 2018 07:58:25 -0700 mikael Added tag jdk-11+26 for changeset 945ba9278a27
Thu, 09 Aug 2018 11:23:12 +0100 chegar 8208391: Differentiate response and connect timeouts in HTTP Client API
Wed, 08 Aug 2018 15:51:08 -0700 serb 8189667: Desktop#moveToTrash expects incorrect "<<ALL FILES>>" FilePermission
Wed, 08 Aug 2018 15:11:11 -0400 dcubed 8209149: [TESTBUG] runtime/RedefineTests/RedefineRunningMethods.java needs a longer timeout
Wed, 08 Aug 2018 13:45:41 +0800 yzhang 8209011: [TESTBUG] AArch64: sun/security/pkcs11/Secmod/TestNssDbSqlite.java fails in aarch64 platforms
Mon, 06 Aug 2018 14:56:56 +0200 rwestberg 8208676: Missing NULL check and resource leak in NetworkPerformanceInterface::NetworkPerformance::network_utilization
Tue, 07 Aug 2018 00:06:52 -0700 ljiang 8208663: JDK 11 L10n resource file update msg drop 20jdk-11+26
Tue, 07 Aug 2018 17:40:11 -0700 iris 8201394: Update java.se module summary to reflect removal of java.se.ee module
Tue, 07 Aug 2018 13:51:30 -0700 iignatyev 8031761: [TESTBUG] Add a regression test for JDK-8026328
Tue, 07 Aug 2018 10:29:01 -0400 mullan 8208691: Tighten up jdk.includeInExceptions security property
Mon, 06 Aug 2018 22:30:37 -0400 dbuck 8204966: [TESTBUG] hotspot/test/compiler/whitebox/IsMethodCompilableTest.java test fails with -XX:CompileThreshold=1
Mon, 06 Aug 2018 20:44:14 -0400 dcubed 8209029: ProblemList tests that fail due to 'Error attaching to process: Can't create thread_db agent!' in jdk-11+25 testing
Mon, 06 Aug 2018 00:46:40 -0700 ssahoo 8208496: New Test to verify concurrent behavior of TLS.
Mon, 06 Aug 2018 09:09:57 +0200 thartmann 8207355: C1 compilation hangs in ComputeLinearScanOrder::compute_dominator
Fri, 03 Aug 2018 15:39:28 -0700 iignatyev 8199081: [Testbug] compiler/linkage/LinkageErrors.java fails if run twice
Fri, 22 Jun 2018 16:07:15 +0200 rkennke 8205523: Explicit barriers for interpreter
Thu, 09 Aug 2018 17:11:11 +0200 rkennke 8204969: Asserts in objArrayKlass.cpp need to use _raw variants of obj_addr_at()
Thu, 09 Aug 2018 08:02:20 -0700 mikael Added tag jdk-12+6 for changeset 7939b3c4e408
Wed, 08 Aug 2018 11:11:19 -0700 jcbeyler 8208242: Add @requires to vmTestbase/gc/g1 tests
Thu, 09 Aug 2018 11:24:30 +0200 pliden 8209127: ZGC: Improve error message when failing to map memory for mark stacks
Thu, 09 Aug 2018 11:24:30 +0200 pliden 8209126: ZGC: ZMarkStackAllocator::is_initialized() never called
Thu, 09 Aug 2018 11:24:30 +0200 pliden 8209125: ZGC: Clean up ZServiceabilityCounters
Thu, 09 Aug 2018 11:24:30 +0200 pliden 8207756: ZGC: jstat should show CGC STW phases
Thu, 09 Aug 2018 15:42:48 +0800 xiaofeya 8208656: Move java/util/Calendar/CalendarTestScripts tests into OpenJDK
Wed, 08 Aug 2018 18:38:34 -0700 kvn 8207965: C2-only debug build fails
Wed, 08 Aug 2018 15:34:32 -0700 jcbeyler 8208303: Track JNI failures and fail tests
Wed, 08 Aug 2018 14:40:02 -0700 mchung 8202941: GenModuleInfoSource build tool does not detect missing semicolons
Wed, 08 Aug 2018 15:24:21 -0400 coleenp 8208677: Move inner metaspace cleaning out of class unloading
Wed, 08 Aug 2018 15:11:11 -0400 dcubed 8209149: [TESTBUG] runtime/RedefineTests/RedefineRunningMethods.java needs a longer timeout
Wed, 08 Aug 2018 09:25:10 -0700 bpb 8193822: Remove unused newDirectByteBuffer and truncate methods from buffer classes
Wed, 08 Aug 2018 15:31:07 +0200 tschatzl 8208672: Enable -Wreorder in make files for gcc, clang
Wed, 08 Aug 2018 15:31:07 +0200 tschatzl 8208671: Runtime, JFR, Serviceability changes to allow enabling -Wreorder
Wed, 08 Aug 2018 15:31:06 +0200 tschatzl 8208670: Compiler changes to allow enabling -Wreorder
Wed, 08 Aug 2018 15:31:06 +0200 tschatzl 8208669: GC changes to allow enabling -Wreorder
Wed, 08 Aug 2018 10:21:23 +0800 xyin 8208279: Add 8 JNDI tests to com/sun/jndi/dns/EnvTests/jdk-12+6
Tue, 07 Aug 2018 19:35:50 -0400 coleenp 8208575: Remove Atomic::add/sub for short
Tue, 07 Aug 2018 15:45:07 -0700 iklam 8208999: Some use of Klass* should be replaced by InstanceKlass*
Tue, 07 Aug 2018 16:07:47 -0700 sherman 8208634: Add x-IBM-1129 charset
Tue, 07 Aug 2018 23:08:52 +0200 redestad 8209003: Consolidate use of empty collections in java.lang.module
Tue, 07 Aug 2018 13:51:30 -0700 iignatyev 8031761: [TESTBUG] Add a regression test for JDK-8026328
Tue, 07 Aug 2018 09:44:39 -0700 ccheung 8208704: runtime/appcds/MultiReleaseJars.java timed out often in hs-tier7 testing
Fri, 03 Aug 2018 07:59:01 +0200 mbaesken 8208744: remove unneeded -DUSE_MMAP settings for JDK native libs builds
Mon, 06 Aug 2018 18:49:51 -0700 kvn 8209023: fix 2 compiler tests to avoid JDK-8208690
Mon, 06 Aug 2018 20:52:41 -0400 dcubed 8209029: ProblemList tests that fail due to 'Error attaching to process: Can't create thread_db agent!' in jdk-11+25 testing
Mon, 06 Aug 2018 14:23:02 -0700 jcbeyler 8079682: [mlvm] remove SAM code in MHTransformationGen
Mon, 06 Aug 2018 15:35:44 -0700 shurailine 8208364: java/lang/reflect/callerCache/ReflectionCallerCacheTest.java missing module dependencies declaration
Mon, 06 Aug 2018 15:18:57 -0700 psandoz 8206955: MethodHandleProxies.asInterfaceInstance does not support default methods
Mon, 06 Aug 2018 14:55:04 -0700 fweimer 8208362: (bf) Long chains created by direct Buffer::slice
Mon, 06 Aug 2018 14:29:22 -0700 darcy 8209024: Use SuppressWarnings on serialVersionUID fields in interfaces
Mon, 06 Aug 2018 13:53:49 -0700 epavlova 8194958: [Graal] disable compiler/c2/cr7200264 tests
Mon, 06 Aug 2018 16:15:09 -0400 dcubed 8209020: ProblemList tests affected by JDK-8208778
Mon, 06 Aug 2018 14:20:58 -0400 hseigel 8208604: Metadata::print_value_string() compares 'this' to NULL
Mon, 06 Aug 2018 13:57:26 -0400 dcubed 8209018: ProblemList tests affected by JDK-8208690
Mon, 06 Aug 2018 04:31:50 -0400 dholmes 8208623: [TESTBUG] runtime/LoadClass/LongBCP.java fails in AUFS file system
Sun, 05 Aug 2018 19:16:31 +0100 alanb 8208998: Typo in ModueInfo.java, field for ModuleHashes should be moduleHashes
Fri, 03 Aug 2018 21:06:15 -0700 darcy 8208782: Remove extra type in throws clause of SerialClob.writeObject
Fri, 03 Aug 2018 12:45:18 -0700 bpb 8186766: UnixNativeDispatcher::readlink() may truncate overlong paths
Fri, 03 Aug 2018 09:42:57 -0700 prr Merge
Thu, 02 Aug 2018 09:26:40 -0700 prr Added tag jdk-11+25 for changeset 331888ea4a78
Thu, 02 Aug 2018 09:49:04 +0200 mgronlun 8207139: NMT is not enabled on Windows 2016/10
Tue, 31 Jul 2018 14:04:29 -0700 prr 8204931: Colors with alpha are painted incorrectly on Linuxjdk-11+25
Tue, 31 Jul 2018 14:03:39 -0700 prr 8208353: Upgrade JDK 11 to libpng 1.6.35
Tue, 31 Jul 2018 12:23:55 -0700 prr 8208466: Fix potential memory leak in harfbuzz shaping.
Tue, 31 Jul 2018 21:23:56 +0300 dsamersoff 8207046: arm32 vm crash: C1 arm32 platform functions parameters type mismatch
Tue, 31 Jul 2018 09:48:25 -0700 epavlova 8208347: ProblemList compiler/cpuflags/TestAESIntrinsicsOnSupportedConfig.java
Mon, 30 Jul 2018 14:22:36 -0400 dcubed 8208521: ProblemList more tests that fail due to 'Error attaching to process: Can't create thread_db agent!'
Fri, 27 Jul 2018 00:00:28 -0700 iignatyev 8208370: fix typo in ReservedStack tests' @requires
Thu, 26 Jul 2018 23:59:46 -0700 iignatyev 8208358: update bug ids mentioned in tests
Thu, 26 Jul 2018 15:56:37 -0400 hseigel 8207944: java.lang.ClassFormatError: Extra bytes at the end of class file test" possibly violation of JVMS 4.7.1
Thu, 26 Jul 2018 11:53:59 -0700 jcbeyler 8208251: serviceability/jvmti/HeapMonitor/MyPackage/HeapMonitorGCCMSTest.java fails intermittently on Linux-X64
Thu, 26 Jul 2018 10:23:33 -0700 epavlova 8195156: [Graal] serviceability/jvmti/GetModulesInfo/JvmtiGetAllModulesTest.java fails with Graal in Xcomp mode
Thu, 26 Jul 2018 13:08:42 -0400 dcubed 8208305: ProblemList compiler/jvmci/compilerToVM/GetFlagValueTest.java
Fri, 03 Aug 2018 14:14:59 +0100 coffeys 8208583: Better management of internal KeyStore buffers
Fri, 03 Aug 2018 11:06:10 +0200 zgu 8205921: Optimizing best-of-2 work stealing queue selection
Fri, 03 Aug 2018 09:57:10 +0100 coffeys 8207775: Better management of CipherCore buffers
Thu, 02 Aug 2018 22:14:54 -0400 dcubed 8208706: compiler/tiered/ConstantGettersTransitionsTest.java fails to compile
Thu, 02 Aug 2018 16:16:02 -0700 iignatyev 8208701: Fix for JDK-8208655 causes test failures in CI tier1
Thu, 02 Aug 2018 16:15:48 -0700 iignatyev 8208699: remove unneeded imports from runtime tests
Thu, 02 Aug 2018 14:40:55 -0700 iignatyev 8208655: use JTreg skipped status in hotspot tests
Thu, 02 Aug 2018 09:27:40 -0700 prr Added tag jdk-12+5 for changeset f8696e0ab9b7
Thu, 02 Aug 2018 11:13:00 -0400 zgu 8208635: Minimal VM build is broken after JDK-8199868 (Support JNI critical functions in object pinning API)
Tue, 31 Jul 2018 10:16:56 -0700 jcbeyler 8208249: TriggerUnloadingByFillingMetaspace generates garbage class names
Tue, 31 Jul 2018 12:24:47 -0700 jcbeyler 8169004: Fix redundant @requires tags in tests
Wed, 01 Aug 2018 09:23:24 -0700 jcbeyler 8069343: Improve gc/g1/TestHumongousCodeCacheRoots.java to use jtreg @requires
Tue, 31 Jul 2018 10:20:10 -0700 jcbeyler 8208246: flags duplications in vmTestbase_vm_g1classunloading tests
Wed, 01 Aug 2018 23:06:33 -0700 iignatyev 8208647: switch jtreg to 4.2b13
Wed, 01 Aug 2018 19:07:27 -0700 mseledtsov 8185531: [TESTBUG] Improve test configuration for shared strings
Wed, 01 Aug 2018 19:14:04 -0400 kbarrett 8208611: Refactor SATBMarkQueue filtering to allow GC-specific filters
Wed, 01 Aug 2018 10:04:08 -0700 iignatyev 8174691: [TESTBUG] A number of native hotspot unit tests fail when executed in stand-alone mode
Wed, 01 Aug 2018 09:33:56 -0700 naoto 8208080: Locale extensions via Service provider is not working for region extensions
Wed, 01 Aug 2018 18:02:25 +0530 nishjain 8208560: ChoiceFormat class has unused constants needs cleanup
Wed, 01 Aug 2018 12:36:02 +0530 pmuthuswamy 8208484: color contrast issues in a couple of spec files
Wed, 01 Aug 2018 02:21:02 -0400 dbuck 8191006: hsdis disassembler plugin does not compile with binutils 2.29+
Wed, 01 Aug 2018 13:35:08 +0800 weijun 8208602: Cannot read PEM X.509 cert if there is whitespace after the header or footer
Wed, 01 Aug 2018 01:40:44 -0400 dbuck 8208541: non-ASCII characters in hsdis UPL text
Tue, 31 Jul 2018 17:07:43 -0400 dcubed 8208605: Fix for 8199868 breaks tier1 build
Tue, 31 Jul 2018 15:57:52 -0400 coleenp 8208074: [TESTBUG] vmTestbase/nsk/jvmti/RedefineClasses/StressRedefineWithoutBytecodeCorruption/TestDescription.java failed with NullPointerException
Tue, 31 Jul 2018 14:24:10 -0400 hseigel 8202171: Some oopDesc functions compare this with NULL
Tue, 31 Jul 2018 13:12:06 -0400 zgu 8199868: Support JNI critical functions in object pinning API
Thu, 02 Aug 2018 14:44:58 -0700 mikael Merge
Tue, 31 Jul 2018 16:49:51 +0100 mcimadamore 8208524: IntelliJ support broken since 2018.2jdk-12+5
Tue, 31 Jul 2018 09:55:09 -0400 hseigel 8208399: Metadata methods print_(value_)on_maybe_null() compare 'this' to NULL
Tue, 31 Jul 2018 07:35:16 -0400 zgu 8208499: NMT: Missing memory tag for Safepoint polling page
Mon, 30 Jul 2018 16:35:54 -0400 hseigel 8207779: Method::is_valid_method() compares 'this' with NULL
Mon, 30 Jul 2018 14:08:30 -0400 mvala 8208084: Windows build failure - "'snprintf': identifier not found"
Mon, 30 Jul 2018 14:22:36 -0400 dcubed 8208521: ProblemList more tests that fail due to 'Error attaching to process: Can't create thread_db agent!'
Mon, 30 Jul 2018 11:52:05 +0530 pmuthuswamy 8203791: Remove "compatibility" features from Table.java
Mon, 30 Jul 2018 09:06:14 +0800 xyin 8208363: test/jdk/java/lang/Package/PackageFromManifest.java missing module dependencies declaration
Fri, 27 Jul 2018 16:29:36 -0400 dcubed 8171157: Convert ObjectMonitor_test to GTest
Fri, 27 Jul 2018 14:20:07 +0530 nishjain 8021322: [Fmt-Ch] Implementation of ChoiceFormat math methods should delegate to java.lang.Math methods
Fri, 27 Jul 2018 09:49:03 +0200 tschatzl 8208297: Allow printing of taskqueue stats if compiled in in product builds
Thu, 26 Jul 2018 16:22:58 -0700 dtitov 8207364: nsk/jvmti/ResourceExhausted/resexhausted003 fails to start
Thu, 26 Jul 2018 11:53:59 -0700 jcbeyler 8208251: serviceability/jvmti/HeapMonitor/MyPackage/HeapMonitorGCCMSTest.java fails intermittently on Linux-X64
Thu, 26 Jul 2018 11:31:15 -0700 amenkov 8199155: Accessibility issues in jdk.jdi
Thu, 26 Jul 2018 13:08:42 -0400 dcubed 8208305: ProblemList compiler/jvmci/compilerToVM/GetFlagValueTest.java
Thu, 26 Jul 2018 10:00:40 -0700 prr Merge
Thu, 26 Jul 2018 09:27:30 -0700 prr Added tag jdk-11+24 for changeset ea900a7dc7d7
Thu, 26 Jul 2018 10:25:33 -0300 jlaskey 8208164: (str) improve specification of String::lines
Mon, 23 Jul 2018 15:17:14 +0200 simonis 8205608: Fix 'frames()' in ThreadReferenceImpl.c to prevent quadratic runtime behavior
Thu, 26 Jul 2018 14:15:24 +0530 rgoel 8206965: java/util/TimeZone/Bug8149452.java failed on de_DE and ja_JP locale.
Wed, 25 Jul 2018 22:48:53 -0700 ljiang 8207948: JDK 11 L10n resource file update msg drop 10
Thu, 26 Jul 2018 08:46:27 +0800 jjiang 8206258: [Test Error] sun/security/pkcs11 tests fail if NSS libs not found
Wed, 25 Jul 2018 17:21:04 -0700 xuelei 8208166: Still unable to use custom SSLEngine with default TrustManagerFactory after JDK-8207029
Wed, 25 Jul 2018 17:22:25 -0400 dcubed 8208226: ProblemList com/sun/jdi/BasicJDWPConnectionTest.java
Wed, 25 Jul 2018 13:15:36 -0700 cjplummer 8151259: [TESTBUG] nsk/jvmti/RedefineClasses/redefclass030 fails with "unexpected values of outer fields of the class" when running with -Xcomp
Wed, 25 Jul 2018 15:38:37 -0400 dcubed 8208205: ProblemList tests that fail due to 'Error attaching to process: Can't create thread_db agent!'
Wed, 25 Jul 2018 10:51:16 -0700 jcbeyler 8207765: HeapMonitorTest.java intermittent failure
Wed, 25 Jul 2018 09:48:31 -0700 jnimeh 8207237: SSLSocket#setEnabledCipherSuites is accepting empty string
Wed, 25 Jul 2018 12:32:06 -0400 dcubed 8208189: ProblemList compiler/graalunit/JttThreadsTest.java
Wed, 25 Jul 2018 08:36:46 -0700 erikj 8208096: Update build documentation to reflect compiler upgrades at Oraclejdk-11+24
Wed, 25 Jul 2018 10:08:39 +0100 chegar 8207846: Generalize the jdk.net.includeInExceptions security property
Tue, 24 Jul 2018 12:12:16 -0700 rhalade 8203230: update VerifyCACerts test
Tue, 24 Jul 2018 10:35:25 -0700 cjplummer 8208075: Quarantine vmTestbase/nsk/jvmti/RedefineClasses/StressRedefineWithoutBytecodeCorruption/TestDescription.java
Tue, 24 Jul 2018 12:57:40 +0200 ghaug 8207392: [PPC64] Implement JFR profiling.
Tue, 24 Jul 2018 10:07:26 +0100 chegar 8207960: Non-negative WINDOW_UPDATE increments may leave the stream window size negative
Mon, 23 Jul 2018 11:47:03 +0100 chegar 8207959: The initial value of SETTINGS_MAX_CONCURRENT_STREAMS should have no limit
Tue, 24 Jul 2018 13:55:57 +0800 mli 8208111: Problem list java/nio/channels/Selector/RacyDeregister.java
Mon, 23 Jul 2018 23:18:19 +0000 valeriep 8206171: Signature#getParameters for RSASSA-PSS throws ProviderException when not initialized
Mon, 23 Jul 2018 12:01:43 -0700 dlong 8207383: [Graal] SelfChangedCDS.java fails with "guarantee(disp == (intptr_t)(jint)disp) failed: must be 32-bit offset"
Mon, 23 Jul 2018 14:41:06 -0400 dcubed 8208092: ProblemList serviceability/sa/ClhsdbCDSCore.java
Mon, 23 Jul 2018 19:58:43 +0530 sdama 8206445: JImageListTest.java failed in Windows
Thu, 19 Jul 2018 16:56:05 -0400 gromero 8189922: UseNUMA memory interleaving vs membind
Sun, 22 Jul 2018 20:00:39 -0700 jcbeyler 8207252: C1 still does eden allocations when TLAB is enabled
Mon, 23 Jul 2018 10:02:10 +0800 xiaofeya 8207952: Problem-list 3 sctp tests
Sat, 21 Jul 2018 21:46:42 +0800 weijun 8207223: SSL Handshake failures are reported with more generic SSLException
Fri, 20 Jul 2018 18:03:23 -0400 coleenp 8203820: [TESTBUG] vmTestbase/metaspace/staticReferences/StaticReferences.java timed out
Fri, 20 Jul 2018 14:34:51 -0700 smarks 8206865: RMI activation tests fail with InvalidClassException
Fri, 20 Jul 2018 11:39:52 -0700 epavlova 8206241: compiler/graalunit/PhasesCommonTest.java fails with java.lang.Error: TESTBUG: no tests found for prefix org.graalvm.compiler.phases.common.test
Fri, 20 Jul 2018 11:39:37 -0700 iignatyev 8207915: [AOT] jaotc w/ '--ignore-errors' should ignore illegal class files
Fri, 20 Jul 2018 10:12:34 -0700 naoto 8206886: Java does not set the default format locale correctly on mac10.13
Fri, 20 Jul 2018 09:55:15 -0700 ascarpino 8204196: integer cleanup
Fri, 20 Jul 2018 09:07:37 -0700 erikj 8207365: Make man pages optional
Fri, 20 Jul 2018 09:46:57 +0200 goetz 8207830: [aix] disable jfr in build and tests
Fri, 20 Jul 2018 09:33:49 +0200 goetz 8207766: [testbug] Adapt tests for Aix.
Fri, 20 Jul 2018 01:23:38 -0700 rraghavan 8203504: [Graal] org.graalvm.compiler.debug.test.DebugContextTest fails with java.util.ServiceConfigurationError
Fri, 20 Jul 2018 15:24:42 +0800 mli 8207833: java/nio/channels/Selector/SelectWithConsumer.java testCancel() fails intermittently
Thu, 19 Jul 2018 18:21:24 -0700 jcbeyler 8207765: HeapMonitorStatIntervalTest.java fails with ZGC
Fri, 20 Jul 2018 08:40:14 +0800 mli 8207244: java/nio/channels/Selector/SelectWithConsumer.java testInterruptDuringSelect() fails intermittently
Wed, 11 Jul 2018 13:55:38 -0400 zgu 8207056: Epsilon GC to support object pinning
Thu, 19 Jul 2018 14:25:42 -0700 erikj 8207243: Fix translation filtering to also support zh_HK and zh_TW
Thu, 19 Jul 2018 13:41:56 -0700 kvn 8207069: [AOT] we should check that VM uses the same GC as one used for AOT library generation.
Thu, 19 Jul 2018 21:46:52 +0300 bulasevich 8207584: ARM32: ShouldNotReachHere assertion on Test8168712 jtreg test
Thu, 26 Jul 2018 09:30:58 -0700 prr Added tag jdk-12+4 for changeset 499b873761d8
Fri, 27 Jul 2018 00:54:39 +0900 ysuenaga 8205992: jhsdb cannot attach to Java processes running in Docker containers
Thu, 26 Jul 2018 10:56:58 -0400 dbuck 8208183: update HSDIS plugin license to UPL
Wed, 25 Jul 2018 17:26:35 -0700 jjg 8208227: tools/jdeps/DotFileTest.java fails on Win-X64
Wed, 25 Jul 2018 17:22:26 -0700 darcy 8208200: Add missing periods to sentences in RoundEnvironment specs
Wed, 25 Jul 2018 17:22:25 -0400 dcubed 8208226: ProblemList com/sun/jdi/BasicJDWPConnectionTest.java
Wed, 25 Jul 2018 12:54:58 -0700 darcy 8208201: Update SourceVersion.RELEASE_11 docs to mention var for lambda param
Wed, 25 Jul 2018 21:47:40 +0200 rkennke 8204970: Remaing object comparisons need to use oopDesc::equals()
Wed, 25 Jul 2018 15:38:37 -0400 dcubed 8208205: ProblemList tests that fail due to 'Error attaching to process: Can't create thread_db agent!'
Wed, 25 Jul 2018 10:51:16 -0700 jcbeyler 8207765: HeapMonitorTest.java intermittent failure
Wed, 25 Jul 2018 12:32:59 -0700 darcy 8190886: package-info handling in RoundEnvironment.getElementsAnnotatedWith
Wed, 25 Jul 2018 12:32:06 -0400 dcubed 8208189: ProblemList compiler/graalunit/JttThreadsTest.java
Wed, 25 Jul 2018 11:03:07 +0800 xyin 8198882: Add 10 JNDI tests to com/sun/jndi/dns/AttributeTests/jdk-12+4
Tue, 24 Jul 2018 08:58:32 -0700 shurailine 8208157: requires.VMProps throws NPE for missing properties in "release" file
Tue, 24 Jul 2018 11:37:43 -0700 jjg 8207214: Broken links in JDK API serialized-form page
Tue, 24 Jul 2018 09:27:42 +0200 mbaesken 8207941: javax/swing/plaf/basic/BasicGraphicsUtils/8132119/bug8132119.java fails on machines without Arial font [testbug]
Thu, 19 Jul 2018 11:04:46 +0200 mbaesken 8207395: jar has issues with UNC-path arguments for the jar -C parameter [windows]
Mon, 23 Jul 2018 22:07:55 -0700 igerasim 8207314: Unnecessary reallocation when constructing WeakHashMap from a large Map
Mon, 23 Jul 2018 18:29:35 -0700 kvn 8207262: enable applications/ctw/modules/java_desktop_2.java test again
Mon, 23 Jul 2018 14:41:06 -0400 dcubed 8208092: ProblemList serviceability/sa/ClhsdbCDSCore.java
Mon, 23 Jul 2018 11:38:28 -0400 tonyp 8207849: Allow the addition of more number to the Java version string
Mon, 23 Jul 2018 17:32:04 +0200 tschatzl 8207953: Remove dead code in G1CopyingKeepAliveClosure
Fri, 20 Jul 2018 14:48:41 -0700 vromero 8205493: OptionSmokeTest.java uses hard-coded release values
Fri, 20 Jul 2018 14:46:43 -0700 darcy 8208060: Additional corrections of serial-related declarations
Fri, 20 Jul 2018 12:19:28 -0700 iklam 8203382: Rename SystemDictionary::initialize_wk_klass to resolve_wk_klass
Fri, 20 Jul 2018 14:52:11 -0400 coleenp 8207359: Make SymbolTable increment_refcount disallow zero
Fri, 20 Jul 2018 11:55:05 -0700 kvn 8206075: On x86, assert on unbound assembler Labels used as branch targets
Wed, 18 Jul 2018 00:23:06 -0700 darcy 8193462: Fix Filer handling of package-info initial elements
Wed, 18 Jul 2018 00:16:37 -0700 darcy 8193214: Incorrect annotations.without.processors warnings with JDK 9
Thu, 19 Jul 2018 18:21:24 -0700 jcbeyler 8207765: HeapMonitorStatIntervalTest.java fails with ZGC
Fri, 20 Jul 2018 09:15:54 -0400 ctornqvi 8207855: Make applications/jcstress invoke tests in batches
Thu, 19 Jul 2018 16:53:33 -0700 dtitov 8204695: [Graal] vmTestbase/nsk/jdi/ClassPrepareRequest/addSourceNameFilter/addSourceNameFilter002/addSourceNameFilter002.java fails
Thu, 19 Jul 2018 15:13:10 -0700 vromero 8206874: Evaluate LoadClassFromJava6CreatedJarTest.java after dropping -source 6
Thu, 19 Jul 2018 13:41:26 -0700 igerasim 8207753: Handle to process snapshot is leaked if Process32First() fails
Thu, 19 Jul 2018 12:55:24 -0700 never 8207202: [Graal] compiler/graalunit/CoreTest.java fails
Thu, 19 Jul 2018 11:15:38 -0700 naoto 8206886: Java does not set the default format locale correctly on mac10.13
Thu, 19 Jul 2018 10:53:38 -0700 prr Merge
Thu, 19 Jul 2018 13:49:44 +0530 kaddepalli 8206343: There is a typo in the java documentation of javax.swing.JScrollBar.
Thu, 12 Jul 2018 11:09:23 -0700 prr Merge
Tue, 03 Jul 2018 16:09:25 +0530 sveerabhadra 8195991: [TEST_BUG]:Regression manual Test java/awt/TrayIcon/RightClickWhenBalloonDisplayed/RightClickWhenBalloonDisplayed.html fails
Mon, 02 Jul 2018 14:31:33 +0530 kaddepalli 8197810: Test java/awt/Choice/SelectCurrentItemTest/SelectCurrentItemTest.html fails on Windows
Thu, 19 Jul 2018 10:17:22 -0700 prr Merge
Thu, 19 Jul 2018 12:57:12 -0400 bobv 8206456: [TESTBUG] docker jtreg tests fail on systems without cpuset.effective_cpus / cpuset.effective_mem
Thu, 19 Jul 2018 09:42:15 -0700 prr Added tag jdk-11+23 for changeset 1edcf36fe15f
Wed, 18 Jul 2018 20:54:12 -0700 sspitsyn 8207819: Problem list serviceability/jvmti/HeapMonitor/MyPackage/HeapMonitorStatRateTest.java
Thu, 19 Jul 2018 10:30:24 +0800 amlu 8207818: Problem list several rmi tests
Fri, 22 Jun 2018 17:08:00 -0700 smarks 8205491: adjust reflective access checks
Thu, 07 Jun 2018 18:21:29 +0530 vtewari 8200666: Improve LDAP support
Thu, 31 May 2018 11:31:20 -0700 smarks 8197925: Better stack walking
Mon, 09 Apr 2018 14:10:56 -0400 apetcher 8200332: Improve GCM counting
Thu, 15 Mar 2018 16:04:30 -0700 sherman 8199547: Exception to Pattern Syntax
Mon, 05 Feb 2018 14:18:22 -0800 igerasim 8196224: Even better Internet address support
Wed, 31 Jan 2018 18:13:13 -0800 serb 8191239: Improve desktop file usage
Thu, 18 Jan 2018 13:55:26 +0530 vtewari 8193419: Better Internet address support
Wed, 18 Jul 2018 14:44:04 -0700 epavlova 8207761: Split compiler/graalunit/JttReflectFTest.java
Sun, 24 Jun 2018 17:11:17 -0400 gromero 8205578: jtreg: Fix failing TestRTMAbortRatio on PPC64
Sat, 23 Jun 2018 18:02:46 -0400 gromero 8205390: jtreg: Fix failing TestRTMSpinLoopCount on PPC64
Fri, 06 Jul 2018 16:25:07 -0400 gromero 8205582: PPC64: RTM: Fix counter for aborts on nested transactions
Tue, 26 Jun 2018 08:33:17 -0400 gromero 8205581: PPC64: RTM: Fix abort on native calls
Sun, 24 Jun 2018 21:48:42 -0400 gromero 8205580: PPC64: RTM: Don't retry lock on abort if abort was intentional
Wed, 18 Jul 2018 13:24:25 -0700 epavlova 8207380: compiler/graalunit/JttLangMTest.java timeout
Wed, 11 Jul 2018 08:44:00 +0200 shade 8206931: Misleading "COMPILE SKIPPED: invalid non-klass dependency" compile log
Thu, 19 Jul 2018 00:14:40 +0800 weijun 8202837: PBES2 AlgorithmId encoding error in PKCS12 KeyStore
Thu, 19 Jul 2018 00:14:29 +0800 weijun 8207250: setUseClientMode post handshake with the same value as before does not throw IAE
Wed, 18 Jul 2018 11:57:51 -0400 jcbeyler 8207763: serviceability/jvmti/HeapMonitor/MyPackage/HeapMonitorStatRateTest.java failed with Error. Parse Exception: Can't find source file: HeapMonitorStatIntervalTest.javajdk-11+23
Wed, 18 Jul 2018 11:27:14 +0200 mdoerr 8207342: error occurred during error reporting (printing register info)
Tue, 17 Jul 2018 19:59:38 -0700 jcbeyler 8205725: Update the JVMTI Spec for Heap Sampling
Tue, 17 Jul 2018 17:52:03 -0700 jcbeyler 8205652: serviceability/jvmti/HeapMonitor/MyPackage/HeapMonitorStatRateTest.java fails
Tue, 17 Jul 2018 15:09:27 -0700 jcbeyler 8205541: serviceability/jvmti/HeapMonitor/MyPackage/HeapMonitorStatArrayCorrectnessTest.java fails with Should not have any events stored yet.
Tue, 17 Jul 2018 11:20:16 -0700 dtitov 8207261: [Graal] JDI and JDWP tests that consume all memory should be filtered out to not run with Graal
Tue, 17 Jul 2018 13:04:40 -0400 apetcher 8206929: Check session context for TLS 1.3 session resumption
Tue, 17 Jul 2018 19:25:45 +0300 dpochepk 8207240: AARCH64: C2-only VM does not build
Tue, 17 Jul 2018 15:28:17 +0100 aph 8207345: AArch64: Trampoline generation code reads from unitialized memory
Tue, 17 Jul 2018 22:22:00 +0800 weijun 8207318: KeyStore#getInstance(File, LoadStoreParameter) does not load the keystore
Tue, 17 Jul 2018 09:37:24 -0400 coleenp Merge
Tue, 10 Jul 2018 11:13:33 -0400 coleenp 8206471: Race with ConcurrentHashTable deleting items on insert with cleanup thread
Tue, 17 Jul 2018 12:22:41 +0100 chegar 8207265: Bad HTML in {@link} in HttpResponse.BodySubscribers.ofPublisher
Tue, 17 Jul 2018 16:49:55 +0530 pmuthuswamy 8207190: JDK 11 javadoc generates bad code example
Mon, 16 Jul 2018 15:09:19 -0700 dlong 8181855: [Graal] runtime/ReservedStack/ReservedStackTest.java triggers: assert(thread->deopt_mark() == __null) failed: no stack overflow from deopt blob/uncommon trap
Mon, 16 Jul 2018 10:58:28 -0700 bpb 8206448: (fs) Extended attributes assumed to be enabled on ext3 (lnx)
Mon, 16 Jul 2018 16:57:37 +0200 lucy 8206271: CodeHeap State Analytics must digest new method state
Mon, 16 Jul 2018 16:31:33 +0200 jlahoda 8207032: Compilation succeeds without checking readability when --add-exports used
Mon, 16 Jul 2018 12:58:49 +0200 jlahoda 8189747: JDK9 javax.lang.model.util.Elements#getTypeElement regressed 1000x in performance.
Sun, 15 Jul 2018 20:15:17 +0300 dsamersoff 8206265: aarch64 jtreg: assert in TestOptionsWithRanges.jtr
Fri, 13 Jul 2018 17:42:24 +0200 goetz 8207233: Minor improvements of jdk C-coding
Thu, 19 Jul 2018 09:46:29 -0700 prr Added tag jdk-12+3 for changeset 990db216e719
Thu, 19 Jul 2018 09:20:08 -0700 darcy 8207816: Align declaration of SerializedLambda.readResolve with serialization conventions
Thu, 19 Jul 2018 16:22:19 +0800 mli 8207316: java/nio/channels/spi/SelectorProvider/inheritedChannel/InheritedChannelTest.java failed
Wed, 18 Jul 2018 16:13:21 -0700 darcy 8203263: Remove unnecessary throws clauses from serialization-related methods
Wed, 18 Jul 2018 14:32:46 -0700 jnimeh 8207237: SSLSocket#setEnabledCipherSuites is accepting empty string
Wed, 18 Jul 2018 09:50:04 -0700 rhalade 8203230: update VerifyCACerts testjdk-12+3
Wed, 18 Jul 2018 08:27:53 -0700 darcy 8207751: Remove misleading serialVersionUID from JulienFields.Field
Wed, 18 Jul 2018 09:46:03 -0400 rriggs 8189717: Too much documentation of ProcessBuilder.start copied to ProcessBuilder.startPipeline
Wed, 18 Jul 2018 07:39:54 +0100 alanb 8207393: ServiceLoader class description improvements
Tue, 17 Jul 2018 17:36:27 -0700 martin 8206863: A closed JarVerifier.VerifierStream should throw IOException
Tue, 17 Jul 2018 17:17:16 -0700 igerasim 8207750: Native handle leak in java.io.WinNTFileSystem.list()
Tue, 17 Jul 2018 16:22:26 -0700 bpb 8207748: Fix for 8202794 breaks tier1 builds
Tue, 17 Jul 2018 17:14:03 -0400 rriggs 8205610: [TESTLIB] Improve listing of open file descriptors
Tue, 17 Jul 2018 15:59:47 -0400 kbarrett 8202353: os::readdir should use readdir instead of readdir_r
Tue, 17 Jul 2018 12:03:10 -0700 bpb 8202794: Native Unix code should use readdir rather than readdir_r
Tue, 17 Jul 2018 11:58:53 -0700 ccheung 8204591: Expire/remove the UseAppCDS option in JDK 12
Tue, 17 Jul 2018 14:28:56 +0200 jlahoda 8207229: Trees.getScope crashes for broken lambda
Tue, 17 Jul 2018 08:10:48 +0100 alanb 8207340: (fs) UnixNativeDispatcher close and readdir usages should be fixed
Mon, 16 Jul 2018 21:53:49 -0700 darcy 8207248: Reduce incidence of compiler.warn.source.no.bootclasspath in javac tests
Mon, 16 Jul 2018 10:58:28 -0700 bpb 8206448: (fs) Extended attributes assumed to be enabled on ext3 (lnx)
Mon, 16 Jul 2018 10:07:22 -0700 igerasim 8207016: Avoid redundant native memory allocation in getFinalPath()
Mon, 16 Jul 2018 08:59:39 -0700 rhalade 8207321: Merge error with 8199779
Mon, 16 Jul 2018 11:34:17 -0400 lfoltan 8205611: Improve the wording of LinkageErrors to include module and class loader information
Mon, 16 Jul 2018 09:06:33 -0400 lfoltan 8178712: ResourceMark may be missing inside initialize_[vi]table
Thu, 12 Jul 2018 16:28:31 +0200 sgehwolf 8207057: No debug info for assembler files
Mon, 16 Jul 2018 12:35:25 +0200 jlahoda 8189747: JDK9 javax.lang.model.util.Elements#getTypeElement regressed 1000x in performance.
Sun, 15 Jul 2018 18:16:55 +0300 dsamersoff 8206265: aarch64 jtreg: assert in TestOptionsWithRanges.jtr
Sat, 14 Jul 2018 02:14:54 +0200 jwilhelm Merge
Fri, 13 Jul 2018 13:00:36 -0700 jjg 8207213: The help-doc.html generated by the doclet is incomplete
Fri, 13 Jul 2018 11:13:34 -0700 kvn 8207065: Cleanup compiler tests for Client VM
Fri, 13 Jul 2018 09:48:52 -0700 rhalade 8199779: Add T-Systems, GlobalSign and Starfield services root certificates
Fri, 13 Jul 2018 18:39:11 +0200 redestad 8207235: ManagementFactory.getPlatformMXBeans(BufferPoolMXBean.class) throws NPE
Thu, 12 Jul 2018 22:53:35 -0700 dtitov 8191948: db error: InvalidTypeException: Can't assign double[][][] to double[][][]
Fri, 13 Jul 2018 10:42:30 -0400 apetcher 8206915: XDH TCK issues
Fri, 13 Jul 2018 15:44:54 +0200 roland 8200282: Serializing non-zero byte as zero to ByteBuffer
Fri, 13 Jul 2018 07:08:59 -0700 xuelei 8207029: Unable to use custom SSLEngine with default TrustManagerFactory after updating to JDK 11 b21
Fri, 13 Jul 2018 07:01:51 -0700 bulasevich 8207047: Multiple VM variants build fail
Fri, 13 Jul 2018 11:07:43 +0200 simonis 8206998: [test] runtime/ElfDecoder/TestElfDirectRead.java requires longer timeout on ppc64
Wed, 11 Jul 2018 19:23:27 +0200 simonis 8207067: [test] prevent timeouts in serviceability/tmtools/jstat/{GcTest02,GcCauseTest02}.java
Wed, 11 Jul 2018 15:00:33 +0800 zyao 8206975: AArch64: Fix CompareAndSwapOp when useLSE is enabled in Graal
Fri, 13 Jul 2018 01:31:23 -0700 rraghavan 8206873: 2 Null pointer dereference defect groups in LIRGenerator
Thu, 12 Jul 2018 16:31:28 +0200 goetz 8207049: Minor improvements of compiler code.
Fri, 13 Jul 2018 11:21:55 +0800 xiaofeya 8202481: RegisterDuringSelect.java fails with java.util.concurrent.ExecutionException: java.nio.channels.ClosedSelectorException
Thu, 12 Jul 2018 17:32:37 -0700 mikael 8207217: Problem list java/lang/management/ThreadMXBean/AllThreadIds.java
Thu, 12 Jul 2018 15:02:41 -0700 mikael 8207210: Problem list javax/sound/sampled/Clip/AutoCloseTimeCheck.java
Thu, 12 Jul 2018 12:00:52 -0700 jcbeyler 8206960: HeapMonitor tests fail with Graal
Thu, 12 Jul 2018 11:57:06 -0700 kvn 8206953: compiler/profiling/TestTypeProfiling.java fails when JVMCI build disabled
Thu, 12 Jul 2018 11:24:10 -0700 naoto 8207152: Placeholder for Japanese new era should be two characters
Wed, 11 Jul 2018 15:35:47 -0700 psandoz 8207027: Lookup.accessClass fails for an array type in the same package when assertions are enabled
Wed, 11 Jul 2018 16:11:10 +0200 goetz 8206977: Minor improvements of runtime code.
Thu, 12 Jul 2018 16:30:47 +0200 erikj 8207001: *.obj.log files get truncated causing unreliable incremental builds on Windows
Thu, 12 Jul 2018 07:14:30 -0700 erikj 8206903: Unable to build Client VM with JVMCI
Thu, 12 Jul 2018 17:34:36 +0530 kaddepalli 8206238: Aspect ratio is not maintained when Image is scaled in JEditorPane
Thu, 12 Jul 2018 13:40:20 +0200 jwilhelm Added tag jdk-11+22 for changeset 9937ef7499dc
Thu, 12 Jul 2018 15:17:18 +0530 mhalder 8204860: The frame could be resized by dragging a corner of the frame with the mouse
Thu, 12 Jul 2018 09:13:55 +0200 shade 8207006: serviceability/sa/TestUniverse.java#id0 crashes with EpsilonGC and AOT
Thu, 12 Jul 2018 08:44:39 +0800 weijun 8206189: sun/security/pkcs12/EmptyPassword.java fails with Sequence tag error
Wed, 11 Jul 2018 14:54:35 -0700 rhalade 8207068: Add Entrust root certificates
Wed, 11 Jul 2018 14:47:43 -0700 naoto 8206980: ZonedDateTime could not parse timezone name with zh_CN locale correctly.
Tue, 10 Jul 2018 15:29:25 -0700 jcbeyler 8205643: HeapMonitorGCCMSTest fails with Graal
Thu, 12 Jul 2018 15:02:41 -0700 mikael 8207210: Problem list javax/sound/sampled/Clip/AutoCloseTimeCheck.java
Sat, 14 Jul 2018 07:31:26 +0800 jjiang 8206443: Update security libs manual test to cope with removal of javac -source/-target 6
Fri, 13 Jul 2018 13:58:17 -0400 coleenp 8206470: Incorrect use of os::lasterror in ClassListParser
Sun, 03 Jun 2018 23:33:00 -0700 iklam 8204267: Generate comments in -XX:+PrintInterpreter to link to source code
Fri, 13 Jul 2018 10:10:51 -0700 amenkov 8201513: nsk/jvmti/IterateThroughHeap/filter-* are broken
Fri, 13 Jul 2018 14:04:59 +0530 nishjain 8193444: SimpleDateFormat throws ArrayIndexOutOfBoundsException when format contains long sequences of unicode characters
Thu, 12 Jul 2018 22:53:35 -0700 dtitov 8191948: db error: InvalidTypeException: Can't assign double[][][] to double[][][]
Fri, 13 Jul 2018 02:36:42 +0000 valeriep 8179098: Crypto AES/ECB encryption/decryption performance regression (introduced in jdk9b73)
Thu, 12 Jul 2018 08:44:39 +0800 weijun 8206189: sun/security/pkcs12/EmptyPassword.java fails with Sequence tag error
Thu, 12 Jul 2018 17:29:48 -0700 mikael 8207011: Remove uses of the register storage class specifier
Thu, 12 Jul 2018 10:41:44 -0400 gadams 8206007: nsk/jdb/exclude001 test is taking a long time on some builds
Thu, 12 Jul 2018 13:32:45 -0700 lmesnik 8139876: Exclude hanging nsk/stress/stack from execution with deoptimization enabled
Thu, 12 Jul 2018 14:13:15 -0700 darcy 8028563: Remove javac support for 6/1.6 source and target values
Thu, 12 Jul 2018 12:06:22 -0700 joehw 8194680: StartElement#getAttributes and getNamespaces refer to incorrect package
Thu, 12 Jul 2018 11:32:14 -0700 igerasim 8206122: Use Queue in place of ArrayList when need to remove first element
Thu, 12 Jul 2018 11:18:01 -0700 igerasim 8207060: Memory leak when malloc fails within WITH_UNICODE_STRING block
Thu, 12 Jul 2018 06:04:57 -0700 igerasim 8207145: (fs) Native memory leak in WindowsNativeDispatcher.LookupPrivilegeValue0
Wed, 11 Jul 2018 13:55:38 -0400 zgu 8207056: Epsilon GC to support object pinning
Thu, 12 Jul 2018 12:22:54 +0200 jwilhelm Added tag jdk-12+2 for changeset 69b438908512
Wed, 11 Jul 2018 16:12:18 -0700 darcy 8207055: Make javac -help output for -source and -target more informative
Wed, 11 Jul 2018 14:32:42 -0700 bchristi 8207005: Disable the file canonicalization cache by default
Wed, 11 Jul 2018 21:41:43 +0200 jwilhelm Merge
Wed, 11 Jul 2018 15:08:44 -0400 bulasevich 8207044: minimal vm build fail: missing #include
Wed, 11 Jul 2018 11:17:09 -0700 rhalade 8205967: Remove sun/security/krb5/auto/UnboundSSL.java from ProblemList.txt
Tue, 10 Jul 2018 10:24:08 -0700 dl 8205576: forkjoin/FJExceptionTableLeak.java fails "AssertionError: failed to satisfy condition"
Tue, 10 Jul 2018 11:36:36 +0200 ghaug 8206919: s390: add missing info to vm_version_ext_s390jdk-11+22
Wed, 11 Jul 2018 13:41:25 +0300 serb 8202264: Race condition in AudioClip.loop()
Wed, 11 Jul 2018 13:17:48 +0300 serb 8205973: Client jtreg ProblemList cleanup
Wed, 11 Jul 2018 10:39:58 +0800 jjiang 8199645: javax/net/ssl/SSLSession/TestEnabledProtocols.java failed with Connection reset
Tue, 10 Jul 2018 19:42:48 -0700 kvn 8206135: Building jvm with AOT but without JVMCI should fail at configure time
Tue, 10 Jul 2018 16:14:48 -0700 mikael 8207007: Add missing license header to zHash.inline.hpp
Tue, 10 Jul 2018 13:54:17 -0700 epavlova 8206951: [Graal] org.graalvm.compiler.hotspot.test.GraalOSRTest to ProblemList-graal.txt
Tue, 10 Jul 2018 13:34:32 -0400 kbarrett 8204691: HeapRegion.apply_to_marked_objects_other_vm_test fails with assert(!hr->is_free() || hr->is_empty()) failed: Free region 0 is not empty for set Free list #
Tue, 10 Jul 2018 15:33:55 +0200 thartmann 8205472: Deadlock in Kitchensink when trying to print compile queues causing timeout
Tue, 10 Jul 2018 15:09:34 +0200 tschatzl 8206476: Wrong assert in phase_enum_2_phase_string() in referenceProcessorPhaseTimes.cpp
Fri, 29 Jun 2018 17:59:44 +0200 roland 8202123: C2 Crash in Node::in(unsigned int) const+0x14
Tue, 10 Jul 2018 03:14:55 -0400 dholmes 8206954: Test runtime/Thread/ThreadPriorities.java crashes with SEGV in pthread_getcpuclockid
Mon, 09 Jul 2018 22:20:02 -0700 kvn 8206952: java/lang/Class/GetPackageBootLoaderChildLayer.java fails with Graal
Tue, 10 Jul 2018 10:59:57 +0800 jjiang 8203007: Address missing block coverage for ChaCha20 and Poly1305 algorithms
Mon, 09 Jul 2018 20:17:32 -0400 dholmes 8205878: pthread_getcpuclockid is expected to return 0 code
Mon, 09 Jul 2018 14:21:33 -0700 erikj 8206323: Missing some legal notices in docs bundle
Mon, 09 Jul 2018 13:26:59 -0700 jjg 8185740: The help-doc.html generated by the doclet is outdated
Mon, 09 Jul 2018 13:25:08 -0700 vdeshpande 8194740: UseSubwordForMaxVector causes performance regression
Mon, 09 Jul 2018 11:15:55 -0700 iignatyev 8206287: fix legal notice in hotspot tests
Mon, 09 Jul 2018 10:25:55 -0700 prr 8206106: [solaris sparc] jck tests api/javax_print/PrintService failing
Mon, 09 Jul 2018 10:23:17 -0700 prr 8205646: Broken link in jdk.jsobject
Mon, 09 Jul 2018 09:09:21 -0700 erikj 8206433: Several jib profiles missing autoconf dependency
Mon, 09 Jul 2018 19:09:29 +0300 serb 8205588: Deprecate for removal com.sun.awt.SecurityWarning
Mon, 09 Jul 2018 12:51:58 +0200 ghaug 8206408: Add missing CPU/system info to vm_version_ext on PPC64
Mon, 09 Jul 2018 16:36:05 +0300 serb 8201611: Broken links in java.desktop javadoc
Mon, 09 Jul 2018 15:26:58 +0200 mdoerr 8206459: [s390] Prevent restoring incorrect bcp and locals in interpreter and avoid incorrect size of partialSubtypeCheckNode in C2
Mon, 09 Jul 2018 09:38:11 +0100 adinn 8206163: AArch64: incorrect code generation for StoreCM
Mon, 09 Jul 2018 10:19:51 +0200 tschatzl 8205426: Humongous continues remembered set does not match humongous start region one after Remark
Mon, 09 Jul 2018 12:20:56 +0800 weijun 8198352: java.util.MissingResourceException: sun.security.util.AuthResources when trying to use com.sun.security.auth.module.UnixLoginModule
Sun, 08 Jul 2018 20:00:46 -0400 dholmes 8205966: [testbug] New Nestmates JDI test times out with Xcomp on sparc
Sun, 08 Jul 2018 11:54:08 +0200 mgronlun 8203943: eventThreadGroup was null in TestJavaBlockedEvent.java
Fri, 06 Jul 2018 12:10:43 -0700 cushon 8204630: Generating an anonymous class with Filer#createClassFile causes an NPE in JavacProcessingEnvironment
Fri, 06 Jul 2018 13:45:41 -0700 kvn 8193126: Incorrect setting of MetaspaceSize and NewSizeThreadIncrease when using JVMCI compiler
Fri, 06 Jul 2018 10:39:38 -0700 prr 8206375: ProblemList update of bug ID for SwingFontMetricsTest
Fri, 06 Jul 2018 10:37:47 -0700 prr 8206428: Upgrade JDK11 to harfbuzz 1.8.2
Fri, 06 Jul 2018 13:38:56 +0530 sdama 8206450: Add JImageListTest.java to ProblemList.txt
Fri, 06 Jul 2018 09:22:18 +0200 simonis 8206436: sun/nio/cs/TestIBMBugs.java no longer compiles
Thu, 05 Jul 2018 20:00:04 -0700 iignatyev 8206429: [REDO] 8202561 clean up TEST.groups
Thu, 05 Jul 2018 12:38:36 -0700 kvn 8206324: compiler/whitebox/DeoptimizeFramesTest.java to ProblemList-graal.txt
Thu, 05 Jul 2018 09:38:15 +0200 mbaesken 8206394: missing ResourceMark in AOTCompiledMethod::metadata_do, AOTCompiledMethod::clear_inline_caches , CompiledMethod::clear_ic_stubs , CompiledMethod::cleanup_inline_caches_impl
Fri, 06 Jul 2018 00:40:12 +0530 sdama 8198405: JImageExtractTest.java & JImageListTest.java failed in Windows.
Thu, 05 Jul 2018 21:29:11 +0300 serb 8205454: &amp; is displayed in some Swing docs
Tue, 12 Jun 2018 13:00:50 +0530 simonis 8202329: [AIX] Fix codepage mappings for IBM-943 and Big5
Thu, 05 Jul 2018 19:05:08 +0300 serb 8189604: possible hang in sun.awt.shell.Win32ShellFolder2$KnownFolderDefinition::<clinit>
Thu, 05 Jul 2018 13:26:50 +0200 jwilhelm Added tag jdk-11+21 for changeset 14708e1acdc3
Thu, 05 Jul 2018 11:56:19 +0200 stuefe 8206243: java -XshowSettings fails if memory.limit_in_bytes overflows LONG.max
Thu, 05 Jul 2018 13:22:44 +0800 xiaofeya 8206378: Backout JDK-8202561
Wed, 04 Jul 2018 11:49:46 -0700 ssahoo 8206355: SSLSessionImpl.getLocalPrincipal() throws NPE
Wed, 04 Jul 2018 18:39:26 +0200 mgronlun 8198346: assert(!_cld->claimed()) failed in TestObjectDescription.java
Wed, 04 Jul 2018 16:16:24 +0100 michaelm 8206001: Enable TLS1.3 by default in Http Client
Wed, 04 Jul 2018 16:54:56 +0200 mbaesken 8206145: dbgsysSocketClose - do not restart close if errno is EINTR [linux]
Tue, 03 Jul 2018 12:40:42 +0200 mbaesken 8206255: fix compiler/intrinsics/sha/cli/TestUseSHAOptionOnSupportedCPU.java jtreg test on linux s390x
Tue, 03 Jul 2018 09:11:00 +0200 neliasso 8205999: C2 compilation fails with "assert(store->find_edge(load) != -1) failed: missing precedence edge"
Wed, 04 Jul 2018 17:49:21 +0530 sdama 8198819: tools/jimage/JImageExtractTest.java, fails intermittently at testExtract (macos)
Wed, 04 Jul 2018 12:04:02 +0200 pliden 8206316: ZGC: Preferred tmpfs mount point not found on Debian
Wed, 04 Jul 2018 12:04:02 +0200 pliden 8205924: ZGC: Premature OOME due to failure to expand backing file
Wed, 04 Jul 2018 16:49:34 +0800 xyin 8187069: The case auto failed with the java.lang.ClassNotFoundException: IPv6NameserverPlatformParsingTest exception
Wed, 04 Jul 2018 10:24:16 +0200 mgronlun 8206254: Unable to complete emergency dump during safepoint
Wed, 04 Jul 2018 09:21:19 +0200 simonis 8206173: MallocSiteTable::initialize() doesn't take function descriptors into account
Wed, 04 Jul 2018 08:33:00 +0200 pliden 8206322: ZGC: Incorrect license header in gtests
Wed, 04 Jul 2018 11:55:11 +0530 rgoel 8204603: Short week days, NaN value and timezone name are inconsistent between CLDR and Java in zh_CN, zh_TW locales.
Tue, 03 Jul 2018 15:08:00 -0400 bobv Merge
Tue, 03 Jul 2018 10:59:18 -0400 bobv 8205928: [TESTBUG] jdk/internal/platform/docker/TestDockerMemoryMetrics
Mon, 02 Jul 2018 10:09:01 -0700 psandoz 8202769: jck test fails with C2: vm/jvmti/FollowReferences/fref001/fref00113/fref00113.html
Thu, 28 Jun 2018 10:51:02 -0700 iignatyev 8202561: clean up TEST.groups file
Tue, 03 Jul 2018 11:16:25 -0700 mchung 8206184: docs-reference build fails due to extlink.spec.version property not set
Tue, 03 Jul 2018 09:27:41 +0800 jjiang 8205984: javax/net/ssl/compatibility/Compatibility.java failed to access port log filejdk-11+21
Mon, 02 Jul 2018 17:54:36 -0700 jjg 8205563: modules/AnnotationProcessing.java failed testGenerateSingleModule
Wed, 11 Jul 2018 14:44:05 -0400 coleenp 8198720: Obsolete PrintSafepointStatistics, PrintSafepointStatisticsTimeout and PrintSafepointStatisticsCount options
Wed, 11 Jul 2018 13:28:07 -0400 zgu 8206183: Possible construct EMPTY_STACK and allocation stack, etc. on first use
Wed, 11 Jul 2018 08:24:39 -0700 darcy 8173606: Deprecate constructors of 7-era visitors
Thu, 12 Jul 2018 13:04:33 -0700 mikael Merge
Wed, 11 Jul 2018 08:44:00 +0200 shade 8206931: Misleading "COMPILE SKIPPED: invalid non-klass dependency" compile logjdk-12+2
Tue, 10 Jul 2018 19:04:13 -0700 ccheung 8205946: JVM crash after call to ClassLoader::setup_bootstrap_search_path()
Tue, 10 Jul 2018 10:24:08 -0700 dl 8205620: Miscellaneous changes imported from jsr166 CVS 2018-07
Tue, 10 Jul 2018 10:24:08 -0700 dl 8205576: forkjoin/FJExceptionTableLeak.java fails "AssertionError: failed to satisfy condition"
Tue, 10 Jul 2018 10:24:08 -0700 dl 8206123: ArrayDeque created with default constructor can only hold 15 elements
Tue, 10 Jul 2018 11:13:33 -0400 coleenp 8206471: Race with ConcurrentHashTable deleting items on insert with cleanup thread
Tue, 10 Jul 2018 03:14:55 -0400 dholmes 8206954: Test runtime/Thread/ThreadPriorities.java crashes with SEGV in pthread_getcpuclockid
Mon, 09 Jul 2018 20:17:32 -0400 dholmes 8205878: pthread_getcpuclockid is expected to return 0 code
Mon, 09 Jul 2018 13:08:30 -0700 sherman 8206389: JarEntry.setCreation/LastAccessTime without setLastModifiedTime causes Invalid CEN header
Mon, 09 Jul 2018 13:35:55 -0400 kbarrett 8204834: Fix confusing "allocate" naming in OopStorage
Mon, 09 Jul 2018 14:12:50 +0200 tschatzl 8206453: Taskqueue stats should count real steal attempts, not calls to GenericTaskQueueSet::steal
Sun, 08 Jul 2018 20:00:46 -0400 dholmes 8205966: [testbug] New Nestmates JDI test times out with Xcomp on sparc
Sun, 08 Jul 2018 12:43:05 -0400 jiangli 8202035: Archive the set of ModuleDescriptor and ModuleReference objects for observable system modules with unnamed initial module.
Fri, 06 Jul 2018 15:22:07 -0400 rriggs 8206495: Redundant System.setProperty(null) tests
Fri, 06 Jul 2018 10:28:56 -0700 darcy 8206439: Remove javac -source/-target 6 from langtools regression tests
Fri, 06 Jul 2018 09:37:44 -0700 darcy 8206440: Remove javac -source/-target 6 from jdk regression tests
Fri, 06 Jul 2018 09:26:01 -0700 joehw 8206164: forgot to "throw" TransformerConfigurationException
Fri, 06 Jul 2018 09:10:07 -0400 coleenp 8205417: Obsolete UnlinkSymbolsALot debugging option
Fri, 06 Jul 2018 06:26:25 -0700 hseigel 8203911: Test runtime/modules/getModuleJNI/GetModule fails with -Xcheck:jni
Fri, 06 Jul 2018 09:00:48 -0400 coleenp 8202737: Obsolete AllowNonVirtualCalls option
Thu, 05 Jul 2018 14:35:03 -0700 jjg 8206318: Enhance package documentation for internal javadoc packages
Thu, 05 Jul 2018 14:23:45 -0700 naoto 8206350: java/util/Locale/bcp47u/SystemPropertyTests.java failed on Mac 10.13 with zh_CN and zh_TW locales.
Thu, 05 Jul 2018 19:22:53 +0200 rkennke 8206272: Remove stray BarrierSetAssembler call
Thu, 05 Jul 2018 19:22:38 +0200 rkennke 8206407: Primitive atomic_cmpxchg_in_heap_at() in BarrierSet::Access needs to call non-oop raw method
Thu, 05 Jul 2018 09:11:33 -0700 ccheung 8205548: Remove multi-release jar related vm code
Thu, 05 Jul 2018 07:22:21 -0700 bpb 8194899: Remove unused sun.net classes
Thu, 05 Jul 2018 13:31:04 +0200 jwilhelm Added tag jdk-12+1 for changeset 00b16d0457e4
Thu, 05 Jul 2018 14:47:50 -0700 mikael Merge
Wed, 04 Jul 2018 03:44:32 -0700 ssahoo 8205653: test/jdk/sun/management/jmxremote/bootstrap/RmiRegistrySslTest.java and RmiSslBootstrapTest.sh fail with handshake_failurejdk-12+1
Tue, 03 Jul 2018 16:14:46 -0700 darcy 8206114: Refactor langtools/tools/javac/classfiles/ClassVersionChecker.java
Tue, 03 Jul 2018 15:59:09 -0700 darcy 8206085: Refactor langtools/tools/javac/versions/Versions.java
Tue, 03 Jul 2018 15:02:46 -0700 bpb 8202252: (aio) Closed AsynchronousSocketChannel keeps completion handler alive
Tue, 03 Jul 2018 14:42:13 -0700 naoto 8206120: Add test cases for lenient Japanese era parsing
Tue, 03 Jul 2018 15:40:08 -0400 coleenp 8206309: Tier1 SA tests fail
Tue, 03 Jul 2018 15:08:01 -0400 coleenp 8134538: Duplicate implementations of os::lasterror
Tue, 03 Jul 2018 13:41:18 -0400 coleenp 8205534: Remove SymbolTable dependency from serviceability agent
Tue, 03 Jul 2018 18:46:51 +0200 erikj 8206087: windows-x64-cmp-baseline fails with The files do not have the same suffix type
Mon, 02 Jul 2018 23:33:40 -0700 vtheeyarath 8177275: IllegalArgumentException when MH would have too many parameters is not specified for several methods
Tue, 03 Jul 2018 10:47:50 +0200 neliasso 8205999: C2 compilation fails with "assert(store->find_edge(load) != -1) failed: missing precedence edge"
Tue, 03 Jul 2018 02:07:49 +0200 jwilhelm Merge
Mon, 02 Jul 2018 16:28:09 -0400 zgu 8205965: SIGSEGV on write to NativeCallStack::EMPTY_STACK
Mon, 02 Jul 2018 10:44:46 +0200 roland 8205515: assert(opcode == Op_RangeCheck) failed: no other if variant here
Mon, 02 Jul 2018 13:11:41 +0200 jwilhelm Added tag jdk-11+20 for changeset 9816d7cc655e
Mon, 02 Jul 2018 11:46:15 +0200 mdoerr 8206003: SafepointSynchronize with TLH: StoreStore barriers should be moved out of the loop
Mon, 02 Jul 2018 09:38:20 +0200 tschatzl 8203848: Missing remembered set entry in j.l.ref.references after JDK-8203028
Mon, 02 Jul 2018 09:28:23 +0200 thartmann 8206093: compiler/graalunit/HotspotTest.java fails in CheckGraalIntrinsics
Sat, 30 Jun 2018 00:33:05 +0000 valeriep 8205720: KeyFactory#getKeySpec and translateKey thorws NullPointerException with Invalid key
Fri, 29 Jun 2018 13:58:16 -0700 serb 8201552: Ellipsis in "Classical" label in SwingSet2 demo with Windows L&F at Hidpi
Fri, 29 Jun 2018 13:44:13 -0700 iignatyev 8204355: [Graal] org.graalvm.compiler.debug.test.CSVUtilTest fails on Windows due to improper line separator used
Fri, 29 Jun 2018 13:44:09 -0700 iignatyev 8204517: [Graal] org.graalvm.compiler.debug.test.VersionsTest fails with InvalidPathException on windows
Fri, 29 Jun 2018 13:43:35 -0700 iignatyev 8206117: failed to get JDK properties for JVM w/o JVMCI
Fri, 29 Jun 2018 11:10:47 +0200 thartmann 8205940: LoadNode::find_previous_arraycopy fails with "broken allocation" assertjdk-11+20
Fri, 29 Jun 2018 11:08:38 +0200 thartmann 8205499: C1 temporary code buffers are not removed with -XX:+UseDynamicNumberOfCompilerThreads
Thu, 28 Jun 2018 21:58:23 -0700 iignatyev 8206088: 8205207 broke builds
Thu, 28 Jun 2018 19:33:00 -0700 epavlova 8195630: [Graal] vmTestbase/nsk/jvmti/AttachOnDemand/attach024/TestDescription.java fails with Graal
Fri, 29 Jun 2018 08:21:15 +0800 weijun 8205927: Update src/java.base/share/legal/public_suffix.md to match the actual file version
Thu, 28 Jun 2018 17:07:34 -0700 epavlova 8205207: Port Graal unit tests under jtreg
Thu, 28 Jun 2018 16:45:15 -0700 iignatyev 8149729: [jittester] Replace all 'path1 +"/" + path2' with Paths::get
Fri, 29 Jun 2018 01:09:29 +0200 jwilhelm 8206006: Build failed on Windows
Mon, 02 Jul 2018 13:54:01 -0700 joehw 8204329: Java API doc for XMLStreamReader.next() needs to be clarified for the exception thrown when hasNext() method returns false
Mon, 02 Jul 2018 16:28:09 -0400 zgu 8205965: SIGSEGV on write to NativeCallStack::EMPTY_STACK
Mon, 02 Jul 2018 00:55:24 -0700 rraghavan 8203504: [Graal] org.graalvm.compiler.debug.test.DebugContextTest fails with java.util.ServiceConfigurationError
Mon, 02 Jul 2018 09:21:06 +0200 thartmann 8206093: compiler/graalunit/HotspotTest.java fails in CheckGraalIntrinsics
Fri, 29 Jun 2018 17:35:04 -0700 igerasim 8204310: Simpler RandomAccessFile.setLength() on Windows
Fri, 29 Jun 2018 12:34:03 -0700 dtitov 8206086: [Graal] JDI tests fail with com.sun.jdi.ObjectCollectedException
Fri, 29 Jun 2018 10:13:24 -0700 joehw 8190835: Subtraction with two javax.xml.datatype.Duration gives incorrect result
Fri, 29 Jun 2018 10:41:10 +0200 jlahoda 8205418: Assorted improvements to source code model
Thu, 28 Jun 2018 17:49:13 -0700 darcy 8206083: Make tools/javac/api/T6265137.java robust to JDK version changes
Thu, 28 Jun 2018 17:45:59 -0700 mikael 8206022: Add test to check that the JVM accepts class files with version 56
Thu, 28 Jun 2018 15:46:27 -0700 jjg 8202959: Rearrange the top and bottom navigation bar in the javadoc generated pages
Thu, 28 Jun 2018 22:28:41 +0200 jwilhelm 8206006: Build failed on Windows
Thu, 28 Jun 2018 21:11:50 +0200 jwilhelm Added tag jdk-12+0 for changeset 95aad0c785e4
Wed, 27 Jun 2018 21:01:12 -0700 darcy 8205615: Start of release updates for JDK 12
Thu, 28 Jun 2018 19:55:44 +0200 jwilhelm Added tag jdk-12+0 for changeset c9cd3ec6a0eb
Thu, 28 Jun 2018 11:41:45 -0700 rhalade 8195774: Add Entrust root certificates
Thu, 28 Jun 2018 10:31:39 -0400 gadams 8205508: hotspot/jtreg/vmTestbase/nsk/jdb/exclude/exclude001/exclude001.java fails with Prompt is not received during 300200 milliseconds.jdk-12+0
Thu, 28 Jun 2018 10:50:10 -0400 dcubed Merge
Thu, 28 Jun 2018 15:17:44 +0200 egahlin 8137164: Include PID in the JFR jcmd hint
Thu, 28 Jun 2018 10:46:05 -0400 dcubed 8206004: [BACKOUT] errant changeset for JDK-8137164
Thu, 28 Jun 2018 07:30:38 -0700 mr 8205956: Fix usage of "OpenJDK" in build and test instructions
Thu, 28 Jun 2018 19:44:58 +0530 sdama 8204967: Resolve disabled warnings for libunpack
Thu, 28 Jun 2018 15:18:17 +0200 jlahoda 8205985: Remove tools/javac/options/release/ReleaseOptionUnsupported.java from problem list
Thu, 28 Jun 2018 14:22:28 +0200 eosterlund 8205683: Refactor heap allocation to separate concerns
Thu, 28 Jun 2018 15:17:44 +0200 egahlin 8197425: Liveset information for Old Object sample event
Thu, 28 Jun 2018 15:13:39 +0200 egahlin 8197425: Liveset information for Old Object sample event
Thu, 28 Jun 2018 15:06:55 +0200 rwestberg 8003209: JFR events for network utilization
Thu, 28 Jun 2018 18:04:19 +0530 sundar 8204492: Add deprecation annotation to Nashorn APIs and warning to nashorn, jjs
Thu, 28 Jun 2018 13:58:30 +0200 mgronlun 8205996: JDK-8205906 broke the build on Mac
Thu, 28 Jun 2018 03:45:49 -0700 amenkov 8205681: [TEST_BUG] vmTestbase/nsk/jvmti/Allocate/alloc001/TestDescription.java fails with exit code 98
Thu, 28 Jun 2018 12:14:37 +0200 pliden 8205993: ZGC: Fix typos and incorrect indentations
Thu, 28 Jun 2018 10:09:58 +0000 adinn 8205694: AArch64: Add test to validate volatile load, store and CAS code generation
Thu, 28 Jun 2018 11:37:02 +0200 mgronlun 8205906: jdk.jfr.jcmd.TestJcmdDumpLimited fails due to erronous processing of -XX:FlightRecorderOptions
Thu, 28 Jun 2018 11:32:32 +0200 stuefe 8205925: Print correct and more information about secondary errors
Wed, 27 Jun 2018 15:04:27 +0200 stefank 8205923: ZGC: Verification applies load barriers before verification
Wed, 27 Jun 2018 15:02:53 +0200 stefank 8205923: ZGC: Verification applies load barrier before verification
Thu, 28 Jun 2018 01:10:09 -0700 igerasim 8205959: Do not restart close if errno is EINTR
Thu, 28 Jun 2018 10:05:43 +0200 jlahoda 8205913: Inconsistent source code model
Thu, 28 Jun 2018 10:05:39 +0200 jlahoda 8195986: Incorrect javac -h output with annotation processing and missing classes
Thu, 28 Jun 2018 09:15:53 +0200 pliden 8205679: Remove unused ThreadLocalAllocBuffer::undo_allocate()
Thu, 28 Jun 2018 09:06:54 +0200 simonis 8205916: [test] Fix jdk/tools/launcher/RunpathTest to handle both, RPATH and RUNPATH
Thu, 28 Jun 2018 07:22:59 +0200 pliden 8205702: assert(UseCompressedClassPointers) failed in universe.hpp
Thu, 28 Jun 2018 07:00:35 +0200 stuefe 8205531: jcmd VM.classloaders should fold similar loaders
Thu, 28 Jun 2018 00:34:55 -0400 kbarrett 8205577: parallel/TestPrintGCDetailsVerbose.java fails assertion
Thu, 28 Jun 2018 09:40:46 +0530 hb 8192953: sun/management/jmxremote/bootstrap/*.sh tests fail with error : revokeall.exe: Permission denied
Wed, 27 Jun 2018 20:21:42 -0700 kvn 8205528: Base64 encoding algorithm using AVX512 instructions
Wed, 27 Jun 2018 19:09:17 -0700 cjplummer 8205719: Windows Java_sun_tools_attach_VirtualMachineImpl_enqueue() method should include exitCode in exception message
Wed, 27 Jun 2018 17:02:41 -0700 never 8205824: Update Graal
Wed, 27 Jun 2018 16:57:21 -0700 iignatyev 8160673: Jittester: investigate bytecode generation hangs during bytecode tests generation
Thu, 28 Jun 2018 01:46:03 +0200 hannesw 8190876: javadoc search on "java.se" shows "java.se" the last one among other modules
Wed, 27 Jun 2018 16:19:28 -0700 iignatyev 8205954: clean up hotspot ProblemList
Wed, 27 Jun 2018 16:17:11 -0700 erikj 8205942: Build failure on macosx after JDK-8189429
Wed, 27 Jun 2018 15:15:11 -0700 iignatyev 8202554: Remove hotspot tests for javafx.* modules
Wed, 27 Jun 2018 22:26:41 +0200 redestad 8205926: Support invokeSpecialIFC in GenerateJLIClassesPlugin
Wed, 27 Jun 2018 14:46:15 -0700 ccheung 8203664: JFR start failure after AppCDS archive created with JFR StartFlightRecording
Wed, 27 Jun 2018 14:20:41 -0700 jjg 8205438: Re-enable shebang tests in test/jdk/tools/launchers/SourceMode.java
Wed, 27 Jun 2018 13:43:52 -0700 iignatyev 8199265: java/util/Arrays/TimSortStackSize2.java fails with OOM
Wed, 27 Jun 2018 21:18:33 +0100 dfuchs 8205945: Revert unintended changes to make/gensrc/Gensrc-jdk.hotspot.agent.gmk
Wed, 27 Jun 2018 21:56:11 +0200 glaubitz 8205616: Build fails with system headers after 8204572
Wed, 27 Jun 2018 20:19:59 +0100 dfuchs 8205397: InetAddress has wrong declaration for readObjectNoData
Wed, 27 Jun 2018 19:45:06 +0200 pliden 8205678: ZGC: Remove unused ZAllocationFlags::java_thread()
Wed, 27 Jun 2018 19:45:05 +0200 pliden 8205676: ZGC: Remove TLAB allocations in relocation path
Wed, 27 Jun 2018 10:06:03 -0700 prr Merge
Mon, 25 Jun 2018 17:34:55 -0700 serb 4475138: getBestCursorSize and XFree86 4.1.0
Mon, 25 Jun 2018 14:56:07 -0700 prr Merge
Mon, 25 Jun 2018 11:40:46 -0700 srl 8187100: Support Unicode Variation Selectors
Mon, 25 Jun 2018 10:21:50 -0700 prr Merge
Mon, 25 Jun 2018 14:32:46 +0530 sveerabhadra 8153732: Windows remote printer changes do not reflect in lookupPrintServices()
Mon, 25 Jun 2018 12:50:25 +0530 pbansal 8194873: right ALT key hotkeys no longer work in Swing components
Mon, 25 Jun 2018 16:01:01 +0530 pkbalakr 8202696: Remove exclusion range for phonetic chars in windows fontconfig.properties
Sun, 24 Jun 2018 19:45:15 -0700 serb 8205324: Part of java.awt.Desktop.browse(URI) spec is outdated after support of applets was removed
Sun, 24 Jun 2018 16:35:21 -0700 serb 8205153: Delete "standard instructions" machinery in the open automated tests
Sat, 23 Jun 2018 11:48:42 -0700 serb 8205144: JSpinner may change the font after became visible
Fri, 22 Jun 2018 19:19:43 -0700 serb 8205456: Unification of iterations over arrays
Fri, 22 Jun 2018 13:21:23 -0700 prr 8205494: Convert or remove all AWT applet demos
Fri, 22 Jun 2018 12:16:14 -0700 prr 8205136: Move StylePad demo to the open repository
Fri, 22 Jun 2018 10:29:14 +0530 sveerabhadra 8204946: Clean-up problem list for JDK-8202933 and JDK-8202934
Thu, 21 Jun 2018 16:58:09 -0700 prr 8205498: Typo in fix for 8205119 breaks Solaris demo build
Thu, 21 Jun 2018 14:32:41 -0700 prr 8205119: SwingApplet demo should be removed
Thu, 21 Jun 2018 12:54:30 -0700 prr 8205441: Upgrade to harfbuzz 1.8.1
Thu, 21 Jun 2018 09:53:50 -0700 prr Merge
Wed, 20 Jun 2018 11:12:48 -0700 serb 8203003: Several FileDialog Modality Tests fail on Linux due to X errors
Wed, 27 Jun 2018 09:56:06 -0700 iveresov 8202698: Update Graal for JEP 181 - Nest-based access control
Wed, 27 Jun 2018 18:46:30 +0200 neliasso 8204157: Compiler.sunflow hangs after JDK-8192992
Wed, 27 Jun 2018 09:45:18 -0700 sherman 8200243: System error message is decoded as invalid encoding in Windows.
Wed, 27 Jun 2018 09:31:51 -0700 joehw 8205058: (fs) Files read/writeString should throw CharacterCodingException instead of IOException with an IllegalArgumentException as cause
Wed, 27 Jun 2018 11:55:35 -0400 jiangli 8205699: assert(_owner_offset != 0) failed in javaClasses.cpp
Wed, 27 Jun 2018 20:04:31 +0530 jgeorge 8189429: SA: MacOSX: Replace the deprecated PT_ATTACH with PT_ATTACHEXC
Wed, 27 Jun 2018 09:36:34 -0400 rriggs 8066709: Make some JDK system properties read only
Wed, 27 Jun 2018 09:52:23 +0200 goetz 8199940: Print more information about class loaders in IllegalAccessErrors.
Wed, 27 Jun 2018 12:46:15 +0200 rehn 8205583: Crash in ConcurrentHashTable do_bulk_delete_locked_for
Wed, 27 Jun 2018 11:54:15 +0200 mdoerr 8205609: [PPC64] Fix PPC64 part of 8010319 and TLH without UseSIGTRAP on AIX
Wed, 27 Jun 2018 02:20:55 -0700 ssahoo 8205111: Develop new Test to verify different key types for supported TLS protocols.
Wed, 27 Jun 2018 11:05:07 +0200 pliden 8205663: ZGC: Log metaspace used/capacity/committed/reserved
Wed, 27 Jun 2018 11:05:01 +0200 pliden 8205664: Move detailed metaspace logging from debug to trace
Wed, 27 Jun 2018 12:56:21 +0530 pmuthuswamy 8187288: bad (no) wrapping for modifier and type column
Tue, 26 Jun 2018 19:45:59 -0700 smarks 8203670: unmodifiable List iterator() implementations should not be ListIterators
Wed, 27 Jun 2018 09:44:46 +0800 amlu 8205673: Problem list RmiRegistrySslTest.java and RmiSslBootstrapTest.sh
Tue, 26 Jun 2018 17:41:42 -0700 erikj 8205625: linux-aarch64-cmp-baseline fails builds-tier5
Tue, 26 Jun 2018 16:01:37 -0700 iignatyev 8199580: [TESTBUG] Un-quarantine vm/mlvm/indy/func/jdi/breakpointOtherStratum and breakpoint
Tue, 26 Jun 2018 15:46:20 -0700 sspitsyn 8205723: Problem list serviceability/jvmti/HeapMonitor/MyPackage/HeapMonitorStatRateTest.java
Wed, 27 Jun 2018 00:16:37 +0200 dnsimon 8205703: [JVMCI] Expose all GC selection flags
Tue, 26 Jun 2018 16:59:38 -0400 kbarrett 8205559: Remove IN_CONCURRENT_ROOT Access decorator
Tue, 26 Jun 2018 13:50:59 -0700 sspitsyn 8205721: Problem list serviceability/jvmti/HeapMonitor/MyPackage/HeapMonitorStatArrayCorrectnessTest.java
Tue, 26 Jun 2018 13:55:17 +0200 stefank 8144992: Remove OopIterateClosure::idempotent
Tue, 26 Jun 2018 13:54:19 +0200 stefank 8205607: Use oop_iterate instead of oop_iterate_no_header
Tue, 26 Jun 2018 12:29:20 -0700 sspitsyn 8205701: Problem list serviceability/jvmti/HeapMonitor/MyPackage/HeapMonitorGCCMSTest.java
Tue, 26 Jun 2018 14:15:49 -0400 dcubed 8205648: fix for 8205195 breaks secondary error handling
Tue, 26 Jun 2018 14:14:29 -0300 jlaskey 8205696: Undo licence.md
Tue, 26 Jun 2018 12:42:36 -0400 rriggs 8205547: FileChannel/CleanerTest.java fails due to expected FD count
Fri, 15 Jun 2018 14:46:04 +0200 neliasso 8205107: assert(c->Opcode() == Op_SafePoint) failed: broken outer loop
Tue, 26 Jun 2018 09:33:55 -0700 bpb 8205641: Make java/nio/channels/Selector/RacyDeregister.java noisier and flush after prints
Tue, 26 Jun 2018 09:14:49 -0700 kvn 8205400: [Graal] compiler/jvmci/compilerToVM/DisassembleCodeBlobTest.java fails with can't be enqueued for compilation on level 4
Tue, 26 Jun 2018 11:14:27 -0400 apetcher 8203228: Branch-free output conversion for X25519 and X448
Mon, 25 Jun 2018 23:04:21 +0200 goetz 8205419: [testbug] TestJmapCore failing without SA: introduce @requires vm.hasSAandCanAttach
Tue, 26 Jun 2018 09:52:21 -0400 hseigel 8205422: assert(false) failed: Bad verification_type_info
Tue, 26 Jun 2018 13:16:40 +0100 chegar 8205671: Remove HTTP Client tests erroneously problem listed by the TLS 1.3 integration
Tue, 26 Jun 2018 18:55:48 +0800 weijun 8201815: Use Mozilla Public Suffix List
Tue, 26 Jun 2018 11:09:42 +0200 tschatzl 8204082: Make names of Young GCs more uniform in logs
Tue, 26 Jun 2018 09:17:53 +0200 mbaesken 8205342: windows : potential memleaks in getAdapter(s) in NetworkInterface_winXP.c
Mon, 25 Jun 2018 16:00:56 +0200 ghaug 8200720: Print additional information in thread dump (times, allocated bytes etc.)
Tue, 26 Jun 2018 08:13:02 +0100 alanb 8205612: (fc) Files.readAllBytes fails with ClosedByInterruptException when interrupt status set
Mon, 25 Jun 2018 22:28:04 -0700 mchung 8205623: Replace use of Class::getPackage with Class::getPackageName
Mon, 25 Jun 2018 22:27:09 -0700 mchung 8205627: Replace hardcoded spec version value in build.tools.ExtLink taglet
Mon, 25 Jun 2018 20:58:01 -0700 martin 8205649: Make clang stack flags independent of OS
Mon, 25 Jun 2018 20:08:05 -0700 xiaofeya 8194152: sun/security/tools/jarsigner/AltProvider.java failed on de-DE locale
Mon, 25 Jun 2018 20:03:46 -0700 xiaofeya 8196213: sun/security/tools/jarsigner/warnings/NoTimestampTest.java test fails on ar_SA locale.
Tue, 26 Jun 2018 10:43:50 +0800 weijun 8202299: Java Keystore fails to load PKCS12/PFX certificates created in WindowsServer2016
Tue, 26 Jun 2018 10:43:43 +0800 weijun 8202608: CommonSeeder test needs a white-box testing mechanism to replace the default entropy source
Mon, 25 Jun 2018 18:49:30 -0700 smarks 8205455: jdeprscan issues annotation processor warning regarding RELEASE_10
Mon, 25 Jun 2018 18:01:42 -0700 martin 8205184: Delegating Iterator implementations that don't delegate forEachRemaining()
Mon, 25 Jun 2018 17:11:27 -0700 smarks 8201610: Broken link on the page api/java.rmi/java/rmi/server/UnicastRemoteObject.html
Tue, 26 Jun 2018 08:10:45 +0800 mbalao 8195607: sun/security/pkcs11/Secmod/TestNssDbSqlite.java failed with "NSS initialization failed" on NSS 3.34.1
Mon, 25 Jun 2018 22:25:29 +0200 stefank 8205632: Include stack.inline.hpp in markSweep.inline.hpp
Mon, 25 Jun 2018 14:39:44 -0700 psandoz 8195650: Method references to VarHandle accessors
Mon, 25 Jun 2018 14:36:16 -0700 bpb 8204930: Reader:nullReader() spec does not match the behavior
Mon, 25 Jun 2018 13:37:01 +0200 goetz 8205605: [testbug][aix] Various test adaption to aix pecularities.
Mon, 25 Jun 2018 13:41:39 -0700 xuelei 8196584: TLS 1.3 Implementation
Mon, 25 Jun 2018 21:22:16 +0300 dpochepk 8205475: AARCH64: optimize FPU loads and stores in C1_Runtime1_aarch64.cpp
Mon, 25 Jun 2018 14:10:44 -0400 hseigel 8205614: NestMates tests failing in CI jdk11-jdk.931
Mon, 25 Jun 2018 13:47:27 -0400 coleenp 8202615: Remove NativeMonitorSpinLimit, NativeMonitorFlags and NativeMonitorTimeout experimental flags
Mon, 25 Jun 2018 09:59:16 -0700 dl 8203681: Miscellaneous changes imported from jsr166 CVS 2018-06
Mon, 25 Jun 2018 09:59:16 -0700 dl 8203864: Execution error in Java's Timsort
Mon, 25 Jun 2018 09:59:16 -0700 dl 8202422: value of 'sizeCtl' in ConcurrentHashMap varies with the constructor called
Mon, 25 Jun 2018 11:33:11 -0400 lfoltan 8169559: Add class loader names to relevant VM messages
Mon, 25 Jun 2018 20:36:06 +0530 hb 8204661: Show error 'Port already in use' in HashedPasswordFileTest.java
Mon, 25 Jun 2018 10:34:46 -0400 lfoltan 8205509: assert(_name_and_id != 0LL) failed: encountered a class loader null name and id
Mon, 25 Jun 2018 16:32:23 +0300 dpochepk 8189113: AARCH64: StringLatin1 inflate intrinsic doesn't use prefetch instruction
Mon, 25 Jun 2018 16:32:02 +0300 dpochepk 8189103: AARCH64: optimize String indexOf intrinsic
Mon, 25 Jun 2018 16:31:37 +0300 dpochepk 8202326: AARCH64: optimize string compare intrinsic
Mon, 25 Jun 2018 16:31:18 +0300 dpochepk 8204289: AARCH64: enable math intrinsics usage in interpreter and C1
Mon, 25 Jun 2018 16:30:49 +0300 dpochepk 8189105: AARCH64: create intrinsic for sin and cos
Mon, 25 Jun 2018 16:30:16 +0300 dpochepk 8196402: AARCH64: create intrinsic for Math.log
Sat, 26 May 2018 06:59:49 +0200 stefank 8204540: Automatic oop closure devirtualization
Mon, 25 Jun 2018 12:44:52 +0200 jlahoda 8203814: javac --release=8 \"cannot find symbol\" for NashornException.getEcmaError()
Tue, 20 Mar 2018 11:16:10 +0530 pkoppula 8187218: GSSCredential.getRemainingLifetime() returns negative value for TTL > 24 days.
Mon, 25 Jun 2018 10:54:55 +0200 pliden 8205405: ZGC: Decouple JFR type registration
Mon, 25 Jun 2018 10:41:03 +0200 mhorie 8204524: Unnecessary memory barriers in G1ParScanThreadState::copy_to_survivor_space
Mon, 25 Jun 2018 11:51:04 +0530 rgoel 8205158: Update the .md files for 3rd party software Unicode 10.0, ICU 60.2, and CLDR v33.
Sun, 24 Jun 2018 21:46:11 -0700 never 8198909: [Graal] compiler/codecache/stress/UnexpectedDeoptimizationTest.java crashed with SIGSEGV
Mon, 25 Jun 2018 02:07:42 +0200 egahlin 8203929: Limit amount of data for JFR.dump
Sun, 24 Jun 2018 16:25:47 +0100 alanb 8205533: Class.getPackage() fails with InternalError if class is defined to the bootstrap class loader but module is not in the boot layer
Sun, 24 Jun 2018 15:02:08 +0300 dsamersoff 8203481: Incorrect constraint for unextended_sp in frame:safe_for_sender
Sun, 24 Jun 2018 10:41:51 +0200 plevart 8205540: test/hotspot/jtreg/vmTestbase/nsk/jdb/trace/trace001/trace001.java fails with Debuggee did not exit after 15 <cont> commands
Sat, 23 Jun 2018 22:49:48 -0700 jmanson 8205570: fix a number of typos in the JVMTI spec
Sat, 23 Jun 2018 09:46:18 +0100 alanb Merge
Sat, 23 Jun 2018 09:34:09 +0100 alanb 8198372: API to create a SelectableChannel to a FileDescriptor
Sat, 23 Jun 2018 08:03:52 +0100 alanb 8197532: Re-examine policy for the default set of modules when compiling or running code on the class path
Sat, 23 Jun 2018 01:22:52 -0700 jmanson 8205113: Update JVMTI doc references to object allocation tracking
Tue, 05 Jun 2018 11:55:39 +0200 sgehwolf 8203188: Add JEP-181 support to the Zero interpreter
Sat, 23 Jun 2018 01:32:41 -0400 dholmes 8010319: Implementation of JEP 181: Nest-Based Access Control
Fri, 22 Jun 2018 17:49:21 -0700 martin 8205199: more Linux clang compile failures
Fri, 22 Jun 2018 17:36:03 -0700 martin 8205197: Never default to using libc++ on Linux
Fri, 22 Jun 2018 23:18:07 +0000 valeriep Merge
Fri, 22 Jun 2018 23:10:36 +0000 valeriep 7007966: Add Brainpool ECC support (RFC 5639)
Fri, 22 Jun 2018 16:11:36 -0700 iignatyev 8155192: [TESTBUG] SHA tests assumes that x86 does not have SHA intrinsics
Fri, 22 Jun 2018 15:58:32 -0700 iveresov 8204209: [Graal] Compilation fails during nmethod printing with "assert(bci == 0 || 0 <= bci && bci < code_size()) failed: illegal bci"
Fri, 22 Jun 2018 17:46:58 -0400 kbarrett 8205459: Rename Access API flag decorators
Fri, 22 Jun 2018 16:06:43 -0400 rriggs 8202292: java/io/FileOutputStream/UnreferencedFOSClosesFd.java fails with "raw fd count wrong"
Fri, 22 Jun 2018 12:51:49 -0700 vdeshpande 8205194: Improve the Array Comparison when there is mismatch at first element.
Fri, 22 Jun 2018 12:05:36 -0700 psandoz 8202922: Method reference identity is broken by serialization
Fri, 22 Jun 2018 19:04:16 +0200 jwilhelm Added tag jdk-11+19 for changeset 36ca515343e0
Fri, 22 Jun 2018 20:17:02 +0300 dpochepk 8189112: AARCH64: optimize StringUTF16 compress intrinsic
Fri, 22 Jun 2018 18:10:20 +0100 michaelm 8204233: Add configurable option for enhanced socket IOException messages
Fri, 22 Jun 2018 18:19:26 +0200 plevart Merge
Fri, 22 Jun 2018 18:18:05 +0200 plevart Merge
Fri, 22 Jun 2018 17:56:55 +0200 plevart 8202788: Explicitly reclaim cached thread-local direct buffers at thread exit
Fri, 22 Jun 2018 12:15:16 -0400 dcubed 8205195: NestedThreadsListHandleInErrorHandlingTest fails because hs_err doesn't contain _nested_thread_list_max
Fri, 22 Jun 2018 18:49:45 +0300 dpochepk 8205474: AARCH64: wrong zr encoding for ccmp instruction
Fri, 22 Jun 2018 18:48:36 +0300 dpochepk 8205004: AArch64: fix failures in jtreg ArraysEqCmpTest
Fri, 22 Jun 2018 21:42:00 +0800 weijun 8205445: Add RSASSA-PSS Signature support to SunMSCAPI
Fri, 22 Jun 2018 13:20:55 +0200 mgronlun 8203299: StringPoolBuffer access covered by exclusive access invariant, remove (problematic) cas operations
Fri, 22 Jun 2018 11:21:34 +0100 adinn 8204331: AArch64: fix CAS not embedded in normal graph error
Fri, 22 Jun 2018 11:26:55 +0200 jlahoda 8195077: [Testbug] tools/javac/processing/model/completionfailure/NoAbortForBadClassFile.java - AccessDeniedException
Wed, 20 Jun 2018 14:25:45 +0200 mbaesken 8205416: windows: fix checking of CloseHandle return code in Java_java_io_FileCleanable_cleanupClose0
Fri, 22 Jun 2018 11:49:31 +0530 pmuthuswamy 8205160: jQuery UI, jQuery-migrate, and jQuery license file to be updated to the revision present.
Thu, 21 Jun 2018 22:17:22 -0700 iignatyev 8172854: [TESTBUG] Exclude runtime/ReservedStack/ReservedStackTest.java from being run with DeoptimizeALot option
Thu, 21 Jun 2018 21:37:28 -0700 mikael 8202331: Obsolete support for commercial features
Thu, 21 Jun 2018 16:45:29 -0700 iignatyev 8205490: update ProblemList-graal
Thu, 21 Jun 2018 15:14:36 -0700 iignatyev 8185927: create regression test for 8062950
Thu, 21 Jun 2018 14:33:15 -0700 jjg 8205442: Avoid hard-coding --source value in SourceLauncherTest.java
Thu, 21 Jun 2018 13:29:44 -0700 jjg 8196425: tools/javac/modules/AnnotationProcessing.java failed
Thu, 21 Jun 2018 20:52:52 +0200 egahlin 8205053: Decouple type registration from framework lifecycle
Thu, 21 Jun 2018 12:03:54 -0700 erikj 8205424: Change to Xcode 9.4 for building on Macosx at Oracle
Thu, 21 Jun 2018 11:10:55 -0700 bpb 8199124: (fs) Reduce allocation for file system methods that are invoked with no open options
Thu, 21 Jun 2018 18:56:35 +0100 alanb 8194937: Inconsistent behavior of --validate-modules when combined with -m and other options
Thu, 21 Jun 2018 10:54:07 -0700 kvn 8205398: AES-CBC decryption algorithm using AVX512 instructions
Thu, 21 Jun 2018 08:45:57 -0700 smarks 8203184: List.copyOf() fails to copy sublists
Thu, 21 Jun 2018 08:25:03 -0700 smarks 8060192: Add default method <A> A[] Collection.toArray(IntFunction<A[]> generator)
Thu, 21 Jun 2018 11:10:44 -0400 coleenp 8205175: Deprecate UnlinkSymbolsALot debugging option.
Thu, 21 Jun 2018 08:58:59 -0300 jlaskey 8203637: Fix Sourcesjdk-11+19
Thu, 21 Jun 2018 13:39:20 +0200 rwestberg 8205103: [TESTBUG] Instability in JFR test TestThreadCpuTimeEvent
Tue, 19 Jun 2018 13:03:12 -0400 rkennke 8205336: Modularize allocations in assembler
Thu, 21 Jun 2018 14:09:43 +0530 nishjain 8204938: Add a test case to automatically check the updated LSR data
Wed, 20 Jun 2018 19:46:44 -0700 cjplummer 8205385: Problem list vmTestbase/nsk/jvmti/RedefineClasses/StressRedefineWithoutBytecodeCorruption/TestDescription.java
Thu, 21 Jun 2018 03:21:22 +0200 jwilhelm Added tag jdk-11+19 for changeset fb8b3f467277
Wed, 20 Jun 2018 17:30:43 -0700 iveresov 8205105: VM crashes with "assert(Universe::heap()->is_in_reserved(start + words - 1)) failed: not in heap"
Wed, 20 Jun 2018 12:02:17 -0700 lmesnik 8204974: Quarantine serviceability/sa/TestInstanceKlassSize* tests for CDS enabled mode
Wed, 20 Jun 2018 22:02:46 +0200 gromero 8204135: jtreg: Fix failing RTM test TestUseRTMXendForLockBusy
Wed, 20 Jun 2018 12:42:43 -0700 iignatyev 8205433: clean up hotspot ProblemList
Thu, 21 Jun 2018 13:58:29 -0700 mikael Merge
Wed, 20 Jun 2018 13:57:38 -0400 gadams 6545967: sp05t003 failed ResumeThread() due to THREAD_NOT_SUSPENDED
Wed, 20 Jun 2018 10:01:49 -0700 bsrbnd 8203338: Unboxing in return from lambda miscompiled to throw ClassCastException
Wed, 20 Jun 2018 17:54:40 +0100 chegar Merge
Wed, 20 Jun 2018 17:48:39 +0100 chegar Merge
Wed, 20 Jun 2018 09:05:57 -0700 chegar 8204679: HTTP Client refresh
Wed, 20 Jun 2018 09:38:17 -0700 erikj 8200115: System property java.vm.vendor value includes quotation marks
Wed, 20 Jun 2018 09:42:36 -0700 mseledtsov 8204701: [TESTBUG] runtime/SharedArchiveFile/BootAppendTests.java should handle mapping failure
Wed, 20 Jun 2018 17:15:16 +0200 stuefe 8205407: [windows, vs<2017] C4800 after 8203197
Wed, 20 Jun 2018 17:06:24 +0200 redestad 8199435: Unsafe publication of java.util.Properties.map
Tue, 19 Jun 2018 10:00:39 -0400 chrisphi 8203030: Zero s390 31 bit size_t type conflicts in shared code
Wed, 20 Jun 2018 11:47:07 +0100 mcimadamore 8195293: Issue more comprehensive warnings for use of \"var\" in earlier source versions
Wed, 20 Jun 2018 11:33:43 +0200 pliden 8205339: ZGC: VerifyBeforeIteration not yet supported
Wed, 20 Jun 2018 11:33:42 +0200 pliden 8205338: ZGC: LeakProfiler not yet supported
Wed, 20 Jun 2018 14:52:32 +0530 pmuthuswamy 8202624: javadoc generates references to enum constructors, which are not documented
Wed, 20 Jun 2018 11:12:58 +0200 goetz 8205108: [testbug] Fix pattern matching in jstatd tests.
Wed, 20 Jun 2018 06:51:39 +0200 stuefe 8205141: runtime/exceptionMsgs/ArrayStoreException/ArrayStoreExceptionTest.java failed with "assert(k->is_objArray_klass()) failed: cast to ObjArrayKlass
Tue, 19 Jun 2018 17:50:32 -0700 cjplummer 8205149: hs201t002 should be put on the problem list
Tue, 19 Jun 2018 23:33:31 +0000 valeriep 8204152: SignedObject throws NullPointerException for null keys with an initialized Signature object
Tue, 19 Jun 2018 09:34:41 +0200 stuefe 8203680: os::stat() on Posix platform does not need to copy input path
Fri, 15 Jun 2018 13:57:32 -0400 apetushkov 8153107: enabling ObjectSynchronizer::quick_enter() on ARM64 causes hangs
Tue, 19 Jun 2018 19:19:43 +0200 pliden 8205344: TraceMemoryManagerStats changes in JDK-8195115 broke ZGC
Tue, 19 Jun 2018 19:16:08 +0200 mgronlun 8204571: Add support for launching multiple startup recordings
Tue, 19 Jun 2018 10:12:35 -0700 prr Merge
Tue, 19 Jun 2018 10:12:00 -0700 prr Merge
Tue, 19 Jun 2018 12:04:01 +0530 vagarwal 8200605: Create test for GridBagLayoutDemo
Tue, 19 Jun 2018 09:22:38 -0700 prr Merge
Fri, 15 Jun 2018 13:07:46 -0700 prr Merge
Fri, 15 Jun 2018 13:05:34 -0700 prr 8204929: Fonts with embedded bitmaps are not always rotated
Fri, 15 Jun 2018 23:59:56 +0530 psadhukhan 8199441: Wrong caret position in multiline text components on Windows with a screen resolution higher than 100%
Fri, 15 Jun 2018 23:38:59 +0530 psadhukhan 8202199: Provide public, unsupported JDK API for JavaFX/Swing interop
Wed, 13 Jun 2018 12:54:41 +0100 dmarkov 8200353: Shift or Capslock not working in Textfield after accented keystrokes
Wed, 13 Jun 2018 10:59:27 +0530 mhalder 8204859: [macosx] Remove javax/swing/plaf/nimbus/8057791/bug8057791.java from the ProblemList.txt
Tue, 12 Jun 2018 15:14:22 -0700 prr Merge
Tue, 12 Jun 2018 14:53:57 -0700 serb 8204454: Remove of sun.applet.AppletAudioClip
Tue, 12 Jun 2018 12:18:57 -0700 prr 8191512: T2K font rasterizer code removal
Tue, 12 Jun 2018 09:26:49 -0700 serb 8202768: [macos] Appkit thread slows when any Window Manager active
Mon, 11 Jun 2018 14:06:58 +0530 mhalder 8029250: [macosx] There is no tray icon shown in the system tray area when case starts
Sun, 10 Jun 2018 18:04:43 -0700 prr 8204509: Fix compilation error in harfbuzz 1.7.6 for Solaris Developer Studio 12.6
Sat, 09 Jun 2018 13:33:35 -0700 serb 6608234: SwingWorker.get throws CancellationException
Tue, 19 Jun 2018 07:15:00 -0400 gadams 8205055: Fix compilation optimization errors with new Solaris toolchain
Tue, 19 Jun 2018 07:14:49 -0400 gadams 8205110: Fix xchip warnings with new Solaris toolchain
Tue, 19 Jun 2018 19:21:30 +0300 dchuyko 8205341: AARCH64: Clean up duplicate uzp1 & uzp2 instruction definition
Tue, 19 Jun 2018 08:19:54 -0700 naoto 8042131: DateTimeFormatterBuilder Mapped-values do not work for JapaneseDate
Tue, 19 Jun 2018 18:18:46 +0300 dchuyko 8198719: MethodHandleHelper.linkToStatic should drop MH arg
Tue, 19 Jun 2018 18:18:25 +0300 dpochepk 8204353: AARCH64: optimize FPU load and stores in macroAssembler
Tue, 19 Jun 2018 18:14:25 +0300 dpochepk 8204473: AARCH64: register post-index addressing mode is not supported directly
Tue, 19 Jun 2018 16:44:41 +0200 erikj 8205183: Warning about using VS2017 should be removed
Tue, 19 Jun 2018 16:29:48 +0200 mdoerr 8205172: 32 bit build broken
Tue, 19 Jun 2018 16:14:39 +0200 rehn 8205006: Assertion failure when rehashing stringtable
Tue, 19 Jun 2018 05:22:07 -0700 vromero 8205052: No compilation error thrown when no valid parameterization exists for functional interface type
Tue, 19 Jun 2018 05:18:49 -0700 phh 8195115: G1 Old Gen MemoryPool CollectionUsage.used values don't reflect mixed GC results
Tue, 19 Jun 2018 07:54:11 -0400 lfoltan 8202605: Standardize on ClassLoaderData::loader_name() throughout the VM to obtain a class loader's name
Fri, 15 Jun 2018 12:31:28 +0200 goetz 8204268: Improve some IncompatibleClassChangeError messages.
Tue, 19 Jun 2018 12:25:42 +0200 thartmann 8205033: [REDO] Induction variable of over-unrolled loop conflicts with range checks
Tue, 19 Jun 2018 12:22:02 +0200 rwestberg 8204957: Remove TestBiasedLockRevocationEvents from ProblemList.txt
Tue, 19 Jun 2018 12:20:05 +0200 rwestberg 8204236: JFR unit test of thread CPU load should be enabled
Tue, 19 Jun 2018 12:11:37 +0200 pliden 8205064: Fail immediately if an unavailable GC is selected
Tue, 19 Jun 2018 11:27:05 +0200 rkennke 8204941: Refactor TemplateTable::_new to use MacroAssembler helpers for tlab and eden
Fri, 15 Jun 2018 13:57:37 +0200 neliasso 8204927: ZGC: assert(phase->idom(head) == head->in(LoopNode::EntryControl)) failed
Tue, 19 Jun 2018 10:57:13 +0200 rehn 8204166: TLH: Semaphore may not be destroy until signal have returned.
Tue, 19 Jun 2018 09:43:53 +0200 simonis 8204965: Fix '--disable-cds' and disable CDS on AIX by default
Tue, 19 Jun 2018 09:34:39 +0200 tschatzl 8205043: Make parallel reference processing default for G1
Tue, 19 Jun 2018 09:08:39 +0200 roland 8203197: C2: consider all paths in loop body for loop predication
Tue, 19 Jun 2018 08:44:31 +0200 stefank 8205163: ZGC: Keeps finalizable marked PhantomReference referents strongly alive
Thu, 07 Jun 2018 10:11:36 +0200 stefank 8204538: Split ScanClosure and ScanClosureWithParBarrier
Mon, 18 Jun 2018 18:49:34 -0700 cushon 8198669: Refactor annotation array value parsing to reduce duplication
Tue, 19 Jun 2018 09:45:54 +0530 pmuthuswamy 8205148: Turn off logging in jQuery-migrate
Mon, 18 Jun 2018 16:58:16 -0700 iignatyev 8202559: Tests which start VM using JNI start failing after compile upgrade to VC 2017
Mon, 18 Jun 2018 22:43:38 -0400 bulasevich 8203479: JFR enabled ARM32 build assertion failure
Mon, 18 Jun 2018 20:50:23 -0400 bulasevich 8204961: JVMTI jtreg tests build warnings on 32-bit platforms
Mon, 18 Jun 2018 20:43:42 -0400 lkorinth 8205054: Could not find "lsof" on test machine
Tue, 19 Jun 2018 08:06:35 +0800 weijun 8177334: Update xmldsig implementation to Apache Santuario 2.1.1
Mon, 18 Jun 2018 15:24:48 -0700 kvn 8205181: ProblemList applications/ctw/modules/java_desktop_2.java
Mon, 18 Jun 2018 13:52:30 -0700 jjg 8204330: Javadoc IllegalArgumentException: HTML special chars in constant value
Mon, 18 Jun 2018 13:40:16 -0700 jjg 8149565: -locale option issues
Mon, 18 Jun 2018 10:13:58 -0700 psandoz 8170159: Improve the performance of BitSet traversal
Mon, 18 Jun 2018 09:48:22 -0700 dlong 8204231: Update Graal
Mon, 18 Jun 2018 16:13:21 +0200 rehn 8204857: ConcurrentHashTable: Fix parallel processing
Mon, 18 Jun 2018 14:36:50 +0200 mbaesken 8205091: AIX: build errors in hotspot after 8203641: Refactor String Deduplication into shared
Mon, 18 Jun 2018 12:11:59 +0200 tschatzl 8043575: Dynamically parallelize reference processing work
Tue, 29 May 2018 09:26:00 +0200 tschatzl 8202845: Refactor reference processing for improved parallelism
Mon, 18 Jun 2018 08:07:15 +0530 sdama 8196988: Resolve disabled warnings for libjimage
Fri, 15 Jun 2018 17:34:01 -0700 henryjen 8199871: Deprecate pack200 and unpack200 tools
Sat, 16 Jun 2018 10:10:54 +0100 alanb 8199433: (se) select(Consumer<SelectionKey> action) as alternative to selected-key set
Fri, 15 Jun 2018 12:25:53 +0200 goetz 8204943: Improve message of ArrayStoreException.
Sat, 16 Jun 2018 07:05:09 +0200 stuefe 8204958: Minor cleanups for the diagnostic framework
Fri, 15 Jun 2018 16:53:58 -0400 kbarrett 8204939: Change Access nomenclature: root to native
Fri, 15 Jun 2018 13:08:32 -0700 mchung 8205116: jdeps --system $java.home fails with IAE
Fri, 15 Jun 2018 12:48:19 -0700 bpb 8205062: (fs) Improve some print diagnostics in java/nio/file/Files/CopyAndMove.java
Thu, 14 Jun 2018 23:09:11 -0700 vtheeyarath 8202216: Add Buffer mismatch methods
Fri, 15 Jun 2018 11:44:49 -0700 mchung 8205112: Remove non-existent modules from test/jdk/jdk/modules/etc/UpgradeableModules.java
Fri, 15 Jun 2018 11:44:20 -0700 mchung 8200121: Remove unused qualified exports in java.base
Fri, 15 Jun 2018 11:15:32 -0700 erikj 8203667: Platform specific include files in jdk image in wrong sub directory
Fri, 15 Jun 2018 19:24:15 +0100 mcimadamore 8203838: javac performance regression in 11+11
Thu, 14 Jun 2018 17:32:31 -0700 cushon 7183985: (ann) Class.getAnnotation() throws an ArrayStoreException when the annotation class not present
Fri, 15 Jun 2018 09:53:28 -0700 erikj 8204973: Add build support for filtering translations
Fri, 15 Jun 2018 09:16:48 -0700 kvn 8184349: There should be some verification that EnableJVMCI is disabled if a GC not supporting JVMCI is selected
Fri, 15 Jun 2018 08:28:08 -0700 kvn 8202948: C2: assert(init_offset >= 0) failed: positive offset from object start
Fri, 15 Jun 2018 16:44:41 +0200 dnsimon 8205025: [AOT] make jdk.aot module upgradeable
Fri, 15 Jun 2018 15:07:45 +0200 ihse 8200867: Remove references to "jdk 9" in build system
Fri, 15 Jun 2018 13:31:50 +0200 pliden 8205050: ZGC: Incorrect use of RootAccess in ZHeapIterator
Fri, 15 Jun 2018 13:31:43 +0200 pliden 8205028: ZGC: Remove incorrect comment in ZHeap::object_iterate()
Fri, 15 Jun 2018 13:31:36 +0200 pliden 8205024: ZGC: Worker threads boost mode not always enabled when is should be
Fri, 15 Jun 2018 13:31:27 +0200 pliden 8205022: ZGC: SoftReferences not always cleared before throwing OOME
Fri, 15 Jun 2018 13:31:20 +0200 pliden 8205020: ZGC: Apply workaround for buggy sem_post() in glibc < 2.21
Thu, 14 Jun 2018 14:32:03 +0200 goetz 8204654: [testbug] Fix pattern matching in jstat tests.
Fri, 15 Jun 2018 02:31:37 -0700 jcbeyler 8205096: Add missing files for 8203394
Fri, 15 Jun 2018 00:49:54 -0700 jcbeyler 8203394: Implementation of JEP 331: Low-Overhead Heap Profiling
Mon, 11 Jun 2018 15:28:24 +0200 roland 8204240: Extend MDO to allow more reasons to be recorded per bci
Fri, 15 Jun 2018 11:58:34 +0530 rgoel 8202537: CLDR33
Fri, 15 Jun 2018 10:48:56 +0530 pmuthuswamy 8204666: javadoc should be updated to use jQuery 3.3.1
Thu, 14 Jun 2018 09:59:21 -0400 zgu 8203641: Refactor String Deduplication into shared
Thu, 14 Jun 2018 15:27:49 -0700 epavlova 8205074: [Graal] Add rest of compiler/stable tests into ProblemList-graal.txt
Thu, 14 Jun 2018 21:49:46 +0200 stuefe 8203343: VM.{metaspace|classloaders|classhierarchy...} jcmd should show invocation targets for Generated{Method|Constructor}AccessorImpl classes
Wed, 13 Jun 2018 16:32:02 -0700 lmesnik 8203491: [TESTBUG] Port heapdump tests into java
Thu, 14 Jun 2018 09:31:59 -0700 darcy 8205003: Replace selected link tags with linkplain in java.lang.Class
Thu, 14 Jun 2018 10:33:54 -0400 hseigel 8204620: ModuleEntry::is_non_jdk_module() determination for what is a jdk module is incorrect
Thu, 14 Jun 2018 05:50:21 -0700 bsrbnd 8203813: javac accepts an illegal name as a receiver parameter name
Thu, 14 Jun 2018 09:38:31 -0300 jlaskey 8204172: Predicate::not should explicitly mention "NullPointerException - if target is null"
Thu, 14 Jun 2018 13:16:21 +0200 jlahoda 8196618: Create API to list supported values for javac --release option
Thu, 14 Jun 2018 13:07:33 +0200 tschatzl 8204169: Humongous continues region remembered set states do not match the one from the corresponding humongous start region
Thu, 14 Jun 2018 11:13:39 +0100 mcimadamore 8178150: Regression in logic for handling inference stuck constraints
Thu, 14 Jun 2018 11:13:30 +0200 lkorinth 8202740: runtime/8176717/TestInheritFD.java fails with java.lang.RuntimeException: could not match: VM RESULT => RETAINS FD
Thu, 14 Jun 2018 11:46:53 +0200 ihse 8204664: PrepareFailureLogs should be done after sequential make targets
Thu, 14 Jun 2018 11:22:04 +0200 thartmann 8205034: [BACKOUT] Induction variable of over-unrolled loop conflicts with range checks
Thu, 14 Jun 2018 16:56:58 +0900 ysuenaga 8204531: Remove unused chars following '\0'
Thu, 14 Jun 2018 00:07:10 -0700 epavlova 8204978: [Graal] Disable Epsilon GC tests from running with Graal
Thu, 14 Jun 2018 09:04:55 +0200 thartmann 8203915: Induction variable of over-unrolled loop conflicts with range checks
Thu, 14 Jun 2018 02:01:31 -0400 dholmes 8204668: Cleanup management of the java.vm.info System property
Thu, 14 Jun 2018 07:26:27 +0200 rehn 8204613: StringTable: Calculates wrong number of uncleaned items.
Thu, 14 Jun 2018 09:48:04 +0800 amlu 8204944: Remove java/util/Map/InPlaceOpsCollisions.java from ProblemList
Thu, 14 Jun 2018 02:49:19 +0200 jwilhelm Added tag jdk-11+18 for changeset e1b3def12624
Wed, 13 Jun 2018 13:12:50 -0700 bpb 8204915: (fs) Add some print diagnostics to java/nio/file/Files/CopyAndMove.java
Wed, 13 Jun 2018 12:50:45 -0700 joehw 8201276: (fs) Add methods to Files for reading/writing a string from/to a file
Wed, 13 Jun 2018 10:36:13 -0700 dtitov 8203809: [Graal] JDI tests fail with: JDITestRuntimeException : ** event IS NOT a breakpoint **
Wed, 13 Jun 2018 07:53:27 +0200 stuefe 8204935: [aix] TOC overflow in libjvm.so (release build)
Wed, 13 Jun 2018 20:11:18 +0200 stuefe 8204663: clean up remaining native parts after JDK-8187631
Wed, 13 Jun 2018 13:48:39 -0400 bobv Merge
Wed, 13 Jun 2018 13:44:56 -0400 bobv Merge
Tue, 12 Jun 2018 18:53:38 -0400 bobv Merge
Tue, 12 Jun 2018 18:51:45 -0400 bobv 8203357: Container Metrics
Tue, 12 Jun 2018 18:44:01 -0400 bobv 8203691: Test /runtime/containers/cgroup/PlainRead.java fails
Wed, 13 Jun 2018 10:47:14 -0700 erikj 8204922: Create bootcycle jib profiles
Tue, 12 Jun 2018 22:23:35 -0700 vtheeyarath 8204342: methods in java.time s TCKZoneRules OpenJDK test miss Test annotation
Wed, 13 Jun 2018 08:44:23 -0700 rhalade 8204923: Restore Symantec root verisignclass2g2ca
Wed, 13 Jun 2018 15:08:08 +0200 eosterlund 8203344: Make C1 leal patchable on SPARC
Wed, 13 Jun 2018 12:52:21 +0200 jlahoda 8193302: Javac AssertionError: typeSig ERROR on usage of @Generated
Wed, 13 Jun 2018 10:34:51 +0200 glaubitz 8203301: Linux-sparc fails to build after JDK-8199712 (Flight Recorder)
Wed, 13 Jun 2018 10:15:35 +0200 rkennke 8204685: Abstraction for TLAB dummy object
Wed, 13 Jun 2018 10:01:53 +0200 rkennke 8203157: Object equals abstraction for BarrierSetAssembler
Wed, 13 Jun 2018 06:35:04 +0200 stuefe 8202772: NMT thread stack tracking causes crashes on AIXjdk-11+18
Tue, 12 Jun 2018 21:29:47 -0700 kvn 8201193: Use XMM/YMM for objects initialization
Mon, 11 Jun 2018 14:06:50 -0700 cushon 8203679: AssertionError in DeferredAttr with parenthesized method reference
Tue, 12 Jun 2018 18:12:59 -0400 kbarrett 8204585: Remove IN_ARCHIVE_ROOT from Access API
Tue, 12 Jun 2018 14:08:24 -0700 bchristi 8204565: (spec) Document java.{vm.}?specification.version system properties' relation to $FEATURE
Tue, 12 Jun 2018 13:24:37 -0700 smarks 8204243: remove Thread.destroy() and Thread.stop(Throwable)
Tue, 12 Jun 2018 11:34:48 -0700 rhalade 8196141: Add GoDaddy root certificates
Mon, 11 Jun 2018 15:32:43 +0100 aph 8204680: Disassembly does not display code strings in stubs
Tue, 12 Jun 2018 13:07:47 -0400 rriggs 8197930: JNI exception pending in initializeEncoding of jni_util.c
Tue, 12 Jun 2018 11:21:07 -0400 zgu 8204557: NMT: Linux os::committed_in_range() does not break out outer loop when contiguous region is found
Tue, 12 Jun 2018 17:40:28 +0200 pliden 8204210: Implementation: JEP 333: ZGC: A Scalable Low-Latency Garbage Collector (Experimental)
Tue, 12 Jun 2018 07:52:30 -0700 kvn 8204113: Upgrade linker used in AOT tests to be same version as build toolchain
Tue, 12 Jun 2018 15:03:00 +0200 shade 8204180: Implementation: JEP 318: Epsilon, A No-Op Garbage Collector
Tue, 12 Jun 2018 18:30:52 +0530 sdama 8204861: fix for 8196993 has broken the build on linux
Tue, 12 Jun 2018 10:01:23 +0200 shade 8204850: BarrierSet::make_* should be static
Tue, 12 Jun 2018 11:11:59 +0000 adinn Merge
Tue, 12 Jun 2018 10:27:49 +0000 aph 8204606: [Aarch64] SIGSEGVs caused by C1 because of improper register usage
Tue, 12 Jun 2018 12:14:46 +0200 jlahoda 8204674: Inconsistent lambda parameter span
Sun, 10 Jun 2018 20:53:10 +0100 smonteith 8204628: [AArch64] Assertion failure in BarrierSetAssembler::load_at
Wed, 30 May 2018 14:46:17 +0200 goetz 8204477: Count linkage errors and print in Exceptions::print_exception_counts_on_error
Wed, 30 May 2018 14:46:17 +0200 goetz 8204476: Add additional statistics to CodeCache::print_summary
Tue, 12 Jun 2018 14:16:41 +0530 sdama 8196993: Resolve disabled warnings for libunpack
Mon, 11 Jun 2018 22:35:07 -0400 kbarrett 8204097: Simplify OopStorage::AllocateList block entry access
Tue, 12 Jun 2018 08:51:28 +0800 xyin 8201528: Add new test to check for package versioning information in OpenJDK
Tue, 12 Jun 2018 01:31:49 +0200 erikj 8204127: Change bundle format on Windows to zip
Mon, 11 Jun 2018 21:56:58 +0000 valeriep 8178374: Problematic ByteBuffer handling in CipherSpi.bufferCrypt method
Mon, 11 Jun 2018 14:29:38 -0700 epavlova 8204694: Add failed compiler/stable tests into ProblemList-graal.txt
Mon, 11 Jun 2018 19:39:05 +0000 valeriep 8194073: Invalid SunNativeProvider.INSTANCE initialization
Mon, 11 Jun 2018 20:18:38 +0200 ihse 8204682: Parsing for LOG=report=none is broken when combined with other keywords
Mon, 11 Jun 2018 19:09:15 +0200 simonis 8204684: [AIX] Build of libjli_static broken after change 8204572 (SetupJdkLibrary)
Mon, 11 Jun 2018 09:40:20 -0700 ccheung 8204563: UseAppCDS obsolete message confusing
Fri, 08 Jun 2018 14:14:44 +0200 mbaesken 8204598: add more thread-related system settings info to hs_error file on Linux
Mon, 11 Jun 2018 14:16:43 +0200 roland 8202747: C2: assert(mode == ControlAroundStripMined && use == sfpt) failed: missed a node
Sun, 10 Jun 2018 17:26:13 +0200 goetz 8204652: [aix] fix thread stack allocation, too big stack sizes not recognized
Mon, 11 Jun 2018 12:09:59 +0200 tschatzl 8204618: The parallel GC reference processing task executor enqueues a wrong number of tasks into the queue
Mon, 11 Jun 2018 12:09:57 +0200 tschatzl 8204617: ParallelGC parallel reference processing does not set MT degree in reference processor
Sun, 10 Jun 2018 12:58:38 +0300 dsamersoff 8202705: ARM32 build crashes on long JavaThread offsets
Sat, 09 Jun 2018 20:57:43 -0700 mchung 8204648: test/jdk/tools/launchers/SourceMode.java fails with long shebang line
Fri, 08 Jun 2018 15:24:51 -0700 jjg 8204588: Test failures after "Launch Single-File Source-Code Programs"
Mon, 04 Jun 2018 15:11:17 +0200 rkennke 8203172: Primitive heap access for interpreter BarrierSetAssembler/aarch64
Fri, 08 Jun 2018 13:32:51 -0700 prr Merge
Fri, 08 Jun 2018 12:51:46 -0700 prr Merge
Fri, 08 Jun 2018 12:52:50 +0530 psadhukhan 8202864: [TESTBUG] Need to replace the image used in two Swing tests
Thu, 07 Jun 2018 11:35:42 -0700 prr 8204126: MonospacedGlyphWidthTest.java failed again
Wed, 06 Jun 2018 15:37:10 -0700 serb 8203224: java.awt.desktop.*Event classes could not be instantiated if Desktop feature is not supported
Wed, 06 Jun 2018 13:16:12 -0700 erikj 8200132: Remove jre images and bundles
Wed, 06 Jun 2018 13:04:25 -0700 prr 8204187: Remove proprietary JPEG code from javax.imageio
Wed, 06 Jun 2018 12:51:44 -0700 prr 8203796: Define API to support specifying ownership of print dialogs
Wed, 06 Jun 2018 12:35:44 -0700 prr 8204496: backout fix for 8203796 which was pushed under another ID
Wed, 06 Jun 2018 10:44:27 -0700 prr 8203499: Uninitialised memory in WinAccessBridge.cpp
Wed, 06 Jun 2018 09:41:16 -0700 prr Merge
Mon, 04 Jun 2018 16:11:21 +0200 mbaesken 8204211: windows : handle potential C++ exception in GDIRenderer
Tue, 05 Jun 2018 14:42:21 -0700 prr 8203499: Uninitialised memory in WinAccessBridge.cpp
Mon, 04 Jun 2018 20:32:19 -0700 serb 8196030: AWT Robot mouseMove fails on Windows 10 1709 with HiDPI
Mon, 04 Jun 2018 19:36:28 -0700 serb 8204118: [macos] Nonsensical self == [super init] in CFileDialog.m
Mon, 04 Jun 2018 19:01:16 -0700 serb 8203308: Remove the appletviewer classes
Mon, 04 Jun 2018 10:54:20 -0700 prr 8203367: Upgrade to freetype 2.9.1
Wed, 09 Aug 2017 14:54:37 -0700 naoto 8202088: Japanese new era implementation
Fri, 08 Jun 2018 11:38:40 -0700 dl 8204375: Add TimeUnit#convert(Duration)
Fri, 08 Jun 2018 11:04:58 -0700 ccheung 8204110: serviceability/sa/ClhsdbSymbol.java and ClhsdbInspect.java failed when running in CDS mode
Fri, 08 Jun 2018 10:09:40 -0700 sherman 8204229: Formatter and String.format ignore the width with the percent modifier (%5%)
Fri, 08 Jun 2018 09:37:52 -0700 martin 8204377: Rename Object#wait parameter name from "timeout" to "timeoutMillis"
Fri, 08 Jun 2018 09:36:10 -0700 martin 8204444: java.time cleanup
Fri, 08 Jun 2018 18:15:58 +0200 ihse 8204602: Add devkit for linux-arm32
Fri, 08 Jun 2018 18:11:32 +0200 ihse 8204572: SetupJdkLibrary should setup SRC and -I flags automatically
Fri, 08 Jun 2018 11:30:10 +0200 eosterlund 8204504: Fix for 8198285 breaks slowdebug builds
Fri, 08 Jun 2018 21:06:54 +0530 sdama 8196990: Resolve disabled warnings for libjli
Fri, 08 Jun 2018 16:33:40 +0100 mcimadamore 8204610: Compiler confused by parenthesized "this" in final fields assignments
Fri, 08 Jun 2018 08:30:18 -0700 mchung 8204584: jdeps generates illegal dot file containing ranksep=0,600000
Fri, 08 Jun 2018 07:58:19 -0700 bpb 8204576: (fs) java/nio/file/Files/CopyAndMove.java does not set isUnix = true on macOS
Fri, 08 Jun 2018 14:50:18 +0200 neliasso 8203425: assert(is_Loop()) failed: invalid node class
Fri, 08 Jun 2018 13:06:08 +0200 mbaesken 8204539: improve error messages in matchJavaTZ [windows]
Fri, 08 Jun 2018 11:41:43 +0200 shade 8204479: Bitwise AND on byte value sometimes produces wrong result
Fri, 08 Jun 2018 11:11:06 +0200 hannesw 8204290: Add check to limit number of capture groups
Fri, 08 Jun 2018 11:08:38 +0200 hannesw 8204288: Matching the end of a string followed by an empty greedy regex and a word boundary fails
Fri, 08 Jun 2018 10:22:26 +0200 simonis 8204335: [ppc] Assembler::add_const_optimized incorrect for some inputs
Thu, 07 Jun 2018 15:08:16 +0200 goetz 8204549: [aix][testbug] signal tests fail because vm can not start in primordial thread.
Fri, 08 Jun 2018 06:59:16 +0200 rrich 8204561: JVM_GetClassSigners: wrap signers oop in an objArrayHandle for subsequent safepoint
Thu, 07 Jun 2018 22:26:02 -0400 dholmes 8204589: ProblemList failing launcher tests
Thu, 07 Jun 2018 19:01:18 -0700 cjplummer 8203329: JDWP/JDI VM information string is incorrect
Thu, 07 Jun 2018 17:38:34 -0700 kvn 8202611: [GRAAL] Exclude CMS GC testing from runs with Graal
Thu, 07 Jun 2018 17:10:23 -0700 iignatyev 8204577: jittester generator doesn't kill processes on timeout
Thu, 07 Jun 2018 16:06:49 -0700 jjg 8201274: Launch Single-File Source-Code Programs
Thu, 07 Jun 2018 23:30:05 +0200 ihse 8203822: AIX version of jsig.c was not removed in JDK-8200298
Thu, 07 Jun 2018 13:24:49 -0700 sherman 8203839: API clarification: versioned jar entry verification in multi-release jar file
Thu, 07 Jun 2018 21:57:17 +0200 pliden 8204474: Have instanceRefKlass use HeapAccess when loading the referent
Wed, 06 Jun 2018 23:36:08 +0300 vlivanov 8203480: IncompatibleClassChangeError thrown at sites linked to default interface methods
Thu, 07 Jun 2018 17:40:15 +0200 eosterlund 8204554: JFR TLAB tracing broken after 8202776
Thu, 07 Jun 2018 07:43:29 -0700 bpb 8201407: Files.move throws DirectoryNonEmptyException when moving directory across file system
Thu, 07 Jun 2018 15:10:06 +0200 eosterlund 8203353: Fixup inferred decorators in the interpreter
Thu, 07 Jun 2018 14:11:56 +0200 rehn 8195097: Make it possible to process StringTable outside safepoint
Thu, 07 Jun 2018 06:27:09 -0400 lancea 8201608: fix broken links in javax/sql/rowset/package.html and javax/sql/rowset/spi/package.html
Thu, 07 Jun 2018 12:23:46 +0200 stuefe 8203682: Add jcmd "VM.classloaders" command to print out class loader hierarchy, details
Thu, 07 Jun 2018 11:20:55 +0200 tschatzl 8202049: G1: ReferenceProcessor doesn't handle mark stack overflow
Thu, 07 Jun 2018 11:20:30 +0200 tschatzl 8204081: Mismatch in rebuild policy and collection set chooser causes remembered sets to be kept errorneously
Thu, 07 Jun 2018 11:20:18 +0200 tschatzl 8204084: Remove the G1RSBarrierRegionFilter develop flag
Thu, 07 Jun 2018 09:18:39 +0100 alanb 6350055: (se) SelectionKey.interestOps variants to atomically update interest ops
Thu, 07 Jun 2018 09:02:03 +0200 sjohanss 8204287: Phase timings not updated correctly after JDK-6672778
Wed, 06 Jun 2018 13:58:57 -0700 dtitov 8203033: [Testbug] vmTestbase/nsk/jdi/TypeComponent/isSynthetic/issynthetic002/TestDescription.java fails with nestmates
Wed, 06 Jun 2018 19:47:22 -0700 sspitsyn 8200387: [Graal] fromTonga/nsk/jdi tests hang with Graal as JIT
Thu, 07 Jun 2018 01:33:09 +0200 jwilhelm Added tag jdk-11+17 for changeset 64e4b1686141
Wed, 06 Jun 2018 15:10:12 -0700 jjg 8204303: Add redirect for overview-summary.html
Wed, 06 Jun 2018 14:36:48 -0700 sherman 8204494: Fix for 8200530 triggered regression, closed/test/jdk/security/infra/java/security/KeyStore/BouncyCastleInterop.java failed
Wed, 06 Jun 2018 17:10:37 -0400 dholmes 8174734: Safepoint sync time did not increase
Wed, 06 Jun 2018 09:37:44 -0700 dlong 8204199: Test fails after 8202670 Graal updatejdk-11+17
Wed, 06 Jun 2018 08:32:08 -0700 vromero 8204322: "+=" applied to String operands can provoke side effects
Wed, 06 Jun 2018 10:45:40 -0400 coleenp 8204301: Make OrderAccess functions available to hpp rather than inline.hpp files
Wed, 06 Jun 2018 15:36:29 +0200 jlahoda 8203891: Upgrade JOpt Simple to 5.0.4
Wed, 06 Jun 2018 13:06:21 +0100 aph Merge
Tue, 05 Jun 2018 17:50:31 +0100 aph 8204348: AArch64: Remove C2 address reshaping code
Wed, 06 Jun 2018 12:17:01 +0100 alanb 8203937: Not possible to read data from socket after write detects connection reset
Wed, 06 Jun 2018 14:16:51 +0530 nishjain 8203872: Upgrading JDK with latest available LSR data from IANA.
Wed, 06 Jun 2018 10:11:23 +0200 mdoerr 8204345: [s390]: no precompiled headers build broken
Tue, 05 Jun 2018 23:06:32 -0700 ljiang 8193552: ISO 4217 amendment 165
Wed, 06 Jun 2018 09:07:38 +0530 pmuthuswamy 8190875: modules not listed in overview/index page
Wed, 06 Jun 2018 08:37:19 +0530 pmuthuswamy 8199893: the javadoc tool generates pages with a low constrast
Tue, 05 Jun 2018 19:58:20 -0400 dholmes 8199882: compiler/uncommontrap/TestDeoptOOM.java failed w/ fatal error: ExceptionMark constructor expects no pending exceptions
Tue, 05 Jun 2018 21:38:38 +0200 rkennke 8200623: Primitive heap access for interpreter BarrierSetAssembler/x86
Tue, 05 Jun 2018 12:27:07 -0700 sherman 8197989: java/util/zip/ZipFile/TestCleaner.java failed with "cleaner failed to clean zipfile
Wed, 02 May 2018 11:28:49 -0400 coleenp 8203837: Split nmethod unloading from inline cache cleaning
Tue, 05 Jun 2018 23:10:54 +0530 sundar 8204321: javadoc tests fail after JDK-8203780
Tue, 05 Jun 2018 19:13:53 +0200 rkennke 8202776: Modularize GC allocations in runtime
Tue, 05 Jun 2018 10:03:46 -0700 sherman 8200530: '\r' is not supported as "newline" in java.util.jar.Manifest
Tue, 05 Jun 2018 17:14:49 +0100 aph Merge
Tue, 05 Jun 2018 16:12:57 +0100 aph 8204341: AArch64: AOT runtime does not need a workaround for far calls
Tue, 05 Jun 2018 08:33:40 -0700 naoto 8203324: Use out of scope in getMacOSXLocale of java_props_macosx.c:120
Tue, 05 Jun 2018 11:11:33 -0400 coleenp 8204237: Clean up incorrectly included .inline.hpp files from jvmciJavaClasses.hpp
Tue, 05 Jun 2018 15:56:23 +0200 stefank 8204173: Lower the minimum number of heap memory pools in MemoryTest.java
Tue, 05 Jun 2018 15:56:21 +0200 stefank 8204168: Increase small heap sizes in tests to accommodate ZGC
Tue, 05 Jun 2018 15:56:17 +0200 stefank 8204167: Filter out tests requiring compressed oops when CompressedOops is disabled
Tue, 05 Jun 2018 15:56:14 +0200 stefank 8204165: Filter out tests requiring class unloading when ClassUnloading is disabled
Tue, 05 Jun 2018 15:56:12 +0200 stefank 8204163: Also detect concurrent GCs in MetaspaceBaseGC.java
Tue, 05 Jun 2018 15:56:09 +0200 stefank 8204162: TestG1HeapRegion needs @requires vm.gc.G1
Tue, 05 Jun 2018 15:56:07 +0200 stefank 8204160: BiasedLockingTest needs -XX:+UseBiasedLocking
Tue, 05 Jun 2018 09:15:03 -0400 kbarrett 8203319: JDK-8201487 disabled too much queue balancing
Tue, 05 Jun 2018 14:55:13 +0200 jlahoda 8200166: Repeating annotations refering to to-be-generated classes don't work.
Tue, 05 Jun 2018 13:02:01 +0200 glaubitz 8203787: Hotspot build broken on linux-sparc after 8202377
Tue, 05 Jun 2018 09:29:15 +0200 mhorie 8154736: enhancement of cmpxchg and copy_to_survivor for ppc64
Tue, 05 Jun 2018 09:23:30 +0200 mdoerr 8204292: PPC64: Fix missing includes after 8204195
Mon, 04 Jun 2018 21:20:16 -0700 sangheki 8204094: assert(worker_i < _length) failed: Worker 15 is greater than max: 11 at ReferenceProcessorPhaseTimes
Mon, 04 Jun 2018 21:19:15 -0700 sangheki 8204095: [TESTBUG] TestPrintReferences.java fails if multiple concurrent mark happens
Tue, 05 Jun 2018 08:10:08 +0530 sundar 8203780: javadoc should be updated to use jquery 1.12.4, jquery-ui 1.12.1 and jszip v3.1.5
Tue, 05 Jun 2018 02:15:37 +0200 jwilhelm 8204103: Mark test serviceability/dcmd/compiler/CompilerQueueTest.java as intermittent and exclude it from tier1
Mon, 04 Jun 2018 20:14:13 -0400 kbarrett 8203948: Expand JVMTI callback notion of "internal threads"
Mon, 04 Jun 2018 16:21:08 +0200 rwestberg 8202095: JFR TestBiasedLockRevocationEvents should cope with multiple events during a single safepoint
Mon, 04 Jun 2018 23:07:33 +0200 egahlin 8202094: jdk/jfr/api/recording/event/TestEventTime.java intermittently times out
Mon, 04 Jun 2018 23:01:48 +0200 rkennke 8198285: More consistent Access API for arraycopy
Mon, 04 Jun 2018 22:03:10 +0200 egahlin 8203919: Remove "-add-modules" hint from error message
Mon, 04 Jun 2018 13:53:51 -0500 gziemski 8204295: [BACKOUT] - JVMFlag::printError missing ATTRIBUTE_PRINTF
Mon, 04 Jun 2018 10:27:48 -0700 amenkov Merge
Mon, 04 Jun 2018 10:25:44 -0700 amenkov 8187289: NotifyFramePop request is not cleared if JVMTI_EVENT_FRAME_POP is disabled
Mon, 04 Jun 2018 10:12:40 -0700 bsrbnd 8189335: javac exception when referencing private inner class with same name as normal class with dollar_1
Mon, 04 Jun 2018 12:14:22 -0500 gziemski 8203939: JVMFlag::printError missing ATTRIBUTE_PRINTF
Mon, 04 Jun 2018 08:56:41 -0700 ccheung 8203445: [TESTBUG] Remove appcds/jigsaw/limitmods/LimitModsTests.java
Mon, 04 Jun 2018 11:49:12 -0400 coleenp Merge
Mon, 04 Jun 2018 10:18:43 -0400 coleenp 8204195: Clean up macroAssembler.inline.hpp and other inline.hpp files included in .hpp files
Mon, 04 Jun 2018 11:32:00 -0400 lfoltan 8203435: Circular nested dynamic constant test needed to confirm JVMS resolution behavior
Mon, 04 Jun 2018 11:07:04 -0400 lfoltan 8202758: SIGSEGV calling Class.forName(String,Boolean,ClassLoader) with mocked loader
Mon, 04 Jun 2018 11:19:54 +0200 sgehwolf 8203924: Zero: bootcycle-images build fails on x86_64
Mon, 04 Jun 2018 12:29:48 +0200 goetz 8204277: [testbug] fix DisassembleCodeBlobTest.
Mon, 04 Jun 2018 12:59:51 +0200 eosterlund 8202547: Move G1 runtime calls used by generated code to G1BarrierSetRuntime
Mon, 04 Jun 2018 12:54:13 +0200 jlahoda 8198378: javac crash when checking imports and a broken class is present
Mon, 04 Jun 2018 12:51:24 +0200 mgronlun 8203921: JFR thread sampling is missing fixes from JDK-8194552
Mon, 04 Jun 2018 07:12:26 +0200 stuefe 8204164: OOM-only logging in Metaspace
Sun, 03 Jun 2018 14:21:56 -0700 gromero 8204134: jtreg: Fix RTM abort provoker for various tests after "8149159: Clean up Unsafe"
Sun, 03 Jun 2018 19:21:18 +0530 pmuthuswamy 8202627: javadoc generates broken links to deprecated items when -nodeprecated is used
Sun, 03 Jun 2018 09:19:48 +0200 gromero 8204136: jtreg: Fix failing RTM test RTMSpinLoopCount
Sun, 03 Jun 2018 12:04:52 +0530 pmuthuswamy 8199268: docs/api/jdk.javadoc/com/sun/javadoc/package-summary.html contain low contrast text
Fri, 01 Jun 2018 17:45:10 -0700 jjiang 8199388: Test development for ChaCha20 and Poly1305 algorithms
Fri, 01 Jun 2018 15:48:55 -0700 iignatyev 8202812: [TESTBUG] Open source VM testbase compiler tests
Fri, 01 Jun 2018 15:24:41 -0700 rhalade 8204250: Problem list pkcs11 tests on windows
Fri, 01 Jun 2018 19:46:31 +0000 mbalao 8203182: Release session if initialization of SunPKCS11 Signature fails
Fri, 01 Jun 2018 09:38:08 -0700 prr Merge
Fri, 01 Jun 2018 09:18:22 -0700 prr Merge
Fri, 01 Jun 2018 09:16:36 -0700 prr 8200052: libjavajpeg: Fix compile warning in jchuff.c
Wed, 30 May 2018 15:01:36 +0200 mbaesken 8204085: avoid printing uninitialized pointer in java.desktop/windows/native/libawt/java2d/windows/GDIWindowSurfaceData.cpp
Thu, 31 May 2018 13:04:30 -0700 prr Merge
Thu, 31 May 2018 09:52:32 -0700 serb 8199150: Accessibility issues in java.desktop
Thu, 31 May 2018 09:24:27 -0700 serb 8202051: Address compilation warnings in libawt with VS2017
Thu, 31 May 2018 16:50:10 +0530 sveerabhadra 8199723: Test java/awt/TextComponent/DeselectionDuringDoSelectionNonVisibleTest/DeselectionDuringDoSelectionNonVisibleTest.java fails
Wed, 30 May 2018 22:03:12 -0700 serb 8195624: Desktop API cannot be used without permission to read "os.version"
Wed, 30 May 2018 21:30:05 -0700 serb 8203380: Missing platform and bug information for MouseModifiersInKeyEvent test
Wed, 30 May 2018 15:19:55 -0700 prr 8204122: Update harfbuzz.md
Wed, 30 May 2018 12:20:00 -0700 prr 8199530: Upgrade to harfbuzz 1.7.6
Wed, 30 May 2018 08:10:41 -0700 serb 8196373: Introspector does not see overridden generic setter method
Wed, 30 May 2018 08:19:59 +0200 clanger 8201429: Support AIX Input Method Editor (IME) for AWT Input Method Framework (IMF)
Tue, 29 May 2018 11:22:21 -0700 serb 8201279: javax.sound tests should not set java.home system property
Fri, 25 May 2018 16:23:17 -0700 prr 8191522: Remove Bigelow&Holmes Lucida fonts from JDK sources
Fri, 25 May 2018 12:12:24 -0700 prr Merge
Fri, 25 May 2018 11:35:31 +0300 bae 8203485: [freetype] text rotated on 180 degrees is too narrow
Wed, 23 May 2018 23:02:02 -0700 serb 8203498: The specification for java.applet package should be updated
Tue, 22 May 2018 17:33:31 -0700 serb 8203027: Open source tests for "java.awt.geom"
Thu, 17 May 2018 14:41:23 -0700 serb 8201364: [macosx] Component.getLocation() gives inconsistent coordinate for a component at (0,0)
Thu, 17 May 2018 11:40:55 +0530 jdv 5109146: PNGMetadata Background color initialization from standard metadata is incomplete
Wed, 16 May 2018 16:46:51 -0700 serb 8194327: [macos] AWT windows have incorrect main/key window behaviors
Fri, 01 Jun 2018 12:28:19 -0400 lancea 8190417: javadoc updates to java.util.regex.Matcher
Mon, 21 May 2018 13:23:55 -0400 gromero 8203669: PPC64: Fix jtreg RTM tests after "8203305: Improve TM detection for enabling RTM on Linux / POWER9"
Fri, 01 Jun 2018 13:04:30 +0200 jlahoda 8203827: Upgrade JLine to 2.14.6
Fri, 01 Jun 2018 11:34:13 +0200 redestad 8204194: Lazily create MethodHandleImpl$AsVarargsCollector.asCollectorCache
Fri, 01 Jun 2018 10:15:48 +0200 rwestberg 8203237: JFR TestBiasedLockRevocationEvents should ignore events unrelated to the test
Thu, 31 May 2018 18:47:21 -0400 dholmes 8204055: SIGSEGV in java -XX:
Thu, 31 May 2018 14:56:51 -0700 rhalade 8191031: Remove several Symantec Root CAs
Thu, 31 May 2018 14:09:04 -0700 dtitov 8197387: jcmd started by "root" must be allowed to access all VM processes
Thu, 31 May 2018 15:37:18 -0400 kbarrett 8204179: [BACKOUT] OopStorage should use GlobalCounter
Thu, 31 May 2018 11:41:25 -0700 ccheung 8203960: [TESTBUG] runtime/logging/DefaultMethodsTest.java failed when running in CDS mode
Thu, 31 May 2018 10:38:05 -0700 dlong 8202670: Update Graal
Thu, 31 May 2018 10:14:41 -0700 amenkov 8203031: segfaults from jvmti_AddToBootstrapClassLoaderSearch
Fri, 25 May 2018 22:56:00 -0700 vtheeyarath 8177276: MethodHandles.insertArguments doesn't specify IllegalArgumentException on index mismatch
Thu, 31 May 2018 09:51:31 -0500 gziemski 8202360: [TESTBUG] runtime/LoadClass/TestResize.java needs to print output when it fails
Thu, 31 May 2018 10:39:55 -0400 hseigel Merge
Thu, 31 May 2018 10:38:06 -0400 hseigel 8202913: loader constraint message for fields specifies incorrect referring class
Thu, 31 May 2018 07:37:06 -0700 bpb 8203765: java/nio/channels/Selector/SelectAndClose: add some prints and @intermittent tag
Thu, 31 May 2018 07:05:10 -0700 jnimeh 8153029: ChaCha20 Cipher Implementation
Thu, 31 May 2018 09:19:54 -0400 coleenp 8204087: C++ Interpreter code left over in MethodData
Thu, 31 May 2018 13:25:40 +0200 mgronlun 8203321: assert(current_query_index < process_query_set->size) failed: invariant
Thu, 31 May 2018 10:41:36 +0200 stefank 8203923: Add @requires feature to check flag values for the running JVM
Thu, 31 May 2018 15:11:57 +0530 rgoel 8203474: Update description of "Cyrillic Supplementary" block name in Character.UnicodeBlock class.
Thu, 31 May 2018 07:08:54 +0200 jwilhelm Added tag jdk-11+16 for changeset 02934b0d661b
Wed, 30 May 2018 20:54:45 -0700 iignatyev 8199371: [TESTBUG] Open source vm testbase JDWP tests
Wed, 30 May 2018 16:18:56 -0700 iignatyev 8199380: [TESTBUG] Open source VM testbase AOD tests
Wed, 30 May 2018 14:55:50 -0700 erikj 8204109: JDK-8203945 broke nashorn
Wed, 30 May 2018 08:59:56 -0700 dtitov 8203802: Jvmti test fails to build with VS2017
Wed, 30 May 2018 10:23:45 -0700 erikj 8203945: Cleanup nashorn build
Wed, 30 May 2018 09:50:14 -0700 erikj 8203946: Move UnpackSecurity.gmk to closed
Wed, 30 May 2018 09:45:24 -0700 erikj 8204091: Configure broken on MIPS when uname returns mipsel or mips64el
Wed, 30 May 2018 12:40:04 -0300 jlaskey 8050818: Predicate::not - provide an easier way to negate a predicate
Wed, 30 May 2018 17:30:06 +0200 stuefe 8203219: VM.metaspace jcmd should optionally show loaded classes for loaders
Wed, 30 May 2018 07:42:48 -0700 rhalade 8189949: Remove Baltimore Cybertrust Code Signing CA
Wed, 30 May 2018 22:24:20 +0800 weijun 8072996: Deprecate stream-based GSSContext methods
Wed, 30 May 2018 16:10:21 +0200 phedlin 8200288: [SPARC] "assert(!(is_cti(prev) && is_cti(insn))) failed: CTI-CTI not allowed"
Wed, 06 Jun 2018 10:17:54 -0700 mikael Fix uninitialized variable build errors
Wed, 06 Jun 2018 09:56:42 -0700 mikael Merge
Wed, 30 May 2018 14:46:28 +0200 redestad 8203886: Invoke LambdaMetafactory::altMetafactory exactly from the BootstrapMethodInvokerjdk-11+16
Wed, 30 May 2018 11:39:26 +0200 goetz 8203881: Print erroneous size in NegativeArraySizeException
Wed, 30 May 2018 16:36:35 +0530 vtewari 8194298: Add support for per Socket configuration of TCP keepalive
Wed, 30 May 2018 08:52:59 +0200 stuefe 8203455: jcmd: VM.metaspace: print loader name for anonymous CLDs
Tue, 29 May 2018 19:15:49 -0700 martin 8203327: Small cleanups in java.lang.ref
Tue, 29 May 2018 18:10:09 -0400 kbarrett 8202945: OopStorage should use GlobalCounter
Tue, 29 May 2018 17:21:31 -0400 dholmes 8189766: whitebox failure with -Xcheck:jni
Tue, 29 May 2018 16:02:23 -0400 kbarrett 8203843: BasicParState::default_estimated_thread_count(false) can return 0 in gtest
Tue, 29 May 2018 15:50:27 -0400 coleenp 8202813: Move vm_weak processing from SystemDictionary to WeakProcessor
Tue, 29 May 2018 12:06:05 -0700 dlong 8203370: [JVMCI] UseJVMCICompiler should imply EnableJVMCI
Tue, 29 May 2018 21:01:13 +0200 erikj 8203932: Windows devkit has wrong dlls in 32 bit tools dir
Tue, 29 May 2018 20:57:42 +0200 stuefe 8203014: jcmd should output command list if no command is given
Tue, 29 May 2018 11:20:04 -0700 jjg 8196202: Javadoc should not generate frames by default
Tue, 29 May 2018 12:57:39 -0500 gziemski 8203938: Fix build failures from JDK-8133564
Tue, 29 May 2018 09:12:39 -0700 vromero 8203892: Target interface added as marker interface in calls to altMetafactory
Tue, 29 May 2018 18:09:43 +0200 jlahoda 8203926: Problem list test/langtools/tools/javac/importscope/T8193717.java
Tue, 29 May 2018 11:04:56 -0500 gziemski 8133564: Runtime - 2nd followup to Validate JVM Command-Line Flag Arguments
Tue, 29 May 2018 13:44:44 +0200 pliden 8203885: ConcurrentLocksDump::dump_at_safepoint() should not allocate array in resource area
Tue, 29 May 2018 13:17:03 +0200 jlahoda 8193717: Import resolution performance regression in JDK 9
Tue, 29 May 2018 12:52:08 +0200 stuefe 8203865: Metaspace cleanup: Remove unused MemRegion in VirtualSpaceNode
Tue, 29 May 2018 10:53:55 +0200 jlahoda 8202832: cycle detection depends on ordering of requires directives
Mon, 28 May 2018 12:11:50 +0200 tschatzl Merge
Mon, 28 May 2018 12:10:18 +0200 tschatzl 8203262: Incorrect cmpxchg usage in MetaspaceGC::inc_capacity_until_GC
Mon, 28 May 2018 03:04:38 -0700 rpatil 8203233: (tz) Upgrade time-zone data to tzdata2018e
Mon, 28 May 2018 11:13:21 +0200 tschatzl 8202842: G1 footprint regressions in jdk11+10
Mon, 28 May 2018 09:59:11 +0200 pliden 8203817: Monitor::try_lock() should not call check_prelock_state()
Mon, 28 May 2018 09:05:43 +0200 shade 8203628: Optimize (masked) byte memory comparisons on x86
Sun, 27 May 2018 12:00:16 +0530 sdama 8202178: type.getKind() for var is None instead of Error
Sat, 26 May 2018 03:11:50 -0400 kbarrett 8203028: Simplify reference processing in light of JDK-8175797
Fri, 25 May 2018 14:10:21 -0700 epavlova 8200266: [Graal] Update ProblemList-graal.txt files
Fri, 25 May 2018 12:44:34 -0700 igerasim 8203369: Check for both EAGAIN and EWOULDBLOCK error codes
Fri, 25 May 2018 11:59:01 -0700 rhalade 8203793: cacerts/VerifyCACerts.java fails with java.lang.Exception: At least one cacert test failed
Fri, 25 May 2018 20:47:20 +0200 erikj 8203795: Change default compiler on Windows to VS2017
Fri, 25 May 2018 11:18:22 -0700 smarks 8201518: add test for randomized iteration order of unmodifiable Set and Map
Fri, 25 May 2018 13:29:25 -0400 rriggs 8203368: ObjectInputStream filterCheck method throws NullPointerException
Wed, 23 May 2018 15:57:51 +0000 adinn 8203699: java/lang/invoke/SpecialInterfaceCall fails with SIGILL on aarch64
Fri, 25 May 2018 07:22:37 -0700 bpb 8202290: AtomicAppend tests fail on macOS 10.13 ("High Sierra")
Fri, 25 May 2018 15:34:45 +0530 sballal 8203689: Add failure code to threaddb exception messages`
Fri, 25 May 2018 11:51:30 +0200 ihse 8198323: testing.md not updated for repository layout change
Fri, 25 May 2018 10:14:27 +0200 ihse 8203221: Makefile fixes after Flight Recorder
Fri, 25 May 2018 09:35:02 +0200 ihse 8203366: Tag added wrongly in Docs.gmk
Fri, 25 May 2018 00:26:08 -0700 sspitsyn 8203815: add tests failed because of 8203809 to the ProblemList-graal
Fri, 25 May 2018 00:18:47 -0700 sspitsyn 8203816: add tests failed because of 8203174 to the ProblemList-graal
Fri, 25 May 2018 09:05:42 +0200 thartmann 8202949: C2: assert(false) failed: Bad graph detected in build_loop_late
Thu, 24 May 2018 22:21:00 -0700 jcm 8184030: TestUseRTMLockingOptionOnUnsupportedVM - RTM locking optimization not supported is missing
Thu, 24 May 2018 17:12:15 -0700 iignatyev 8199383: [TESTBUG] Open source VM testbase JVMTI tests
Thu, 24 May 2018 13:26:22 -0700 rhalade 8191844: Remove SECOM root (secomevrootca1)
Thu, 24 May 2018 12:29:50 -0700 bpb 8203766: Add some instrumentation to jdk/java/nio/channels/Selector/RacyDeregister.java
Thu, 24 May 2018 14:02:37 -0400 coleenp 8203225: Fix of redefining a method that removes 1 or more lambda expressions failed to commit test cases
Thu, 24 May 2018 13:06:46 -0400 hseigel Merge
Thu, 24 May 2018 13:04:33 -0400 hseigel 8203183: vmTestbase/vm/mlvm/anonloader/stress/oome/heap/Test.java times out
Thu, 24 May 2018 09:15:09 -0700 ccheung 8203354: assert in ClassLoader::update_module_path_entry_list() could have incorrect message
Thu, 24 May 2018 20:34:17 +0530 pmuthuswamy 8196913: javadoc does not (over)write stylesheet.css
Thu, 24 May 2018 15:23:28 +0100 chegar 8203297: java/net/URL/OpenStream.java fails intermittently
Thu, 24 May 2018 15:46:04 +0200 egahlin 8203774: jdk/jfr/api/recorder/TestStartStopRecording.java failed due to compilation failed
Thu, 24 May 2018 11:13:42 +0100 mcimadamore 8203488: Remove error generation from TransTypes
Thu, 24 May 2018 14:35:32 +0530 pmuthuswamy 8199307: NPE in jdk.javadoc.internal.doclets.toolkit.util.Utils.getLineNumber
Thu, 24 May 2018 09:59:57 +0200 roland 8202950: C2: assert(found_sfpt) failed: no node in loop that's not input to safepoint
Thu, 24 May 2018 13:34:31 +0530 pmuthuswamy 8188248: NullPointerException on generic methods
Thu, 24 May 2018 01:04:42 -0400 dholmes 8203769: ProblemList test/jdk/java/util/Map/InPlaceOpsCollisions.java
Wed, 23 May 2018 18:18:33 -0700 jjiang 8203686: Add JDK 11 major version to javax/net/ssl/compatibility/JdkRelease.java
Thu, 24 May 2018 00:37:29 +0000 valeriep 8194630: Uninitialized initiator_address in native GSS
Wed, 23 May 2018 17:09:49 -0700 mseledtsov 8199255: [TESTBUG] Open source VM testbase default methods tests
Thu, 24 May 2018 07:20:10 +0800 fyang 8203041: AArch64: fix overflow in immediate cmp/cmn instruction
Wed, 23 May 2018 21:08:33 +0200 jwilhelm Added tag jdk-11+15 for changeset a11c1cb542bb
Wed, 23 May 2018 11:49:57 -0700 jjg 8202947: Fix minor issues with taglets
Wed, 23 May 2018 11:29:56 -0700 erikj 8203497: Bump Jib format version to 1.2
Wed, 23 May 2018 10:34:18 -0700 martin 8203328: Rename EFS in java.util.zip internals to something meaningful
Wed, 23 May 2018 08:49:00 -0700 sherman 8200172: String.split non-positive term incorrect use
Wed, 23 May 2018 16:26:29 +0200 mbaesken 8202427: Enhance os::print_memory_info on Windowsjdk-11+15
Wed, 21 Mar 2018 16:03:12 +0100 neliasso 8192992: Test8007294.java failed: attempted to spill a non-spillable item
Wed, 23 May 2018 15:21:54 +0200 mgronlun 8203457: Add back missing full buffer notification
Wed, 23 May 2018 09:43:41 +0200 stefank 8203490: StringTable::dump lacks a load barrier
Wed, 23 May 2018 09:42:42 +0200 stefank 8203694: Add a safepoint-aware Semaphore - part 2
Thu, 17 May 2018 18:09:19 +0200 mbaesken 8203355: MITSHM define guarding missing
Wed, 23 May 2018 14:21:14 +0800 mli 8202771: Migrate Unicode character tests to JDK Repo
Tue, 22 May 2018 21:50:45 -0700 dl 8201386: Miscellaneous changes imported from jsr166 CVS 2018-05
Tue, 22 May 2018 21:46:51 -0700 dl 8202685: Optimize ArrayList subList replaceAll
Tue, 22 May 2018 16:19:31 -0700 bpb 8202076: test/jdk/java/io/File/WinSpecialFiles.java on windows with VS2017
Wed, 23 May 2018 00:21:58 +0200 egahlin 8195819: Remove recording=x from jcmd JFR.check output
Tue, 22 May 2018 23:27:54 +0200 egahlin 8201331: Better test cleanup for jdk/jfr/api/consumer/TestRecordingFile.java
Tue, 22 May 2018 10:49:20 -0700 lmesnik 8199064: Test applications/jcstress/other/Test.java#id1108 fails on Sparc
Tue, 22 May 2018 13:05:22 -0700 mseledtsov 8199257: [TESTBUG] Open source VM testbase metaspace tests
Tue, 22 May 2018 14:49:39 -0400 zgu 8203635: JFR sampler thread does not record stack info
Tue, 22 May 2018 11:04:36 -0700 sherman 8196987: Resolve disabled warnings for libzip
Tue, 22 May 2018 10:08:04 -0700 iignatyev 8199379: [TESTBUG] Open source vm testbase JDB tests
Tue, 22 May 2018 13:10:56 -0400 coleenp 8202669: Intermittent crash in ClassLoadingService::compute_class_size()
Tue, 22 May 2018 09:01:44 -0700 vromero 8196048: thrown type variables should be roots in the minimum inference graph
Fri, 18 May 2018 09:15:08 -0700 iklam 8203381: Replace InstanceKlass::allocate_instance_handle with JavaCalls::construct_new_instance
Fri, 18 May 2018 15:35:32 +0200 sgehwolf 8203410: Zero: Disable jfr feature by default
Tue, 22 May 2018 12:04:05 -0300 jlaskey 8200380: String::lines
Tue, 22 May 2018 12:26:17 +0200 jlahoda 8198315: Incomplete classpath causes NPE in TransTypes
Tue, 22 May 2018 13:37:05 +0100 mcimadamore 8203436: javac should fail early when emitting illegal signature attributes
Tue, 22 May 2018 14:54:55 +0200 bulasevich 8203431: TestFloatsOnStackDeopt.java throws java.lang.LinkageError: loader <bootstrap> attempted duplicate class definition for java.lang.invoke.BoundMethodHandle$Species_LLL
Tue, 22 May 2018 14:44:18 +0200 redestad 8203352: Improve java implementation of Integer/Long.numberOfLeadingZeros
Tue, 22 May 2018 05:20:48 -0400 dholmes 8203626: ProblemList compiler/runtime/TestFloatsOnStackDeopt.java
Tue, 22 May 2018 03:46:52 -0400 kbarrett 8202863: Rename OopStorage inner collection classes
Tue, 22 May 2018 09:10:16 +0200 thartmann 8202848: -XX:+ExecuteInternalVMTests asserts with "assert(cd.valid() == true) failed: failed on a valid DirectivesParser string"
Tue, 22 May 2018 09:04:15 +0200 thartmann 8203196: C1 emits incorrect code due to integer overflow in _tableswitch keys
Mon, 21 May 2018 21:27:12 -0700 iklam 8193332: MetaspaceShared::check_shared_class_loader_type is not used during archive creation
Mon, 21 May 2018 18:44:09 -0700 iris 8203500: Fix broken links to Specification in "specs" directory
Mon, 21 May 2018 23:40:52 +0000 valeriep 8146293: Add support for RSASSA-PSS Signature algorithm
Mon, 21 May 2018 17:17:24 -0400 coleenp 8202853: NotifyCount is not initialized
Mon, 21 May 2018 22:59:29 +0200 egahlin 8027760: JFC schema condition should not have defaults
Mon, 21 May 2018 12:49:03 -0700 igerasim 8203279: Faster rounding up to nearest power of two
Mon, 21 May 2018 12:27:21 -0700 vromero 8203486: skip type inference for non functional interface components of intersection types
Mon, 21 May 2018 15:15:58 -0400 jiangli 8199807: AppCDS performs overly restrictive path matching check.
Mon, 21 May 2018 11:43:57 -0700 bpb 8203487: Typo in ICUBinary.java: s/Magin/Magic/
Mon, 21 May 2018 18:19:11 +0200 egahlin 8195818: JFR.start should increase autogenerated name by one
Mon, 21 May 2018 11:09:58 -0500 simonis 8203292: Print complete set of flags in the hs_err file
Mon, 21 May 2018 17:38:46 +0200 egahlin 8195817: JFR.stop should require name of recording
Mon, 21 May 2018 14:46:12 +0200 egahlin 8198337: -XX:StartFlightRecording=dumponexit=true,disk=false doesn't work
Mon, 21 May 2018 11:33:59 +0200 stuefe 8176808: Split up metaspace.cpp
Sun, 20 May 2018 22:10:45 +0200 stefank 8203341: Add a safepoint-aware Semaphore
Sun, 20 May 2018 22:08:25 +0200 stefank 8203339: Add oopDesc::field_offset()
Sun, 20 May 2018 20:25:51 +0900 ysuenaga 8202466: Test serviceability/tmtools/jstat/GcTest01.java fails: Number of concurrent GC events is 1, but CGCT is 0
Sat, 19 May 2018 13:13:09 -0700 cjplummer 8203391: Update com/sun/jdi/JdbMethodExitTest.sh to pass valid URL[]
Sat, 19 May 2018 18:01:04 +0200 shade 8203454: Minimal, Zero builds fail after JDK-8202377 (Modularize C2 barriers)
Sat, 19 May 2018 22:06:47 +0800 weijun 8201627: Kerberos sequence number issues
Fri, 18 May 2018 18:31:28 -0700 joehw 8198548: Initialization race in com.sun.org.apache.xerces.internal.impl.xpath.regex.Token.getRange() on Token.categories
Fri, 18 May 2018 14:21:59 -0700 cjplummer 8185803: JdbExprTest.sh fails in JDK10-hs nightly due to "Name unknown: java.lang.Long.MAX_VALUE "
Fri, 18 May 2018 15:56:42 -0400 coleenp 8202014: Possible to receive signal before signal semaphore created
Fri, 18 May 2018 12:45:05 -0700 iignatyev 8203437: 8199370 broke build on linux-ppc64le (w/ GCC 4.8.5.)
Fri, 18 May 2018 12:32:32 -0700 dlong 8202305: [Graal] org.graalvm.compiler.core.test.GraphResetDebugTest fails with java.util.ServiceConfigurationError
Fri, 18 May 2018 09:22:31 -0700 vromero 8148354: Errors targeting functional interface intersection types
Fri, 18 May 2018 14:51:06 +0200 eosterlund 8202377: Modularize C2 GC barriers
Fri, 18 May 2018 15:21:23 +0200 pliden 8202989: Add missing decorators in calls to to arraycopy_prologue/epilogue
Fri, 18 May 2018 15:21:23 +0200 pliden 8203227: Introduce os::processor_id() for Linux and Solaris
Fri, 18 May 2018 08:47:42 -0400 coleenp 8134537: Much nearly duplicated code for sun.misc.Signal support
Fri, 18 May 2018 10:59:04 +0200 goetz 8203400: Fix issue with "8199852: Print more information about class loaders in LinkageErrors."
Fri, 18 May 2018 08:43:49 -0300 jlaskey 8200436: String::isBlank
Wed, 16 May 2018 15:25:51 +0200 sgehwolf 8203287: Zero fails to build after JDK-8199712 (Flight Recorder)
Fri, 18 May 2018 12:48:09 +0200 bsrbnd 8203398: Test test/langtools/tools/javac/options/release/ReleaseOptionCurrent.java writes into the source directory
Fri, 18 May 2018 13:23:28 +0300 bulasevich 8202710: AARCH64: sporadic jtreg test fail
Fri, 18 May 2018 16:27:15 +0800 weijun 8201867: Kerberos keytabs with holes in certain places are parsed incorrectly
Thu, 17 May 2018 21:04:53 -0700 epavlova 8203318: compiler/stable/TestStableShort.java is broken
Thu, 17 May 2018 16:21:27 -0700 lmesnik 8199271: [TESTBUG] open source VM testbase stress tests
Thu, 17 May 2018 14:52:47 -0700 iignatyev 8199370: [TESTBUG] Open source vm testbase GC tests
Thu, 17 May 2018 12:59:53 -0700 bpatel 8196201: Generate pages to list all classes and all packages in javadoc output
Thu, 17 May 2018 08:41:01 -0700 ccheung 8196619: [TESTBUG] restore current version check in runtime/appcds/MultiReleaseJars.java
Thu, 17 May 2018 12:08:32 +0200 neliasso 8203215: IdealLoopTree::split_outer_loop leaves phi-nodes with only one input
Thu, 17 May 2018 11:56:21 +0200 eosterlund 8202479: Add missing try_resolve_jobject_in_native calls
Thu, 17 May 2018 14:31:31 +0200 mgronlun 8203346: JFR: Inconsistent signature of jfr_add_string_constant
Thu, 17 May 2018 14:19:54 +0200 mdoerr 8202713: Create a MacroAssembler::access_load/store_at wrapper for S390 and PPC
Wed, 16 May 2018 11:11:03 -0400 gromero 8203305: PPC64: Improve TM detection for enabling RTM on Linux / POWER9
Thu, 17 May 2018 14:16:49 +0200 mdoerr 8203288: PPC64 and s390 fail to build after JDK-8199712 (Flight Recorder)
Thu, 17 May 2018 11:03:19 +0000 asaha Added tag jdk-11+14 for changeset 3595bd343b65
Thu, 17 May 2018 10:32:26 +0200 rehn 8195098: Low latency hashtable for read-mostly scenarios
Thu, 17 May 2018 09:35:38 +0200 pliden 8202978: Incorrect tmp register passed to MacroAssembler::load_mirror()
Thu, 17 May 2018 00:23:28 -0700 iignatyev 8199384: [TESTBUG] Open source VM testbase MLVM tests
Wed, 16 May 2018 16:43:57 -0700 mseledtsov Mergejdk-11+14
Wed, 16 May 2018 16:43:11 -0700 mseledtsov 8199252: [TESTBUG] Open source VM testbase system dictionary tests
Wed, 16 May 2018 15:19:28 -0700 iveresov 8201447: C1 does backedge profiling incorrectly
Tue, 15 May 2018 14:49:10 -0700 iklam 8189140: SystemDictionaryShared::initialize() should be renamed to be more meaningful
Wed, 16 May 2018 10:27:25 -0700 prr Merge
Wed, 16 May 2018 09:45:40 -0700 prr Merge
Tue, 15 May 2018 10:13:52 -0700 prr Merge
Tue, 15 May 2018 18:03:31 +0530 pbansal 8196616: ava/awt/GraphicsDevice/DisplayModes/CompareToXrandrTest.java fails
Tue, 15 May 2018 11:34:25 +0530 jdv 8202824: Cleanup discrepancies in ProblemList for java_awt jtreg tests
Mon, 14 May 2018 08:58:32 -0700 prr 8198991: Move Java2D demo to the open repository
Fri, 11 May 2018 20:59:21 -0700 prr 8198412: MonospacedGlyphWidthTest.java may fail on Solaris
Fri, 11 May 2018 15:27:51 -0700 serb 8202878: com/apple/laf/ScreenMenu/ScreenMenuMemoryLeakTest.java fails
Fri, 11 May 2018 14:12:55 -0700 prr 8202811: Problem List some tests that leave windows open on the desktop
Fri, 11 May 2018 08:39:21 -0700 erikj 8202914: Let custom makefile override jmod intput dir locations
Fri, 11 May 2018 15:07:43 +0100 aivanov 8202544: Hide unused exports in libzip
Fri, 11 May 2018 21:03:07 +0530 pkbalakr 8196360: java/awt/Dialog/SiblingChildOrder/SiblingChildOrderTest.java fails
Wed, 09 May 2018 16:03:49 +0530 psadhukhan 8197948: Create test for SwingSet2 main window
Tue, 08 May 2018 12:13:57 -0700 prr Merge
Tue, 08 May 2018 10:55:09 -0700 prr 8202767: java/awt/font/GlyphVector/TestLayoutFlags.java is missing null check
Tue, 08 May 2018 15:30:08 +0530 psadhukhan 8202718: Jemmy JInternalFrameOperator: Dependency with orders of Minimize, Maximize and Close buttons
Tue, 08 May 2018 10:13:21 +0200 lbourges 8202580: Dashed BasicStroke randomly painted incorrectly, may freeze application
Mon, 07 May 2018 13:36:36 -0700 prr 8176510: java/awt/font/GlyphVector/TestLayoutFlags.java fails with OpenJDK
Mon, 07 May 2018 16:51:08 +0530 psadhukhan 8202064: Jemmy JInternalFrameOperator: Add wait for close(), activate(), resize() and move() operations
Sat, 05 May 2018 12:17:43 -0700 prr 8202679: Updates on windows failures in the problem list
Fri, 04 May 2018 19:23:21 +0100 aivanov 8202476: ImageLib is broken in 32 bit Windows
Wed, 16 May 2018 10:12:10 -0700 sherman 8191533: jar --describe-module prints service provider class names in lower case
Wed, 16 May 2018 09:40:57 -0700 erikj 8202920: jvm.cfg generation incorrect
Wed, 16 May 2018 09:37:00 -0700 erikj 8202738: vm_version Abstract_VM_Version::internal_vm_info_string() returns same string for different incremental builds
Wed, 16 May 2018 18:03:20 +0200 redestad 8196340: (coll) Examine overriding inherited methods in ArrayList and ArrayList.SubList
Thu, 26 Apr 2018 13:55:16 +0200 mbaesken 8202322: AIX: symbol visibility flags not support on xlc 12.1
Tue, 15 May 2018 15:36:46 +0200 sgehwolf 8203223: Signed integer overflow in ImageStrings::hash_code (libjimage.so)
Wed, 16 May 2018 13:14:58 +0200 shade 8203285: Minimal VM fails to build after JDK-8199712 (Flight Recorder)
Wed, 16 May 2018 12:38:35 +0200 shade 8203274: 32-bit build failures after JDK-8199712 (Flight Recorder)
Wed, 16 May 2018 12:38:34 +0200 shade 8203278: AArch64/PPC64 build failures after JDK-8199712 (Flight Recorder)
Wed, 16 May 2018 10:44:59 +0200 sjohanss 8183910: gc/arguments/TestAggressiveHeap.java fails intermittently
Wed, 16 May 2018 10:24:54 +0200 pliden 8203220: Introduce ATTRIBUTE_ALIGNED macro
Tue, 15 May 2018 19:26:00 -0400 aharlap 8189271: Metaspace::_capacity_until_GC should be size_t
Tue, 15 May 2018 14:41:06 -0700 jjg 8202614: Add ability to validate links in JavadocTester
Tue, 15 May 2018 23:37:37 +0200 shade 8203251: Non-PCH build failed after JDK-8199712 (Flight Recorder)
Tue, 15 May 2018 14:15:47 -0700 jjg 8203176: javadoc handles non-ASCII characters incorrectly.
Tue, 15 May 2018 13:58:03 -0700 iignatyev 8203250: runtime/LoadClass/test-classes/Hello.java has wrong legal notice
Tue, 15 May 2018 13:28:08 -0700 joehw 8202426: NPE thrown by Transformer when XMLStreamReader reports no xml attribute type
Tue, 15 May 2018 20:24:34 +0200 egahlin 8199712: Flight Recorder
Tue, 15 May 2018 11:28:29 -0700 iignatyev 8202392: [TESTBUG] open source vm testbase heapdump tests
Tue, 15 May 2018 14:35:51 +0200 stuefe 8203032: PrintMetaspaceDcmd fails: Non-Class: missing from stdout/stderr
Tue, 15 May 2018 05:33:26 -0400 rkennke 8202714: Create a MacroAssembler::access_load/store_at wrapper for AArch64
Tue, 15 May 2018 09:33:02 +0100 alanb 8203059: (so) Closing a socket channel registered with Selector and with SO_LINGER set to 0 does not reset connection
Tue, 15 May 2018 14:39:11 +0800 amlu 8202763: failure_handler: list open files for macOS
Tue, 15 May 2018 02:47:40 +0530 jgeorge 8195613: [SA] HotSpotTypeDataBase.readVMLongConstants truncates values to int
Mon, 14 May 2018 21:56:07 +0200 rkennke 8202016: Use obj+offset in interpreter array access
Mon, 14 May 2018 11:17:18 -0700 xiaofeya 8202708: Add a check of opening stream for not-existing UNC url
Mon, 14 May 2018 12:03:59 +0100 aph 8185505: AArch64: Port AOT to AArch64
Mon, 14 May 2018 15:43:00 +0200 pliden 8202993: Add support for x86 testptr/testq with register and address
Mon, 14 May 2018 15:42:59 +0200 pliden 8202976: Add C1 lea patching support for x86
Mon, 14 May 2018 15:42:58 +0200 pliden 8202994: Add support for undoing last TLAB allocation
Mon, 14 May 2018 14:10:52 +0200 neliasso 8193935: Illegal countedLoops transformation
Mon, 14 May 2018 14:10:50 +0200 neliasso 8201532: Update idom to get correct dom depth calculation
Mon, 14 May 2018 09:40:48 -0300 jlaskey 8200377: String::strip, String::stripLeading, String::stripTrailing
Mon, 14 May 2018 11:47:03 +0200 tschatzl 8201491: G1 support for java.lang.ref.Reference precleaning
Mon, 14 May 2018 11:47:03 +0200 tschatzl 8202829: Implement CollectedHeap::get_safepoint_workers() for G1
Mon, 07 May 2018 23:07:01 +0200 goetz 8202745: Remove hyphens from "out-of-bounds".
Mon, 07 May 2018 09:11:21 +0200 goetz 8201593: Print array length in ArrayIndexOutOfBoundsException.
Sat, 12 May 2018 17:22:56 +0530 jgeorge 8174995: SA: clhsdb 'where -a' throws Assertion Failure with illegal code 236 when CDS is used
Sat, 12 May 2018 10:26:42 +0200 clanger 8202915: [JAXP] Performance enhancements and cleanups in com.sun.org.apache.xerces.internal.impl.dtd.XMLDTDValidator
Fri, 11 May 2018 14:21:46 -0700 mchung 8202113: Reflection API is causing caller classes to leak
Thu, 10 May 2018 13:34:44 -0700 kcr 8202553: Update FXLauncherTest as part of removing JavaFX from JDK
Fri, 11 May 2018 14:43:08 -0400 ctornqvi 8202997: Split test/jdk/:tier1 to enable better parallel execution
Fri, 11 May 2018 21:22:28 +0300 dpochepk 8202395: AARCH64: wrong encoding for SIMD instructions zip, trn, uzp
Fri, 11 May 2018 21:19:47 +0300 bulasevich 8201604: ARM64 - Build failure after JDK-8193260
Fri, 11 May 2018 10:39:04 -0700 vromero 8194998: broken error message for subclass of interface with private method
Fri, 11 May 2018 10:07:10 -0700 naoto 8202764: api/java_text/SimpleDateFormat/index.html#Format testcases started to fail with JDK11 b12
Fri, 11 May 2018 17:37:14 +0200 shade 8202974: Backout JDK-8202683
Fri, 11 May 2018 11:08:32 -0400 dcubed 8132287: obsolete the "InlineNotify" flag option
Fri, 11 May 2018 17:50:00 +0800 mli 8202756: move FilterUSRTest.java to openJDK
Fri, 11 May 2018 04:57:43 +0000 lana Added tag jdk-11+13 for changeset 758deedaae84
Fri, 11 May 2018 09:40:23 +0900 ysuenaga 8202889: Remove trailing LF from perf log
Thu, 10 May 2018 16:39:50 -0700 ccheung 8202289: Non-empty directory in module path is not handled properly at CDS/AppCDS dump time
Thu, 10 May 2018 10:00:49 -0700 erikj 8202919: JDK-8202683 broke macosx build
Thu, 10 May 2018 09:27:59 -0700 kvn 8202773: Unhandled oop in JavaThread::collect_counters
Tue, 08 May 2018 15:28:12 -0700 lmesnik 8202748: jtreg :hotspot_misc group shouldn't include vmTestbase tests
Thu, 10 May 2018 17:19:29 +0200 shade 8202683: Minimal VM should build cleanly on 64-bit platforms
Thu, 10 May 2018 07:26:18 +0200 stuefe 8202822: Add .git to .hgignore
Wed, 09 May 2018 19:50:30 +0200 erikj 8202557: OpenJDK fails to start in Windows 7 and 8.1 after upgrading compiler to VC 2017
Wed, 09 May 2018 17:14:29 +0200 jlahoda 8202843: langtools ant build fails
Wed, 09 May 2018 13:37:05 +0200 tschatzl 8202780: Remove EnqueueTask related code from ReferenceProcessor after JDK-8202017jdk-11+13
Wed, 09 May 2018 11:24:12 +0200 sjohanss 8202662: JFR tests fails: Could not find leak with class
Wed, 09 May 2018 12:19:35 +0300 dsamersoff 8201602: ARM32 - Minimal Dynamic Constant support
Wed, 09 May 2018 09:39:25 +0200 redestad 8202711: Merge tiered compilation policies
Wed, 09 May 2018 07:48:31 +0100 clanger 8202650: Enforce group for attach listener file
Wed, 09 May 2018 06:51:41 +0200 stuefe 8202634: Metaspace: simplify SpaceManager lists
Tue, 08 May 2018 15:40:03 +0200 mdoerr 8202564: java/lang/management/ThreadMXBean/ThreadCounts.java fails
Wed, 09 May 2018 09:50:25 +0800 weijun 8202816: Update JarSigning.keystore
Tue, 08 May 2018 20:59:58 -0400 kbarrett 8202631: JVM_Clone to throw CloneNotSupportException for Reference object
Tue, 08 May 2018 17:58:14 -0700 darcy 8202563: BigInteger/BigDecimal not immune to overflow, contrary to spec
Tue, 08 May 2018 17:12:54 -0700 vromero 8202597: javac is not inducing a notional interface if Object appears in an intersection type
Tue, 08 May 2018 23:02:13 +0200 redestad 8202810: Remove class-for-name test
Mon, 07 May 2018 16:16:17 +0200 stefank 8202722: Move marksweep_init into GC code
Mon, 07 May 2018 16:12:07 +0200 stefank 8202649: Move the Parallel GC specific task creation functions out of Threads
Mon, 07 May 2018 14:57:25 +0200 stefank 8202647: Add deduplicate_string function to CollectedHeap
Mon, 07 May 2018 14:57:23 +0200 stefank 8202709: Move oopDesc::is_archive_object to MetaspaceShared::is_archive_object
Tue, 08 May 2018 12:16:52 -0700 jjg 8199196: Add javadoc support for preview features
Tue, 08 May 2018 16:49:20 +0200 tschatzl 8202781: Fix typo in DiscoveredListIterator::complete_enqeue
Tue, 08 May 2018 09:47:28 -0400 apetcher 8171277: Elliptic Curves for Security in Crypto
Tue, 08 May 2018 09:21:51 -0400 apetcher 8181594: Efficient and constant-time modular arithmetic
Tue, 08 May 2018 09:27:42 -0300 jlaskey 8200372: String::trim JavaDoc should clarify meaning of space
Tue, 08 May 2018 10:49:59 +0200 redestad 8202548: Use reservation Object when creating SpeciesData
Tue, 08 May 2018 10:01:29 +0200 tschatzl 8202017: Merge Reference Enqueuing phase with phase 3 of Reference processing
Tue, 08 May 2018 09:57:45 +0200 redestad 8202719: Use Collections.emptyEnumeration where possible
Tue, 08 May 2018 09:52:18 +0200 redestad 8202583: Remove experimental ClassForNamePlugin
Tue, 08 May 2018 09:41:10 +0200 hannesw 8200716: Object propertyIsEnumerable buggy behavior on short integer-string key
Tue, 08 May 2018 11:49:42 +0530 rgoel 8191410: Unicode 10
Tue, 08 May 2018 12:37:39 +0800 amlu 8202581: failure_handler: gather more environment information on macOS
Tue, 08 May 2018 09:51:42 +0800 xyin 8202690: jdk/jshell/ToolBasicTest.java failed in testOpenFileOverHttp() and testOpenLocalFileUrl()
Mon, 07 May 2018 21:48:28 -0400 dholmes 8202744: Expired flag removal for JDK 11
Mon, 07 May 2018 19:31:39 -0400 dholmes 8202686: Missing test case for 8200167 - final Object methods
Mon, 07 May 2018 18:48:36 -0400 coleenp 8202606: Deprecate AllowNonVirtualCalls option
Thu, 26 Apr 2018 13:40:58 -0700 iklam 8197954: Remove unnecessary intermediary APIs from AppCDS implementation
Mon, 07 May 2018 20:42:36 +0200 stuefe 8185034: Cleanup and consolidate Metaspace coding
Thu, 03 May 2018 04:18:22 -0700 vtheeyarath 8195717: test java/lang/invoke/MethodHandlesTest timed out running testAsCollector1
Mon, 07 May 2018 11:38:21 +0200 goetz 8199852: Print more information about class loaders in LinkageErrors.
Mon, 07 May 2018 14:42:10 +0200 stefank 8202642: Replace PAR_OOP_ITERATE with templates
Mon, 07 May 2018 14:42:08 +0200 stefank 8202641: Replace OOP_SINCE_SAVE_MARKS with templates
Mon, 07 May 2018 14:42:05 +0200 stefank 8202639: Use concrete Generation classes in SerialHeap and CMSHeap
Mon, 07 May 2018 14:42:04 +0200 stefank 8202592: Remove unused EvacuateFollowersClosure
Mon, 07 May 2018 14:42:00 +0200 stefank 8202591: Remove usage of CMSEdenChunksRecordAlways in defNewGeneration.cpp
Mon, 07 May 2018 10:36:38 +0200 eosterlund 8202083: Remove explicit CMS checks in CardTableBarrierSet
Mon, 07 May 2018 12:28:11 +0200 mdoerr 8202080: Introduce ordering semantics for Atomic::add and other RMW atomics
Mon, 07 May 2018 18:23:59 +0800 mli 8202291: java/rmi/Naming/LookupIPv6.java failed with Connection refused
Mon, 07 May 2018 10:37:46 +0200 jlahoda 8202387: javac --release 11 not supported
Mon, 07 May 2018 08:56:35 +0200 thartmann 8202565: C1 compilation crashes with "assert(is_double_stack() && !is_virtual()) failed: type check"
Mon, 07 May 2018 07:44:49 +0530 pmuthuswamy 8200094: Turkish locale reports NPE No enum constant com.sun.source.doctree.DocTree.Kind.S?NCE
Sun, 06 May 2018 00:42:59 +0200 rkennke 8202676: AArch64: Missing enter/leave around barrier leads to infinite loop
Sat, 05 May 2018 22:19:19 +0200 eosterlund 8202640: Small C1 cleanups for BarrierSetC1
Thu, 03 May 2018 17:10:39 +0200 stuefe 8202435: [aix] print program break as part of memory info into hs-err file
Sat, 05 May 2018 18:55:31 +0200 shade 8202684: Minimal VM build is broken after JDK-8199067, JDK-8202638
Sat, 05 May 2018 12:38:15 -0400 kbarrett 8202672: Build failed in metaspace.cpp with VS2017
Sat, 05 May 2018 09:34:01 -0700 darcy 8202599: Mark intermittently failing jshell tests
Sat, 05 May 2018 09:24:29 -0700 iignatyev 8199382: [TESTBUG] Open source VM testbase JDI tests
Fri, 04 May 2018 23:19:10 -0700 rfield 8199912: jshell tool: /open from URI
Fri, 04 May 2018 16:49:22 -0700 vlivanov 8202465: [C1] casts should not be eliminated for interface types
Fri, 04 May 2018 17:52:10 -0400 kbarrett 8202319: Fix compilation warnings in Solaris debug builds for DevStudio 12.6
Fri, 04 May 2018 09:46:08 -0700 prr Merge
Fri, 04 May 2018 08:50:01 -0700 prr Merge
Wed, 02 May 2018 22:11:35 -0700 anazarov 8197388: Added not existing bug id in jdk/ProblemList.txt
Wed, 02 May 2018 14:55:19 -0700 prr 8196572: Tests ColConvCCMTest.java and MTColConvTest.java fail
Wed, 02 May 2018 13:23:34 -0700 prr 8154463: New failure of closed/java/awt/font/Outline/OutlineInvarianceTest.java
Wed, 02 May 2018 09:16:10 -0700 prr Merge
Wed, 02 May 2018 15:11:54 +0530 kaddepalli 4842658: DefaultListModel and DefaultComboBoxModel should support addAll (Collection c)
Thu, 26 Apr 2018 17:03:34 -0700 serb 8198342: Test FileSystemViewListenerLeak.java is unstable
Thu, 26 Apr 2018 13:33:11 -0700 serb 8202301: Add tests related to JDK-8196572 to the ProblemList
Wed, 25 Apr 2018 21:54:42 +0530 ant 8189687: Swing: Invalid position of candidate pop-up of InputMethod in Hi-DPI on Windows
Tue, 24 Apr 2018 15:42:58 +0100 alitvinov 8199748: Touch keyboard is not shown, if text component gets focus from other text component
Tue, 24 Apr 2018 11:39:04 +0100 dmarkov 8202143: Parts of 8193435 added in merge change set.
Mon, 23 Apr 2018 14:06:46 -0700 serb 8200146: Remove the appletviewer launcher
Fri, 20 Apr 2018 18:28:18 -0700 serb 8202050: Add javax/sound/midi/Sequencer/Recording.java to the problemList
Fri, 20 Apr 2018 09:44:45 -0700 prr 8200313: java/awt/Gtk/GtkVersionTest/GtkVersionTest.java fails
Fri, 20 Apr 2018 09:05:05 -0700 prr Merge
Wed, 18 Apr 2018 14:07:41 -0700 serb 8187392: Deprecated methods in the peers can be removed
Wed, 18 Apr 2018 08:48:06 -0700 prr Merge
Wed, 18 Apr 2018 13:22:53 +0530 jdv 6574555: PNGImageWriter incorrectly sets bKGD chunk
Wed, 18 Apr 2018 12:33:21 +0530 jdv 6788458: PNGImageReader ignores tRNS chunk while reading non-indexed RGB/Gray images
Wed, 18 Apr 2018 10:43:43 +0530 sveerabhadra 8201598: Fix for 8181910: Support dark title bars on macOS broke the MacOS build
Tue, 17 Apr 2018 18:18:26 -0700 serb 8199932: Missing copyright header in AWT source code
Tue, 17 Apr 2018 18:10:13 -0700 serb 8201626: Typo in MakeWindowAlwaysOnTop test
Mon, 16 Apr 2018 16:43:26 +0200 simonis 8201524: [AIX] Don't link libfontmanager against libawt_headless
Mon, 16 Apr 2018 15:22:56 +0530 pbansal 8153532: Add @throws NPE javadoc to UIManager.setLookAndFeel(String) method description
Mon, 16 Apr 2018 10:35:22 +0530 sveerabhadra 8181910: [macos] Support dark title bars on macOS
Sat, 14 Apr 2018 00:25:12 +0100 aivanov 8201433: Fix potential crash in BufImg_SetupICM
Fri, 04 May 2018 12:14:09 -0400 lfoltan 8189916: Dynamic Constant support for Sparc
Fri, 04 May 2018 10:45:47 -0400 ecaspole 8197447: LogCompilation throws "couldn't find bytecode"
Fri, 04 May 2018 14:37:58 +0100 clanger 8202181: Correctly specify size of hostname buffer in Unix Inet*AddressImpl_getLocalHostName implementations
Thu, 03 May 2018 15:17:27 +0200 lkorinth 8176717: GC log file handle leaked to child processes
Fri, 04 May 2018 15:44:24 +0530 rgoel 8202582: DateTimeFormatterBuilder.parseOffsetBased unnecessarily calls toString()
Fri, 04 May 2018 11:41:35 +0200 stefank 8200729: Conditional compilation of GCs
Fri, 04 May 2018 09:29:14 +0200 redestad 8187123: (reflect) Class#getCanonicalName and Class#getSimpleName is a part of performance issue
Tue, 24 Apr 2018 18:06:32 +0200 stuefe 8201572: Improve Metaspace Statistics
Thu, 03 May 2018 17:36:25 -0700 erikj 8196113: Remove the Compact Profile builds
Thu, 03 May 2018 22:29:20 +0000 lana Added tag jdk-11+12 for changeset 3ab6ba9f94a9
Thu, 03 May 2018 17:36:50 -0400 kbarrett 8200557: OopStorage parallel iteration scales poorly
Thu, 03 May 2018 14:13:20 -0700 erikj 8200083: Bump bootjdk requirement for JDK 11 to JDK 10
Thu, 03 May 2018 12:56:53 -0700 jjg 8194968: problem list actions for tools/javac/jvm/VerboseOutTest
Thu, 03 May 2018 12:13:43 -0700 joehw 8201138: Defect in XMLEventReader.getElementText() may cause data to be skipped, duplicated or otherwise result in a ClassCastException
Thu, 03 May 2018 11:18:57 -0700 mchung 8201793: (ref) Reference object should not support cloning
Thu, 03 May 2018 09:07:40 -0700 kvn 8202552: [AOT][JVMCI] Incorrect usage of INCLUDE_JVMCI and INCLUDE_AOT
Mon, 30 Apr 2018 15:55:21 +0200 stuefe 8202424: Metaspace: on chunk retirement, use correct lower limit on chunksize when adding blocks to free blocks list
Thu, 03 May 2018 06:20:37 -0700 vromero 8202584: de-problem list tools/javac/jvm/VerboseOutTest
Fri, 27 Apr 2018 15:00:04 -0400 coleenp 8202447: Fix unloading_occurred to mean unloading_occurred