log

age author description
Thu, 04 Jan 2018 14:44:38 -0800 iveresov 8194271: jaotc crashes with --debug flag
Thu, 04 Jan 2018 13:32:10 -0800 ksrini 8193671: Default Methods tab under Method Summary includes static methods
Thu, 04 Jan 2018 12:55:06 -0800 jjg 8194069: doclint throws missing comment warnings on lines which can't even have javadoc
Thu, 04 Jan 2018 12:24:56 -0800 rfield 8179858: jshell tool: sync nomenclature from reference to online /help
Thu, 04 Jan 2018 13:41:19 -0500 bobv Merge
Wed, 27 Dec 2017 11:31:09 +0100 goetz 8194232: Container memory not properly recognized.
Thu, 04 Jan 2018 09:22:17 -0800 bpatel 8192007: javadoc @uses and @provides tags in the modules documentation appears before the first-sentence summary of the service type.
Fri, 05 Jan 2018 12:46:22 -0800 bpb 8194649: Minor cleanup of parameter checking in ByteArrayOutputStream and ObjectInputStream
Fri, 05 Jan 2018 12:45:52 -0800 bpb 8193861: Typos in API documentation of File.toPath() and InetSocketAddress.getAddress()
Thu, 04 Jan 2018 19:58:45 -0800 jjiang 8189760: sun/security/ssl/CertPathRestrictions/TLSRestrictions.java failed with unexpected Exception intermittently
Thu, 04 Jan 2018 10:14:50 -0800 jjg 8194141: Remove JDK9Wrappers
Wed, 03 Jan 2018 15:16:46 -0800 ksrini 8193671: Default Methods tab under Method Summary includes static methods
Thu, 04 Jan 2018 15:50:51 +0000 alanb 8194644: Typo in ModuleDescriptor.read javadoc
Thu, 04 Jan 2018 04:22:28 +0000 lana Merge
Wed, 03 Jan 2018 18:21:10 -0800 joehw 8189704: broken links in the javax/xml/namespace package
Wed, 03 Jan 2018 14:41:17 -0800 goetz 8194482: Fix SIGSEGV in print_threads_compiling.jdk-10+38
Wed, 03 Jan 2018 11:10:56 -0800 jjg 8193125: javac should not compile a module if it requires java.base with modifiers
Wed, 03 Jan 2018 15:37:35 +0530 sveerabhadra 8193468: [PIT][TEST BUG]: java/awt/FileDialog/MoveToTrashTest.java fails on Linux
Wed, 03 Jan 2018 11:14:04 +0530 sballal 8194058: [TESTBUG] serviceability/sa/ClhsdbWhere.java fails to find method 'sleep' in output
Wed, 03 Jan 2018 10:55:35 +0530 sballal 8193506: serviceability/sa/TestClassDump.java fails in OpenJDK build
Tue, 02 Jan 2018 16:07:47 -0800 jjg 8183964: Bad lexing of javadoc comments (change in parsing/rendering of backslashes in javadoc)
Tue, 02 Jan 2018 09:56:53 -0800 shurailine 8192837: Need new test for release info file
Wed, 27 Dec 2017 11:26:36 +0530 sballal 8193428: serviceability/sa/ClhsdbSymbol.java fails: java.lang.RuntimeException: 'UsageTracker' missing from stdout/stderr
Tue, 26 Dec 2017 15:53:13 +0530 sballal 8193427: serviceability/sa/ClhsdbPrintStatics.java fails: java.lang.RuntimeException: '_jfr_checkpoints' missing from stdout/stderr
Tue, 26 Dec 2017 00:38:49 -0800 rraghavan 8193699: aarch64 fails to build after 8167372
Fri, 22 Dec 2017 22:06:54 -0800 dlong 8191854: Null pointer dereference in methodData.hpp:462
Fri, 22 Dec 2017 22:01:53 -0800 dlong 8191852: Null pointer dereference in ciKlass::get_Klass of ciKlass.hpp:58
Fri, 22 Dec 2017 18:49:41 +0000 dmarkov 8193435: Remove pre-1.2 SecurityManager text from java.awt.Toolkit
Wed, 20 Dec 2017 08:38:20 -0800 jcbeyler 8191988: JDK-8190862 work for arch s390
Fri, 22 Dec 2017 01:28:29 +0000 lana Merge
Fri, 22 Dec 2017 01:27:36 +0000 lana Added tag jdk-10+37 for changeset 4f830b447edf
Thu, 21 Dec 2017 17:08:05 -0800 joehw 8184431: References to @sun.com
Wed, 20 Dec 2017 17:36:50 +0100 attila 8193371: Use Dynalink REMOVE operation in Nashorn
Wed, 20 Dec 2017 11:40:45 -0800 psandoz 8193856: takeWhile produces incorrect result with elements produced by flatMap
Thu, 21 Dec 2017 09:29:24 -0800 joehw 8193568: @LastModified tag in license header
Thu, 21 Dec 2017 16:58:51 +0000 chegar 8193365: Improve interoperability between HTTP Client's BodyPublisher/BodySubscriber and Flow.Subscriber/Publisherjdk-10+37
Thu, 21 Dec 2017 10:26:03 +0100 hannesw 8193491: JavaImporter fails to resolve method elements within functions, that contain too many statements
Wed, 20 Dec 2017 13:28:23 -0800 jjg 8193512: Remove remnants of javah from jdk/jdk repo
Tue, 19 Dec 2017 15:56:28 -0500 coleenp 8193622: JFR test TestUnloadingEventClass.java times out intermittently
Wed, 20 Dec 2017 20:55:07 +0100 jwilhelm Merge
Wed, 13 Dec 2017 15:37:48 -0800 iklam 8165603: runtime/appcds/UseAppCDS.java: failed to clean up files after test when running with agentvm
Wed, 06 Dec 2017 11:11:16 +0100 lkorinth 8133805: Remove the bot_updates parameter from G1Allocator's allocation methods
Thu, 14 Dec 2017 12:49:47 +0530 jgeorge 8192985: SA: Test cases for the clhsdb 'inspect', 'scanoops' and 'printas' commands
Wed, 13 Dec 2017 20:35:09 -0800 dlong 8193323: Crash in "failed dependencies, but counter didn't change" with enabled UseJVMCICompiler
Wed, 13 Dec 2017 23:06:59 +0100 jwilhelm Merge
Wed, 13 Dec 2017 12:28:22 -0800 iveresov 8193439: Update Graal
Wed, 13 Dec 2017 11:59:55 -0800 kvn 8191788: add jdk.internal.vm.compiler to --limit-modules if -Djvmci.Compiler=graal is in the command line
Wed, 13 Dec 2017 19:32:48 +0300 vlivanov 8190869: C2: missing strength reduction of Math.pow(x, 2.0D) to x*x
Wed, 13 Dec 2017 07:14:18 -0500 coleenp 8193053: jvm crash by G1CMBitMapClosure::do_addr
Wed, 13 Dec 2017 10:21:21 +0100 neliasso 8192971: LockCompilationTest fails intermittently
Tue, 12 Dec 2017 21:46:06 -0500 bchristi 8190984: tools/launcher/TestXcheckJNIWarnings.java WARNING was found in the output
Fri, 08 Dec 2017 13:04:43 -0800 bchristi 8193271: ProblemList tools/launcher/TestXcheckJNIWarnings.java
Tue, 12 Dec 2017 21:43:00 -0500 dholmes Merge
Tue, 12 Dec 2017 19:06:19 -0500 dholmes 8193222: EnsureLocalCapacity() should maintain capacity requests through multiple calls
Tue, 12 Dec 2017 21:27:06 -0500 dcubed 8193407: jdk/hs fails Solaris slowdebug test-image build
Tue, 12 Dec 2017 14:14:06 -0500 coleenp Merge
Tue, 12 Dec 2017 11:55:57 -0500 coleenp 8193386: CompressedClassSize too large with MaxMetaspace
Tue, 12 Dec 2017 19:05:02 +0100 thartmann 8193363: TestDumpReplay.java fails with product builds
Sat, 09 Dec 2017 07:50:50 -0800 cjplummer 8191229: serviceability/jvmti/GetOwnedMonitorInfo/GetOwnedMonitorInfoTest.java fails with NoClassDefFoundError
Fri, 08 Dec 2017 23:43:25 +0100 jwilhelm Merge
Fri, 08 Dec 2017 15:14:08 -0800 ccheung 8192989: runtime/appcds/javaldr/ArrayTest.java crashes with assert(k->is_instance_klass())
Fri, 08 Dec 2017 15:24:47 -0500 dcubed 8193135: get rid of redundant _smr_ prefix/infix in ThreadSMRSupport stuff
Fri, 08 Dec 2017 15:41:11 +0530 sballal 8193124: SA: Testcases for clhsdb jdis and findpc commands
Wed, 20 Dec 2017 21:40:11 +0100 hannesw 8193508: Expressions in split literals must never be optimistic
Mon, 18 Dec 2017 10:21:38 +0000 chegar 8193698: Null handling in BodyPublisher, BodyHandler, and BodySubscriber convenience static factory methods
Tue, 19 Dec 2017 08:51:11 -0800 mr 8193764: Cannot set COMPANY_NAME when configuring a build
Tue, 19 Dec 2017 16:12:55 +0000 michaelm Merge
Tue, 19 Dec 2017 15:48:49 +0000 michaelm 8192966: HttpClient should reuse TCP connection for h2c connections
Tue, 19 Dec 2017 21:35:30 +0530 sundar 8193779: Fix copyright header in nashorn builtin scripts
Fri, 15 Dec 2017 14:08:15 +0100 mbaesken 8193515: AIX: new Harfbuzz 1.7.1 version fails to compile with xlC
Tue, 19 Dec 2017 10:03:36 +0000 alanb 8193758: Update copyright headers of files in src tree that are missing Classpath exception
Fri, 15 Dec 2017 21:49:33 +0000 dmarkov 8154405: AccessControlException by URLPermission check
Fri, 15 Dec 2017 10:44:06 -0800 vdeshpande 8190934: Regressions on Haswell Xeon due to JDK-8178811
Fri, 15 Dec 2017 10:26:45 -0800 roland 8193518: C2: Vector registers sometimes corrupted at safepoint
Fri, 15 Dec 2017 16:38:40 +0000 lana Added tag jdk-10+36 for changeset cb54a299aa91
Thu, 14 Dec 2017 13:16:33 -0800 jjg 8193525: Intermittent failures of TestModulePackages.java
Tue, 02 Jan 2018 16:35:04 -0500 vromero 8187487: crash with classes with same binary name
Fri, 22 Dec 2017 14:00:03 -0800 bpb 8193832: Performance of InputStream.readAllBytes() could be improved
Fri, 22 Dec 2017 15:23:34 -0500 dholmes 8194071: [Testbug] Update VMDeprecatedOptions test for obsolete/expired options
Tue, 19 Dec 2017 17:31:53 -0500 dholmes 8193840: Add compiler/c2/Test8007294.java to the problem list
Mon, 18 Dec 2017 12:11:01 +0100 rehn 8193514: UseMembar should not be obsoleted yet
Fri, 15 Dec 2017 16:51:13 +0100 thartmann 8193608: Quarantine test/hotspot/jtreg/compiler/codegen/Test6896617.java until JDK-8193479 is fixed
Thu, 21 Dec 2017 15:18:49 -0800 mchung 8193767: Improve javadoc in ResourceBundle working with modules
Thu, 21 Dec 2017 15:04:45 -0800 mchung 8193780: (ref) Remove the undocumented "jdk.lang.ref.disableClearBeforeEnqueue" system property
Thu, 21 Dec 2017 15:58:45 -0500 cushon 8193216: Filer should warn if processors redefine symbols from the classpath or sourcepath
Thu, 21 Dec 2017 05:51:38 +0000 xuelei 8193683: Increase the number of clones in the CloneableDigest
Wed, 20 Dec 2017 22:36:21 -0500 dholmes 8193838: Update jtreg requiredVersion to 4.2 b11 for JDK 11 and 12 support
Wed, 20 Dec 2017 09:14:52 -0800 psandoz 8193085: Vectorize the nio Buffer equals and compareTo implementations
Wed, 20 Dec 2017 09:14:06 -0800 psandoz 8191913: Bump classfile version number to 55
Wed, 20 Dec 2017 17:36:50 +0100 attila 8193371: Use Dynalink REMOVE operation in Nashorn
Wed, 20 Dec 2017 08:05:04 -0800 bpb 8193842: Replace Files.copy(InputStream,OutputStream) with InputStream.transferTo(OutputStream)
Wed, 20 Dec 2017 15:33:31 +0000 mcimadamore 8057650: uniform error diagnostics for inconsistent inherited method signatures
Tue, 19 Dec 2017 13:58:31 -0800 prr Merge
Tue, 19 Dec 2017 13:02:39 -0800 prr Merge
Tue, 19 Dec 2017 11:37:00 -0800 rfield 8179858: jshell tool: sync nomenclature from reference to online /help
Mon, 18 Dec 2017 10:28:43 -0800 prr Merge
Wed, 13 Dec 2017 14:21:12 -0800 rfield 8188894: jdk/jshell/ToolShiftTabTest.java failed with IllegalStateException
Wed, 13 Dec 2017 10:56:50 -0800 prr Merge
Wed, 13 Dec 2017 14:41:27 +0000 dmarkov 8154405: AccessControlException by URLPermission check
Tue, 19 Dec 2017 16:24:25 -0500 cushon 8007720: Names are not loaded correctly for method parameters if the parameters have annotations
Mon, 18 Dec 2017 18:51:40 -0800 darcy 8173382: Add -source 11 and -target 11 to javac
Fri, 15 Dec 2017 23:43:35 -0500 dholmes 8193364: verify_special_jvm_flags should not cause an assertion failure when version is bumped
Fri, 15 Dec 2017 06:18:09 +0000 lana Added tag jdk-10+36 for changeset 959f2f7cbaa6
Thu, 14 Dec 2017 13:16:33 -0800 jjg 8193525: Intermittent failures of TestModulePackages.javajdk-10+36
Thu, 14 Dec 2017 20:25:09 +0000 lana Added tag jdk-11+0 for changeset 0ee20aad71c4
Thu, 14 Dec 2017 18:20:33 +0100 erikj 8193208: Add additional licensing file for the JDK
Thu, 14 Dec 2017 16:05:08 +0100 redestad 8193507: [REDO] Startup regression due to JDK-8185582jdk-11+0
Thu, 14 Dec 2017 12:51:53 +0000 alanb Merge
Thu, 14 Dec 2017 12:36:37 +0000 alanb 8193503: javah launcher was not removed by JDK-8191054
Thu, 14 Dec 2017 13:42:59 +0100 attila 8193296: Parser should not eagerly transform delete expressions
Thu, 14 Dec 2017 20:19:34 +0800 weijun 8192988: keytool should support -storepasswd for pkcs12 keystores
Thu, 14 Dec 2017 13:05:20 +0100 mdoerr 8193257: PPC64, s390 implementation for Thread-local handshakes
Thu, 14 Dec 2017 12:02:16 +0100 lucy 8193443: [s390]: EncodeISOArray generates wrong vector code
Wed, 13 Dec 2017 21:41:50 -0800 sherman 8193490: java/util/zip/ZipFile/ClearStaleZipFileInputStreams.java, FinalizeZipFile.java, TestCleaner.java, Collectible.java failed because cleaner can't finish
Wed, 13 Dec 2017 19:48:03 -0800 darcy 8193489: Add information about local variable type inference to SourceVersion.RELEASE_10
Wed, 13 Dec 2017 18:47:20 -0800 smarks 8140281: add no-arg Optional.orElseThrow() as preferred alternative to get()
Wed, 13 Dec 2017 17:28:24 -0800 mr 8192833: JEP 322: Time-Based Release Versioning
Wed, 13 Dec 2017 17:29:44 -0800 jjg Merge
Wed, 13 Dec 2017 17:27:43 -0800 jjg 8178070: duplicate entries in package table
Thu, 14 Dec 2017 02:26:45 +0100 hannesw 8191301: JavaImporter fails to resolve imported elements within functions, that contain too many statements
Wed, 13 Dec 2017 14:49:48 -0800 jjg 8191054: Remove the Native-Header Tool (javah)
Wed, 13 Dec 2017 14:23:34 -0800 smarks 8193476: (jdeprscan) additional version updates for JDK 10
Wed, 13 Dec 2017 10:21:21 +0100 neliasso 8192971: LockCompilationTest fails intermittently
Fri, 08 Dec 2017 23:43:25 +0100 jwilhelm Merge
Thu, 07 Dec 2017 20:08:10 -0500 dcubed 8193225: [BACKOUT] fix for 8182307 Error during JRMP connection establishment
Thu, 07 Dec 2017 15:26:49 -0500 dcubed 8182307: Error during JRMP connection establishment
Thu, 07 Dec 2017 10:21:13 -0800 sangheki 8193105: Print error code when map_memory_to_file() fails
Thu, 07 Dec 2017 15:52:46 +0100 roland 8192908: -XX:+UseCountedLoopSafepoints alone doesn't disable strip mining with G1
Thu, 07 Dec 2017 10:18:31 +0100 jwilhelm Merge
Wed, 06 Dec 2017 18:37:57 -0800 dlong 8193009: compiler/c2/Test7029152.java crashes with SIGILL in java.lang.StringLatin1.indexOf with -XX:+UseJVMCICompiler
Wed, 06 Dec 2017 20:06:43 -0500 jiangli 8193065: [TESTBUG] [TESTBUG]GCSharedStringsDuringDump.java: Exception in thread "main" java.lang.RuntimeException: String is not shared.
Wed, 06 Dec 2017 15:19:30 -0500 dcubed 8191789: migrate more Thread-SMR stuff from thread.[ch]pp -> threadSMR.[ch]pp
Tue, 05 Dec 2017 11:16:03 -0800 dlong 8192870: [Testbug] runtime/handshake/HandshakeTransitionTest throws NPE
Tue, 05 Dec 2017 10:38:31 -0800 dlong 8145579: SimpleThresholdPolicy assumes non-trivial methods to be trivial
Tue, 05 Dec 2017 09:49:23 -0800 kvn 8192846: Support cmov vectorization for float
Tue, 05 Dec 2017 21:26:11 +0530 hb 8192909: Invalid username or password in HashedPasswordFileTest.java
Tue, 05 Dec 2017 16:34:03 +0100 sjohanss 8193068: Add gc/g1/TestVerifyGCType.java to problem list
Tue, 05 Dec 2017 13:58:55 +0100 sjohanss 8192983: gc/g1/TestVerifyGCType.java might fail on loaded machines
Tue, 05 Dec 2017 11:23:27 +0100 ihse 8193045: JDK-8190484 breaks build on Windows
Thu, 30 Nov 2017 15:54:45 +0100 phedlin 8191232: compiler/intrinsics/bigInteger/TestMultiplyToLen.java fails with java.lang.Exception: Failed
Tue, 05 Dec 2017 02:55:44 -0500 dholmes 8192950: Missing -nativepath for svc tests
Tue, 05 Dec 2017 08:27:54 +0100 thartmann 8191360: Lookup of critical JNI method causes duplicate library loading with leaking handler
Mon, 04 Dec 2017 10:23:08 +0900 ysuenaga 8192897: NPE occurs on clhsdb jstack
Mon, 04 Dec 2017 23:55:52 +0100 ihse 8190484: Move jvm.h, jmm.h et al to hotspot/*/include
Mon, 04 Dec 2017 13:13:44 -0800 never 8191052: [Graal] java/lang/invoke/CallSiteTest.java intermittently fails with "Failed dependency of type call_site_target_value" when running with Graal as JIT
Sat, 02 Dec 2017 13:50:04 +0100 roland 8191950: assertion failed: no insertions allowed
Sat, 02 Dec 2017 06:51:10 +0100 jwilhelm Merge
Sat, 02 Dec 2017 11:25:35 +0530 sballal 8192823: SA: Testcase for 'clhsdb source' command
Wed, 13 Dec 2017 12:45:06 -0800 bpatel 8164407: Add module support for -link and -linkoffline javadoc option
Wed, 13 Dec 2017 21:25:49 +0100 redestad 8193471: Startup regression due to JDK-8185582
Wed, 13 Dec 2017 11:43:57 -0800 bchristi 8193460: Take tools/launcher/TestXcheckJNIWarnings.java back off the ProblemList
Wed, 13 Dec 2017 10:25:38 -0800 prr Merge
Wed, 13 Dec 2017 13:27:45 +0530 akolarkunnu 8191803: [TEST_BUG] : sanity/client/SwingSet/src/ProgressBarDemoTest.java failed with "Wait "greater then 1349" state to be reached
Tue, 12 Dec 2017 15:47:35 +0530 kaddepalli 8187936: Automatically selecting a new JTree node in a model listener can cause unusual behavior
Tue, 12 Dec 2017 14:05:21 +0530 pnarayanan 8188083: NullPointerExcpn-java.awt.image.FilteredImageSource.startProduction JDK-8079607
Tue, 12 Dec 2017 12:43:05 +0530 sveerabhadra 8146537: TrayIcon Action Listener doesnt work in WIndows 10
Tue, 12 Dec 2017 12:31:49 +0530 sveerabhadra 8190515: java.awt.Desktop.moveToTrash(File) prompts on Windows 7 but not on Mac
Mon, 11 Dec 2017 21:56:34 -0800 rfield 8162989: jshell tool: /edit with external editor leaks files in /tmp
Mon, 11 Dec 2017 15:17:03 -0800 prr 8189809: Large performance regression in Swing text layout
Mon, 11 Dec 2017 21:14:43 +0100 lbourges 8191814: Marlin rasterizer spends time computing geometry for stroked segments that do not intersect the clip
Mon, 11 Dec 2017 10:08:51 -0800 prr Merge
Sun, 10 Dec 2017 00:08:42 -0800 serb 8178401: Various audio files writers do not close file streams properly
Sat, 09 Dec 2017 20:40:45 -0800 serb 8193012: Small cleanup of AWTEvent class
Sat, 09 Dec 2017 11:40:40 -0800 prr 8183960: Upgrade to libpng 1.6.34
Fri, 08 Dec 2017 13:15:19 -0800 prr 8193211: Update jtreg TEST.groups and ProblemList for client-libs
Fri, 08 Dec 2017 12:55:21 -0800 ssadetsky 8177758: Regression in java.awt.FileDialog
Fri, 08 Dec 2017 15:57:30 +0530 pbansal 8191436: ListSelectionModel.setSelectionMode() underspecified
Fri, 08 Dec 2017 10:03:07 +0530 psadhukhan 8191639: NPE from BasicListUI.Actions.getNextPageIndex
Thu, 07 Dec 2017 13:23:18 -0800 rfield 8192863: jshell tool: /<id><tab> gives "No such command"
Thu, 07 Dec 2017 11:55:06 -0800 prr 8188836: Upgrade to Harfbuzz 1.7.1 in JDK 10
Tue, 05 Dec 2017 11:04:42 -0800 rfield 8192979: jshell tool: Online help text for commands is confusing
Mon, 04 Dec 2017 17:15:38 -0800 rfield 8191455: jdk/jshell/StartOptionTest.java and jdk/jshell/ToolProviderTest.java failed after changeset e0f08a
Mon, 04 Dec 2017 16:14:29 -0800 serb 8189656: The Windows L&F should be moved out from the shared folder
Mon, 04 Dec 2017 10:12:46 -0800 prr Merge
Mon, 04 Dec 2017 09:38:34 -0800 prr 8182610: Update specification of service providers for IIORegistry and ServiceRegistry
Sun, 03 Dec 2017 13:21:41 +0000 alitvinov 8181659: Create an alternative fix for JDK-8167102, whose fix was backed out
Fri, 01 Dec 2017 17:44:07 -0800 serb 8183518: Premature deprecation of Event/InputEvent/KeyEvent in Java 9
Fri, 01 Dec 2017 10:35:58 -0800 prr Merge
Fri, 01 Dec 2017 10:30:57 -0800 prr 8191767: Memory leak in JabSwitch
Wed, 29 Nov 2017 15:11:37 -0800 serb 8182410: missing 'title' in api/javax/swing/plaf/synth/doc-files/componentProperties.html
Wed, 13 Dec 2017 16:16:17 +0000 dfuchs 8193370: Provide more user friendly defaults for HTTP/2 client settings
Wed, 13 Dec 2017 07:51:57 -0800 sherman 8184947: ZipCoder performance improvements
Wed, 13 Dec 2017 15:32:36 +0000 alanb 8193454: ModuleDescriptor.{Requires,Exports,Open} toString should use toLowerCase(Local.ROOT)
Wed, 06 Dec 2017 15:51:06 -0800 martin 8193034: Optimize URL.toExternalForm
Wed, 13 Dec 2017 11:27:28 +0100 jlahoda 8191636: [Windows] jshell tool: Wrong character in /env class-path command crashes jshell
Wed, 13 Dec 2017 12:43:38 +0530 nishjain 8190278: ClassCastException is thrown by java.util.Scanner when a NumberFormatProvider is used.
Tue, 12 Dec 2017 20:18:14 -0800 ksrini 8192850: method summary tables of inherited methods improperly list static interface methods
Tue, 12 Dec 2017 19:20:39 -0800 rhalade 8189131: Open-source the Oracle JDK Root Certificates
Tue, 12 Dec 2017 15:43:48 -0800 bpb 8170495: JNI primitive type mismatch in SocketDispatcher.c:187
Tue, 12 Dec 2017 14:16:24 -0800 ksrini 8193107: javadoc complains about empty module
Tue, 12 Dec 2017 11:31:38 -0800 mchung 8193192: jdeps --generate-module-info does not look at module path
Tue, 12 Dec 2017 11:10:12 -0800 joehw 8183743: Umbrella: add overloads that take a Charset parameter
Tue, 12 Dec 2017 10:21:58 -0800 naoto 8176841: Additional Unicode Language-Tag Extensions
Tue, 12 Dec 2017 09:33:37 -0800 psandoz 8187254: MethodType allows unvalidated parameter types
Tue, 12 Dec 2017 09:33:35 -0800 psandoz 8171826: Comparator.reverseOrder(c) mishandles singleton comparators
Wed, 13 Dec 2017 01:29:58 +0800 weijun 8165996: PKCS11 using NSS throws an error regarding secmod.db when NSS uses sqlite
Tue, 12 Dec 2017 15:38:18 +0100 hannesw 8069338: Implement sharedScopeCall for optimistic types
Tue, 12 Dec 2017 18:40:31 +0530 sadayapalam 8193142: Regression: ClassCastException: Type$ErrorType cannot be cast to Type$ArrayType
Tue, 12 Dec 2017 13:08:22 +0000 chegar 8185027: Typo in java.net.URLClassLoader.findResources(String) method documentation
Tue, 12 Dec 2017 14:04:57 +0100 attila 8191905: Add a REMOVE StandardOperation to Dynalink
Tue, 12 Dec 2017 14:04:05 +0100 attila 8193298: Don't run javadoc with test.single
Tue, 12 Dec 2017 09:16:12 +0100 clanger 8193258: Better usage of JDWP HEADER SIZE
Mon, 11 Dec 2017 19:56:44 -0800 joehw 8190823: Broken link in org/w3c/dom/ls/
Mon, 04 Dec 2017 10:23:08 +0900 ysuenaga 8192897: NPE occurs on clhsdb jstack
Tue, 12 Dec 2017 00:30:57 +0100 plevart 8191216: SimpleTimeZone.clone() has a data race on cache fields
Mon, 11 Dec 2017 11:45:02 -0800 sherman 8185582: Update Zip implementation to use Cleaner, not finalizers
Mon, 11 Dec 2017 18:33:53 +0100 jlahoda 8189778: Jshell crash on tab for StringBuilder.append(
Fri, 08 Dec 2017 16:28:14 +0100 jlahoda 8189782: com.sun.tools.javac.api.JavacTool.isSupportedOption misreports number of arguments consumed
Mon, 11 Dec 2017 08:20:05 +0100 clanger 8192978: Missing checks and small fixes in jdwp library
Mon, 11 Dec 2017 06:58:14 +0530 sadayapalam 8182401: Verification error for enclosing instance capture inside super constructor invocation
Fri, 08 Dec 2017 15:30:53 -0800 dl 8192944: Miscellaneous changes imported from jsr166 CVS 2017-12-08
Fri, 08 Dec 2017 15:26:56 -0800 dl 8192943: Optimize atomic accumulators using VarHandle getAndSet
Fri, 08 Dec 2017 15:22:58 -0800 dl 8193174: SubmissionPublisher invokes the Subscriber's onComplete before all of its submitted items have been published
Sun, 03 Dec 2017 13:06:51 -0800 martin 8192935: Fix EnumSet's SerializationProxy javadoc
Fri, 08 Dec 2017 13:04:43 -0800 bchristi 8193271: ProblemList tools/launcher/TestXcheckJNIWarnings.java
Fri, 08 Dec 2017 11:03:37 -0800 iignatyev 8181118: update java/time tests to use RandomFactory from the top level testlibrary
Fri, 08 Dec 2017 11:05:42 -0800 darcy 8193194: Update javax.lang.model.util visitors for 10
Fri, 08 Dec 2017 17:40:57 +0000 dfuchs 8187073: The java.util.logging.Level.findLevel() will not correctly find a Level by it's int value
Fri, 08 Dec 2017 16:41:30 +0000 xuelei 8148421: Transport Layer Security (TLS) Session Hash and Extended Master Secret Extension
Fri, 01 Dec 2017 16:40:08 -0500 rriggs 8080225: FileInput/OutputStream/FileChannel cleanup should be improved
Fri, 08 Dec 2017 20:46:40 +0530 sundar 8192986: Inconsistent handling of exploded modules in jlink
Fri, 08 Dec 2017 14:28:51 +0000 alanb 8193256: Configuration and ModuleLayer findModule cleanup
Fri, 08 Dec 2017 11:50:39 +0000 dfuchs 8191033: Regression in logging.properties: specifying .handlers= for root logger (instead of handlers=) no longer works
Fri, 08 Dec 2017 12:02:30 +0100 hannesw 8193137: Nashorn crashes when given an empty script file
Fri, 08 Dec 2017 11:48:38 +0100 attila 8192970: Element getters/setters with fixed key fail to link properly
Fri, 08 Dec 2017 09:48:10 +0100 clanger 8193183: Fix format string in libdt_shmem/shmemBase.c
Thu, 07 Dec 2017 21:07:12 -0800 ksrini 8034254: Don't use binary testing files broken.jar
Fri, 08 Dec 2017 09:40:14 +0800 weijun 8192987: keytool should remember real storetype if it is not provided
Thu, 07 Dec 2017 14:21:25 -0800 ksrini 8149402: "-group" option issue for classes from default package
Thu, 07 Dec 2017 14:23:52 -0800 smarks 8177681: Remove methods Runtime.getLocalized{Input,Output}Stream
Thu, 07 Dec 2017 14:15:14 -0800 ksrini 8191030: @value Tags are not resolved by javadoc 9.
Thu, 07 Dec 2017 22:37:45 +0100 erikj 8188789: Update JDK 9.0.1 and Future OpenJDK bundle names
Thu, 07 Dec 2017 21:06:02 +0000 lana Merge
Thu, 07 Dec 2017 21:04:24 +0000 lana Added tag jdk-10+35 for changeset d8c634b016c6
Thu, 07 Dec 2017 11:00:32 -0800 darcy 8193191: Update JavacTestingAbstractProcessor for JDK 10
Thu, 07 Dec 2017 19:24:27 +0100 jlahoda 8189248: Jshell: error with mutually dependent snippets, when one must be replaced
Thu, 07 Dec 2017 10:18:22 -0800 igerasim 8193156: Need to backout fixes for JDK-8058547, JDK-8055753, JDK-8085903
Thu, 07 Dec 2017 09:23:15 -0800 mchung 8192945: Need stable sort for MODULES entry in the release file
Thu, 07 Dec 2017 09:22:35 -0800 mchung 8193159: Reduce the number of classes loaded due to NativeLibrary
Thu, 07 Dec 2017 08:56:04 -0800 bpb 8191872: (fs) UnixNativeDispatcher conditionally compiles in support for high precision timestamps
Thu, 07 Dec 2017 16:45:19 +0000 alanb 8191867: Module attribute in 54.0+ class file cannot contains a requires java.base with ACC_TRANSITIVE or ACC_STATIC_PHASE
Tue, 05 Dec 2017 16:34:03 +0100 sjohanss 8193068: Add gc/g1/TestVerifyGCType.java to problem list
Wed, 06 Dec 2017 20:06:43 -0500 jiangli 8193065: [TESTBUG] [TESTBUG]GCSharedStringsDuringDump.java: Exception in thread "main" java.lang.RuntimeException: String is not shared.
Wed, 06 Dec 2017 18:37:57 -0800 dlong 8193009: compiler/c2/Test7029152.java crashes with SIGILL in java.lang.StringLatin1.indexOf with -XX:+UseJVMCICompiler
Tue, 05 Dec 2017 13:58:55 +0100 sjohanss 8192983: gc/g1/TestVerifyGCType.java might fail on loaded machines
Tue, 05 Dec 2017 21:26:11 +0530 hb 8192909: Invalid username or password in HashedPasswordFileTest.java
Sat, 02 Dec 2017 13:50:04 +0100 roland 8191950: assertion failed: no insertions allowed
Sat, 02 Dec 2017 06:51:10 +0100 jwilhelm Merge
Fri, 01 Dec 2017 16:58:30 -0800 vdeshpande 8170244: Update UseAVX after cpu feature detection to use more default mapping
Fri, 01 Dec 2017 16:23:17 -0800 vdeshpande 8190494: Different results with UseAVX=3 when calling AVX-512 native function via JNI
Fri, 01 Dec 2017 16:20:18 -0800 roland 8192762: LoopNode::verify_strip_mined() fails with "assert failed: only phis"
Fri, 01 Dec 2017 15:58:39 -0800 iignatyev 8191273: applications/ctw/modules tests fail intermittently
Fri, 01 Dec 2017 15:53:15 -0800 iklam 8190809: JVM crashes while generating appcds for classpath with empty directory entry
Fri, 01 Dec 2017 11:17:45 -0800 dlong 8192814: Update Graal
Fri, 01 Dec 2017 14:19:16 -0500 coleenp Merge
Fri, 01 Dec 2017 11:26:22 -0500 mdoerr 8192898: AIX build broken after JDK-8190308
Fri, 01 Dec 2017 17:10:33 +0100 mdoerr 8192825: PPC64: Missing null check in C1 inline cache check
Fri, 01 Dec 2017 17:09:43 +0100 lucy 8192818: [s390]: restoring register contents calculates wrong value
Fri, 01 Dec 2017 17:03:07 +0100 egahlin 8179083: Uninitialized notifier in Java Monitor Wait tracing event
Fri, 01 Dec 2017 11:00:46 -0500 dcubed 8192810: EnableThreadSMRStatistics should be default off in release builds
Fri, 01 Dec 2017 18:24:52 +0300 dpochepk 8189439: Parameters type profiling is not performed from aarch64 interpreter
Fri, 01 Dec 2017 18:20:00 +0300 dchuyko 8191129: AARCH64: Invalid value passed to critical JNI function
Fri, 01 Dec 2017 18:19:39 +0530 jgeorge 8191538: SA: tests for clhsdb commands: vmstructsdump, field, symboltable and symbol
Fri, 01 Dec 2017 00:57:01 -0800 jcm 8006887: Comment about LIR_OprDesc.value in c1_LIR.hpp is incorrect
Fri, 01 Dec 2017 08:56:22 +0100 sjohanss 8191821: Finer granularity for GC verification
Fri, 01 Dec 2017 11:40:39 +0530 jgeorge 8191914: New SA test timeout on windows
Thu, 30 Nov 2017 21:28:12 -0800 mseledtsov 8192866: [TESTBUG] Move UseAppCDS.java from the closed ProblemList.txt to the open one
Thu, 30 Nov 2017 20:45:03 -0800 mseledtsov 8191943: [TESTBUG] docker/TestCPUAwareness fails on machine with 2 CPUs
Fri, 01 Dec 2017 10:04:31 +0900 ysuenaga 8190837: BasicType and BasicTypeSize should refer to HotSpot values
Thu, 30 Nov 2017 16:28:47 -0800 cjplummer 8192840: serviceability/dcmd/jvmti/AttachFailed/AttachNoEntry.java failing on Windows
Thu, 30 Nov 2017 18:38:20 -0500 dcubed 8191787: move private inline functions from thread.inline.hpp -> thread.cpp
Thu, 30 Nov 2017 10:40:48 -0800 dlong 8191437: AOT doesn't work easily after thread local handshakes
Thu, 30 Nov 2017 14:25:33 -0800 ccheung 8174101: Bootclasspath append should not invalidate CDS archive
Thu, 30 Nov 2017 16:00:34 -0500 ecaspole 8192821: Make LogCompilation into a maven project
Thu, 30 Nov 2017 20:37:20 +0100 eosterlund 8186787: clang-4.0 SIGSEGV in Unsafe_PutByte
Thu, 30 Nov 2017 13:40:07 +0100 rkennke 8191564: Refactor GC related servicability code into GC specific subclasses
Thu, 30 Nov 2017 08:35:33 -0800 iveresov 8192756: SIGSEGV in nmethod::new_native_nmethod
Thu, 30 Nov 2017 21:24:52 +0530 jgeorge 8191324: SA cleanup -- part 2
Thu, 30 Nov 2017 16:08:13 +0100 rehn 8192072: 8191782 fix for VMDeprecatedOptions.java missed DeferThrSuspendLoopCount and duplicated DeferPollingPageLoopCount
Thu, 30 Nov 2017 10:01:26 -0500 ecaspole Merge
Thu, 30 Nov 2017 09:59:27 -0500 ecaspole 8191779: LogCompilation throws java.lang.Error: scope underflow
Thu, 30 Nov 2017 09:51:28 -0500 bobv Merge
Thu, 30 Nov 2017 09:49:45 -0500 bobv 8192154: JVM crashes inside some chroot environments on linux
Thu, 30 Nov 2017 19:46:20 +0530 sballal 8191658: SA: Testcases for attach, detach, reattach and Jhisto commands
Thu, 30 Nov 2017 15:05:03 +0100 sjohanss 8192807: testlibrary_tests/TestMutuallyExclusivePlatformPredicates.java fail due to new method in Platform.java
Thu, 30 Nov 2017 14:58:41 +0530 sballal 8184982: SA: Running ClassDump on a simple java program generates NullPointerException
Tue, 28 Nov 2017 21:43:45 +0100 stefank 8192061: Clean up allocation.inline.hpp includes
Wed, 29 Nov 2017 18:43:35 -0800 iklam 8191747: [TESTBUG] runtime/appcds/DumpClassList.java and ProhibitedPackage.java fail on product bits
Tue, 28 Nov 2017 09:47:04 -0800 iklam 8191927: Enable AppCDS for custom loaders on all 64-bit Linux and AIX
Wed, 29 Nov 2017 16:45:31 -0800 kkharbas 8190980: Develop test cases and collect test pass rate
Wed, 29 Nov 2017 17:03:10 -0800 kkharbas 8190308: Implementation: JEP 316: Heap Allocation on Alternative Memory Devices
Wed, 29 Nov 2017 10:30:51 -0800 kvn 8184361: AOT lib at jdk/lib/libjava.base-coop.so seems to override -XX:AOTLibrary=
Wed, 29 Nov 2017 14:34:19 +0300 dchuyko 8188221: Return type profiling is not performed from aarch64 interpreter
Wed, 29 Nov 2017 09:26:58 +0900 ysuenaga 8165736: Error message should be shown when JVMTI agent cannot be attached
Tue, 28 Nov 2017 17:11:02 -0500 coleenp Merge
Mon, 27 Nov 2017 17:19:53 -0500 zgu 8190729: Adjustment to anonymous metadata space chunk allocation algorithm
Tue, 28 Nov 2017 15:52:32 -0500 kbarrett 8191870: Remove badJNIHandle
Tue, 28 Nov 2017 19:02:23 +0100 thartmann 8191996: VM startup fails with CodeCacheExpansionSize=32768 is outside the allowed range
Tue, 28 Nov 2017 11:59:16 +0100 roland 8186027: C2: loop strip mining
Tue, 28 Nov 2017 21:04:42 +0530 hb 5016517: Replace plaintext passwords by hashed passwords for out-of-the-box JMX Agent
Tue, 28 Nov 2017 14:20:15 +0100 simonis 8191863: [s390] Fix CDS: some bytecode rewriting doesn't depend on RewriteControl
Tue, 28 Nov 2017 14:11:43 +0100 simonis 8191770: [ppc64] Fix CDS: don't rewrite invokefinal if DumpSharedSpaces
Tue, 28 Nov 2017 15:42:15 +0300 dchuyko 8191769: AARCH64: Fix hint instructions encoding
Tue, 28 Nov 2017 12:23:03 +0100 drwhite 8188877: Improper synchronization in offer_termination
Tue, 28 Nov 2017 14:16:24 +0530 jgeorge 8191961: SA: Remove left over quarantined SA tests due to 8184042 from ProblemList.txt
Mon, 27 Nov 2017 20:21:34 -0800 iklam 8188791: Move AppCDS from closed repo to open repo
Mon, 27 Nov 2017 20:35:56 -0500 jiangli 8191504: [TESTBUG] CDSTestUtils.isUnableToMap() should check OptionalData region mapping failure
Tue, 20 Jun 2017 16:25:53 +0800 njian 8181633: Vectorization fails for some multiplication with constant cases
Mon, 27 Nov 2017 16:05:11 -0800 roland 8191887: assert(b->is_Bool()) in PhaseIdealLoop::clone_iff() due to Opaque4 node
Mon, 27 Nov 2017 17:51:21 -0500 dcubed Merge
Mon, 27 Nov 2017 15:26:55 -0500 jgeorge 8191919: Include TestJhsdbJstackLock.java in ProblemList.txt
Mon, 27 Nov 2017 13:19:08 -0800 sangheki 8178497: Bug in MutableNUMASpace::ensure_parsability
Mon, 27 Nov 2017 10:44:19 -0800 roland 8191153: assert(u_ctrl != blk1 && u_ctrl != blk2) failed: won't converge
Fri, 10 Nov 2017 10:30:42 +0100 jtulach 8189116: Give the jdk.internal.vm.compiler.management only the permissions it really needs to expose the bean
Mon, 27 Nov 2017 17:26:47 +0000 aph Merge
Mon, 27 Nov 2017 17:04:45 +0000 aph Merge
Fri, 24 Nov 2017 17:19:47 +0000 aph 8189596: AArch64: implementation for Thread-local handshakes
Fri, 24 Nov 2017 12:16:25 +0100 glaubitz 8186461: Zero's atomic_copy64() should use SPE instructions on linux-powerpcspe
Tue, 21 Nov 2017 13:48:28 +0100 glaubitz 8187227: Zero should use compiler built-ins for atomics on linux-m68k
Mon, 27 Nov 2017 14:59:36 +0100 gromero 8191868: IdealGraphVisualizer: "ant build/run" fails due to outdated bootstrap.url
Mon, 27 Nov 2017 13:50:03 +0100 pliden 8191864: Provide a public destructor for WorkGang
Mon, 27 Nov 2017 13:34:00 +0100 pliden 8191862: Warn about UseNUMA/UseLargePages only when using ParallelGC
Mon, 27 Nov 2017 12:38:47 +0100 pliden 8191846: jstat prints debug message when debugging is disabled
Mon, 27 Nov 2017 03:11:38 -0800 rraghavan 8191227: issues with unsafe handle resolution
Mon, 27 Nov 2017 11:41:00 +0100 thartmann 8087339: The code heap might use different alignment for committed size and reserved size
Mon, 27 Nov 2017 11:39:21 +0100 thartmann 8179026: Remove explicit code cache options processing
Mon, 27 Nov 2017 10:51:31 +0100 ehelin 8080345: With perm gen gone, perfdata counter sun.gc.policy.generations should be 2, not 3
Fri, 24 Nov 2017 15:48:01 +0100 stefank 8191861: Move and refactor hSpaceCounters
Fri, 24 Nov 2017 15:21:30 +0100 stefank 8191860: Add perfData.inline.hpp
Fri, 24 Nov 2017 15:21:28 +0100 stefank 8191858: Add missing includes in memoryManager.hpp
Mon, 27 Nov 2017 11:20:38 +0530 ysuenaga 8185796: jstack and clhsdb jstack should show lock objects
Sun, 26 Nov 2017 09:05:13 -0800 rraghavan 8191313: compiler/runtime/SpreadNullArg.java fails in tier1
Sat, 25 Nov 2017 20:28:10 +0100 jwilhelm Merge
Sat, 25 Nov 2017 04:36:43 +0100 jwilhelm Merge
Fri, 24 Nov 2017 14:07:59 +0100 dholmes 8191707: Options with invalid values are incorrectly treated as obsolete and ignored
Fri, 24 Nov 2017 13:58:52 +0100 rehn 8191782: Missing deprecated options in VMDeprecatedOptions.java
Thu, 23 Nov 2017 19:42:56 -0800 dcubed Merge
Thu, 23 Nov 2017 06:01:57 -0800 dcubed Merge
Wed, 22 Nov 2017 17:54:50 -0800 dcubed 8167108: inconsistent handling of SR_lock can lead to crashes
Wed, 22 Nov 2017 18:58:01 -0500 aharlap 8185591: guarantee(_byte_map[_guard_index] == last_card) failed: card table guard has been modified
Thu, 23 Nov 2017 15:51:06 +0100 tschatzl 8190426: Lazily initialize refinement threads with UseDynamicNumberOfGCThreads
Thu, 23 Nov 2017 15:51:06 +0100 tschatzl 8182050: assert(_whole_heap.contains(p)) failed: Attempt to access p out of bounds of card marking array's _whole_heap
Thu, 23 Nov 2017 15:51:06 +0100 tschatzl 8179244: Assert failed in instanceMirrorKlass.inline.hpp
Thu, 23 Nov 2017 09:53:53 +0100 sjohanss 8189733: Cleanup Full GC setup and tear down
Wed, 22 Nov 2017 16:10:42 -0800 ccheung Merge
Wed, 22 Nov 2017 16:08:39 -0800 ccheung 8191653: Test failures in BootAppendTests - missing jdk.internal.vm.compiler module
Wed, 22 Nov 2017 17:57:27 +0100 simonis 8187280: Remove unused methods from StubQueue
Wed, 22 Nov 2017 14:31:48 -0500 ctornqvi 8191768: Introduce a concurrency factor to be able to scale up or down jtreg concurrency when running Hotspot tests
Wed, 22 Nov 2017 09:27:06 -0800 dlong 8191688: Assert failed in > 200 tests: failed dependencies, but counter didn't change
Wed, 22 Nov 2017 17:10:38 +0100 lucy 8189793: [s390]: Improve String compress/inflate by exploiting vector instructions
Wed, 22 Nov 2017 16:57:34 +0100 jwilhelm Merge
Thu, 16 Nov 2017 14:06:44 -0500 aharlap 8187819: gc/TestFullGCALot.java fails on jdk10 started with "-XX:-UseCompressedOops" option
Mon, 13 Nov 2017 15:28:17 +0100 lkorinth 8190408: Run G1CMRemarkTask with the appropriate amount of threads instead of starting up everyone
Wed, 22 Nov 2017 14:53:20 +0100 ihse 8191202: Remove duplicated jmm.h
Wed, 22 Nov 2017 14:43:37 +0300 rlupusoru 8190800: Support vectorization of Math.sqrt() on floats
Wed, 22 Nov 2017 01:12:23 -0800 iveresov 8191683: Compile problem on ARM after JDK-8043070
Wed, 06 Dec 2017 15:14:13 -0800 ksrini 8192933: Wrong generic type parameter in serialized form javadoc
Wed, 06 Dec 2017 14:39:15 -0800 bpb 8191706: Add Reader::transferTo(Writer)
Wed, 06 Dec 2017 11:43:50 -0800 ksrini 8191078: Wrong "Package not found" warning
Wed, 06 Dec 2017 19:17:07 +0000 chegar Merge
Wed, 06 Dec 2017 11:11:59 -0800 chegar 8191494: Refresh incubating HTTP Client
Wed, 06 Dec 2017 13:36:34 -0500 vromero 8192885: Compiler in JDK 10-ea+33 misses to include entry in LineNumberTable for goto instruction of foreach loopjdk-10+35
Fri, 03 Nov 2017 10:01:08 -0700 psandoz 8188870: Bump classfile version number to 54
Wed, 06 Dec 2017 14:33:33 +0000 coffeys 8185855: Debug exception stacks should be clearer
Wed, 06 Dec 2017 13:47:35 +0100 ihse 8193060: Set MAKE env variable in jib profile for gnumake
Wed, 06 Dec 2017 13:45:46 +0100 ihse 8193061: Add run-test-prebuilt functionality
Wed, 06 Dec 2017 02:09:08 -0800 sspitsyn 8182413: jdwp-protocol is generated without a DOCTYPE directive
Wed, 06 Dec 2017 08:36:09 +0000 alanb 8182742: ClassLoader.getResourceXXX throws NPE when ClassLoader created by defineModulesWithXXX
Wed, 06 Dec 2017 08:33:04 +0000 alanb 8186736: Spec clarifications for IllegalArgumentException throwing - ModuleLayer.defineX methods
Wed, 06 Dec 2017 08:28:46 +0000 alanb 8192973: Adding "Module Resolution" to javadoc search index
Wed, 06 Dec 2017 12:05:46 +0530 akolarkunnu 8192958: TEST.groups, group jdk_util_other:file not found: jdk/internal/uti
Wed, 06 Dec 2017 11:21:04 +0530 nishjain 8187551: MessageFormat.setFormat(int, Format) AIOOBE not thrown when documented
Wed, 06 Dec 2017 08:04:35 +0530 sundar 8185130: jlink should throw error if target image and current JDK versions don't match
Tue, 05 Dec 2017 18:33:05 -0800 mikael Initial musl support (ported from old repository layout)
Tue, 05 Dec 2017 15:31:50 -0800 psandoz 8015667: Stream.toArray(IntFunction) ArrayStoreException should refer to component type of array
Tue, 05 Dec 2017 23:14:35 +0100 erikj 8192771: Boot JDK jar tool used to construct the modular JAR for java.jnlp
Tue, 05 Dec 2017 23:11:27 +0100 erikj 8191439: Race in building jdk.rmic.interim
Tue, 05 Dec 2017 22:26:17 +0100 redestad 8193064: JarFile::getEntry0 method reference use cause for startup regression
Tue, 05 Dec 2017 09:44:32 -0800 bchristi 8187222: ClassLoader.getSystemClassLoader not clear if recursive initialization leads to ISE or unspecified error
Tue, 05 Dec 2017 14:25:16 +0100 redestad 8176188: jdk/internal/misc/JavaLangAccess/NewUnsafeString.java failing since 9-b93
Tue, 05 Dec 2017 14:10:11 +0100 ihse 8193055: ADD_JVM_ARG_IF_OK always fails
Tue, 21 Nov 2017 17:39:04 +0100 goetz 8191678: [TESTBUG] Add keyword headful in java/awt and javax tests.
Tue, 05 Dec 2017 17:19:48 +0800 weijun 8190674: sun/security/tools/jarsigner/TimestampCheck.java failed with java.nio.file.NoSuchFileException: ts2.cert
Mon, 04 Dec 2017 22:31:13 +0100 ihse 8193014: Add "special" tests to run-test to cover odd cases
Mon, 04 Dec 2017 10:04:51 -0800 ksrini 8184683: Add @since and default methods of Compiler Tree API methods
Mon, 04 Dec 2017 11:50:04 -0800 smarks 8177290: add copy factory methods for unmodifiable List, Set, Map
Mon, 04 Dec 2017 19:49:01 +0100 ihse 8192995: run-test gtest should use all jvm variants, not just "server"
Mon, 04 Dec 2017 19:12:57 +0100 ihse 8146977: Move the output "Building configuration X (matching Y)" to lower log level
Mon, 04 Dec 2017 19:10:15 +0100 ihse 8175795: configure should verify that system zlib contains needed functionality
Mon, 04 Dec 2017 19:08:56 +0100 ihse 8192854: FONTCONFIG_CFLAGS missing from spec.gmk.in
Mon, 04 Dec 2017 17:54:49 +0000 mcimadamore 8189749: Devise strategy for making source level checks more uniform
Mon, 04 Dec 2017 10:13:58 +0100 clanger 8192961: Remove some double semicolons
Mon, 04 Dec 2017 09:59:33 +0100 njian 8191955: AArch64: incorrect prefetch distance causes an internal error
Mon, 04 Dec 2017 13:24:00 +0530 vtewari 8190843: can not set/get extendedOptions to ServerSocket
Sun, 03 Dec 2017 01:47:23 -0800 igerasim 8187985: Broken certificate number in debug output
Sat, 02 Dec 2017 18:37:45 -0800 igerasim 8187497: Redundant variable assignment in Java_sun_security_jgss_wrapper_GSSLibStub_getMic
Sat, 02 Dec 2017 10:13:18 -0800 dl 8191069: Miscellaneous changes imported from jsr166 CVS 2017-12
Sat, 02 Dec 2017 10:08:55 -0800 dl 8187947: A race condition in SubmissionPublisher
Sat, 02 Dec 2017 10:03:41 -0800 dl 8191937: Lost interrupt in AbstractQueuedSynchronizer when tryAcquire methods throw
Fri, 01 Dec 2017 22:04:03 -0800 sherman 8191918: tomcat gzip-compressed response bodies appear to be broken in update 151
Fri, 01 Dec 2017 17:06:09 -0800 psandoz 8186961: Class.getFields() does not return fields of previously visited super interfaces/classes.
Fri, 01 Dec 2017 16:58:11 -0800 jjg 8034252: Fix non ASCII text file T6302184.java
Fri, 01 Dec 2017 21:52:54 +0100 ihse 8192816: Let run-test save exit code
Fri, 01 Dec 2017 10:02:25 -0800 joehw 8191938: Fix lint warnings in JAXP repo: a few Deprecation warrnings and enable -Xlint:all
Fri, 01 Dec 2017 09:46:36 -0800 erikj 8192876: MacOS build fails intermittently after JDK-8139653
Fri, 01 Dec 2017 17:00:34 +0100 redestad 8192892: Improve JrtPath::getResolved fast-path test
Fri, 01 Dec 2017 05:27:44 +0000 lana Merge
Fri, 01 Dec 2017 05:26:38 +0000 lana Added tag jdk-10+34 for changeset 89deac44e515
Thu, 30 Nov 2017 19:58:20 -0800 mchung 8192879: jdk.internal.util.jar.VersionedStream is no longer needed
Thu, 30 Nov 2017 17:28:21 -0800 erikj 8190464: OpenJDK on macosx needs to bundle freetype
Thu, 30 Nov 2017 14:49:36 -0800 smarks 8160406: Collection.toArray() spec should be explicit about returning precisely an Object[]
Thu, 30 Nov 2017 16:38:31 -0500 rriggs 8189331: java/io/Serializable/maskSyntheticModifier/MaskSyntheticModifierTest.java failed incorrect serialVersionUID
Thu, 30 Nov 2017 13:29:50 -0800 erikj 8139653: Freetype bundled on macosx, but not correctly linked
Thu, 30 Nov 2017 11:19:14 -0800 sherman 8187910: Charset MS950_HKSCS not supported in JDK 9
Thu, 30 Nov 2017 18:07:41 +0000 aefimov 8186441: Change of behavior in the getMessage () method of the SOAPMessageContextImpl class
Thu, 30 Nov 2017 06:14:25 -0800 ksrini 8185985: Html files in doc-files directories should be wrapped with standard header and footer
Thu, 30 Nov 2017 04:43:09 -0800 ksrini 8190552: Augment the Compiler API tree with APIs to represent HTML content
Thu, 30 Nov 2017 07:54:28 -0500 mullan 8186535: Remove deprecated pre-1.2 SecurityManager methods and fields
Thu, 30 Nov 2017 13:31:30 +0530 nishjain 6354947: [Fmt-*] Clarify DecimalFormat description of FieldPosition usejdk-10+34
Fri, 24 Nov 2017 14:07:59 +0100 dholmes 8191707: Options with invalid values are incorrectly treated as obsolete and ignored
Wed, 22 Nov 2017 09:27:06 -0800 dlong 8191688: Assert failed in > 200 tests: failed dependencies, but counter didn't change
Wed, 22 Nov 2017 16:08:39 -0800 ccheung 8191653: Test failures in BootAppendTests - missing jdk.internal.vm.compiler module
Sun, 26 Nov 2017 09:05:13 -0800 rraghavan 8191313: compiler/runtime/SpreadNullArg.java fails in tier1
Sat, 25 Nov 2017 04:36:43 +0100 jwilhelm Merge
Tue, 21 Nov 2017 21:33:53 -0500 coleenp Merge
Tue, 21 Nov 2017 15:24:38 +0100 glaubitz 8191663: Zero variant broken after 8189170 and 8189871
Tue, 21 Nov 2017 15:45:33 -0800 ccheung 8191739: [TESTBUG] test/hotspot/jtreg/runtime/LoadClass/TestResize.java fails to compile after JDK-8191580
Tue, 21 Nov 2017 16:27:01 -0500 ecaspole 8191615: LogCompilation can show bytes
Tue, 21 Nov 2017 09:49:52 -0800 ccheung 8188122: Path length limits on Windows leads to obscure class loading failures
Tue, 21 Nov 2017 09:20:56 -0800 iklam 8191042: Deprecate VM option CheckEndorsedAndExtDirs
Tue, 21 Nov 2017 09:04:42 -0800 dlong 8190817: deopt special-case for _return_register_finalizer is confusing and leads to bugs
Tue, 21 Nov 2017 10:21:24 -0600 gziemski 8191580: open/test/hotspot/jtreg/runtime/LoadClass/TestResize fails on product build
Tue, 21 Nov 2017 12:48:17 +0100 rkennke 8191562: Missing include in gcArguments.cpp breaks minimal JVM build
Tue, 21 Nov 2017 15:02:17 +0100 ihse 8191203: Remove duplicated jimage.hpp
Tue, 21 Nov 2017 08:33:54 +0100 ehelin 8182284: G1Analytics uses uninitialized fields
Tue, 21 Nov 2017 09:44:50 +0100 ihse 8190418: Stop generating jvmtiEnvStub and jvmtiEnvRecommended
Tue, 21 Nov 2017 11:27:46 +0530 sballal 8191401: [TESTBUG] serviceability/sa/ClhsdbFlags.java can fail due to UseJVMCICompiler
Mon, 20 Nov 2017 19:00:22 -0800 iveresov 8043070: nmethod::verify_interrupt_point() shouldn't enter safepoint
Mon, 20 Nov 2017 17:10:02 -0500 dholmes Merge
Mon, 20 Nov 2017 15:56:32 -0500 dholmes 8189170: Add option to disable stack overflow checking in primordial thread for use with JNI_CreateJavaJVM
Mon, 20 Nov 2017 14:02:10 -0800 epavlova 8190975: [Graal] Tests which run with "--limit-modules java.base" could fail when Graal is used as JIT
Mon, 20 Nov 2017 09:46:55 +0000 smonteith 8191338: aarch64: fails to build after 8189745
Mon, 20 Nov 2017 09:50:27 +0100 neliasso 8160548: Inconsistent inlining behavior with CompileOnly
Wed, 11 Oct 2017 11:24:59 +0200 neliasso 8169766: c1 + Xcomp reresolving call target every invocation
Wed, 11 Oct 2017 11:22:21 +0200 neliasso 8160303: parse_method_pattern only scans 254 chars
Mon, 20 Nov 2017 09:50:23 +0100 neliasso 8065838: compiler/relocations/TestPrintRelocations.java times out after 1920 seconds
Mon, 20 Nov 2017 13:07:44 +0100 eosterlund 8189871: Refactor GC barriers to use declarative semantics
Mon, 20 Nov 2017 12:04:13 +0100 tschatzl Merge
Mon, 20 Nov 2017 10:15:34 +0100 tschatzl 8186480: Remove warning when AssumeMP is true and ergonomics determines to use one worker thread
Mon, 20 Nov 2017 10:10:58 +0100 rehn 8191373: Multiple NUMA nodes expected
Mon, 20 Nov 2017 09:40:42 +0100 rehn 8191329: Deprecate DeferPollingPageLoopCount
Mon, 20 Nov 2017 09:35:31 +0100 rehn 8191327: Deprecate DeferThrSuspendLoopCount
Mon, 20 Nov 2017 09:33:16 +0100 rehn 8191326: Deprecate SafepointSpinBeforeYield
Sun, 19 Nov 2017 23:30:41 -0500 jiangli 8187118: Remove appending -cp path to the boot class path at AppCDS dump time
Wed, 29 Nov 2017 21:01:55 -0800 sherman 8192781: tools/jar/multiRelease/Basic.java test Basic.test09(): failure after change d34958
Wed, 29 Nov 2017 20:42:18 -0800 mchung 8191942: Replace jdeps use of jdk.internal.util.jar.VersionedStream with new public API
Wed, 29 Nov 2017 15:27:47 -0800 ksrini 8182108: javadoc makes up type variables for grandparent types
Wed, 29 Nov 2017 15:01:16 -0800 sherman 8189611: JarFile versioned stream and real name support
Wed, 29 Nov 2017 22:23:21 +0100 ihse 8191933: Use failure handler in run-test
Wed, 29 Nov 2017 12:39:59 -0800 psandoz 8187237: Need to define the behaviour for 0 and 1 argument method type in StringConcatFactory.makeConcat
Wed, 29 Nov 2017 21:23:57 +0100 ihse 8192067: Add fixpath to test image
Wed, 29 Nov 2017 10:35:50 -0800 psandoz 8181175: Stream.concat behaves like terminal operation
Wed, 29 Nov 2017 09:47:02 -0800 prr Merge
Wed, 29 Nov 2017 09:07:01 -0800 prr Merge
Tue, 28 Nov 2017 15:01:00 -0800 serb 8043334: Typo in javax/swing/JComponent.html
Tue, 28 Nov 2017 17:30:43 +0530 mhalder 8158366: [macosx] Regression: closed/java/awt/dnd/RecognizedActionTest/RecognizedActionTest.html fails
Tue, 28 Nov 2017 16:27:23 +0530 pbansal 8190861: [TESTBUG] javax/swing/JWindow/ShapedAndTranslucentWindows/PerPixelTranslucentSwing.java is wrong
Mon, 27 Nov 2017 15:28:29 -0800 ssadetsky 8187367: Numerous swing display problems with scaled displays on Windows
Mon, 27 Nov 2017 10:35:05 -0800 prr Merge
Fri, 24 Nov 2017 16:55:18 -0800 rfield 8190939: JShell: gives a compiler error evaluating an expression of inaccessible type
Fri, 24 Nov 2017 13:18:36 +0530 ssreedharan 8176072: READING attributes are not available on TSF
Thu, 23 Nov 2017 23:05:52 -0800 serb 8191384: WaveFloatFileReader never closes the data stream
Thu, 23 Nov 2017 10:44:29 +0530 jdv 8191431: Reading multiple PNG images with unique IDAT chunk positions will cause IIOException
Wed, 22 Nov 2017 14:04:51 -0800 ssadetsky 8190228: Remove redundant modifiers in java.desktop module.
Wed, 22 Nov 2017 13:52:48 -0800 ssadetsky 8189204: Possible NPE in Component::getLocationOnScreen()
Wed, 22 Nov 2017 15:48:15 +0530 psadhukhan 8191428: Regression: Swing button label wrapping with hidpi
Wed, 22 Nov 2017 12:05:06 +0530 pbansal 8190348: [TESTBUG] Test javax/swing/JWindow/ShapedAndTranslucentWindows/PerPixelTranslucentCanvas.java fails
Wed, 22 Nov 2017 11:52:59 +0530 pbansal 8159142: [hidpi] Visible artifacts in sun/java2d/SunGraphics2D/DrawImageBilinear.java
Tue, 21 Nov 2017 13:39:25 -0800 rfield 8191631: Problem list jdk/jshell/StartOptionTest.java, jdk/jshell/ToolProviderTest.java and jdk/jshell/ExternalEditorTest.java temporarily
Mon, 20 Nov 2017 15:05:10 -0800 shurailine 8191616: [TEST_BUG] : sanity/client/SwingSet/src/SliderDemoTest.java: Failed with TimeoutExpiredException: Wait "Wait till Slider attains the specified state."