log

age author description
Mon, 15 Aug 2016 20:08:55 +0300 serb 8163949: Cleanup of classes which are related to JavaSound
Mon, 15 Aug 2016 08:15:02 -0700 ddehaven Merge
Fri, 12 Aug 2016 14:35:56 -0700 bpb 8152966: ClassCastException when adding IFD to the TIFFDirectory before the image write
Fri, 12 Aug 2016 20:36:41 +0300 serb 8159696: java.beans.MethodRef#get throws NullPointerException
Fri, 12 Aug 2016 18:43:13 +0300 mcherkas 8160696: IllegalArgumentException: adding a component to a container on a different GraphicsDevice
Thu, 11 Aug 2016 21:48:53 -0500 ptbrunet 8161483: Implement AccessibleAction interface in JList.AccessibleJList.AccessibleJListChild
Thu, 11 Aug 2016 11:35:47 -0700 bpb 8145014: "IIOException: Couldn't seek!" when calling TIFFImageReader.getNumImages()
Thu, 11 Aug 2016 10:37:50 -0700 prr Merge
Wed, 10 Aug 2016 02:50:58 +0300 azvegint 8155690: Update libPNG library to the latest up-to-date
Tue, 09 Aug 2016 16:20:02 -0700 prr 8163238: Upgrade to harfbuzz 1.3.0 in JDK 9
Tue, 09 Aug 2016 12:08:51 +0300 alexsch 8160986: Bad rendering of Swing UI controls with Metal L&F on HiDPI display
Tue, 09 Aug 2016 13:55:27 +0530 jdv 8160455: KSS : class.forName issue in TIFFImageMetadata.java
Tue, 09 Aug 2016 13:45:17 +0530 jdv 8160456: KSS : resource loading issue in TIFFMetadataFormat.java
Tue, 09 Aug 2016 13:22:58 +0530 psadhukhan 5080098: Page Range must be disabled on the common print dlg for Non serv-formatted flvrs
Tue, 09 Aug 2016 10:17:51 +0300 alexsch 8162856: JSlider thumb is twice smaller on HiDPI display
Mon, 08 Aug 2016 11:09:19 -0700 bpb 8150154: AIOOB Exception during sequential write of TIFF images
Mon, 08 Aug 2016 11:40:39 +0400 rstevens 8161664: Memory leak in com.apple.laf.AquaProgressBarUI removed progress bar still referenced
Fri, 05 Aug 2016 12:03:58 -0700 prr Merge
Fri, 05 Aug 2016 16:20:02 +0300 serb 8162970: Merge error in the DefaultRowSorter.java
Fri, 05 Aug 2016 15:48:37 +0530 arapte 8039081: [TEST_BUG] Test java/awt/TrayIcon/PopupMenuLeakTest/PopupMenuLeakTest.java fails
Wed, 03 Aug 2016 15:18:58 +0800 prr 8159713: Make the non-translated keywords clear to translator in jar.properties
Thu, 04 Aug 2016 15:58:28 +0200 clanger 8163177: Fix for 8152971 breaks builds with VS2010
Wed, 03 Aug 2016 17:01:51 -0700 bpb 8155960: TIFF javadoc contains HTML entities inside {@code} tags
Wed, 03 Aug 2016 22:53:38 +0200 lbourges 8159638: Improve array caches and renderer stats in Marlin renderer
Fri, 19 Aug 2016 18:06:46 +0100 chegar 8156841: sun.security.pkcs11.SunPKCS11 poller thread retains a strong reference to the context class loader
Fri, 19 Aug 2016 13:50:03 +0200 redestad 8164451: Generate all zero and identity forms at link time
Fri, 19 Aug 2016 10:03:43 +0200 mhaupt 8164102: MethodHandles.countedLoop/4 works incorrect for start/end = Integer.MAX_VALUE
Fri, 19 Aug 2016 16:29:41 +0900 ysuenaga 8164326: jrtfsviewer.js and jrtls.js does not work
Fri, 19 Aug 2016 06:27:54 +0000 valeriep 8130181: Deprecate java.security.Provider(String, double, String), add Provider(Strin
Thu, 18 Aug 2016 17:30:49 -0700 tvaleev 8164189: Collectors.toSet() parallel performance improvement
Fri, 19 Aug 2016 01:41:54 +0300 igerasim 8153438: Avoid repeated "Please insert a smart card" popup windows
Thu, 18 Aug 2016 17:51:40 -0400 lancea 8164394: Minor correction in Java API doc for DataSource
Thu, 18 Aug 2016 21:34:03 +0000 lana Merge
Thu, 18 Aug 2016 12:48:23 -0700 jnimeh 8162808: Add references to the standard JSSE cipher suite names in javadoc
Thu, 18 Aug 2016 22:07:09 +0300 igerasim 8163517: Various cleanup in java.io code
Thu, 18 Aug 2016 15:05:02 -0400 lancea 8138661: Minor correction in Java API doc for DataSource
Thu, 18 Aug 2016 19:00:39 +0200 redestad 8164044: Generate corresponding simple DelegatingMethodHandles when generating a DirectMethodHandle at link time
Thu, 18 Aug 2016 09:52:43 -0700 amurillo 8164329: Problem list sun/rmi/runtime/Log/6409194/NoConsoleOutput.java on windows due to JDK-8164124
Thu, 18 Aug 2016 16:27:15 +0300 snikandrova 8146602: jdk/test/sun/misc/URLClassPath/ClassnameCharTest.java test fails with NullPointerException
Thu, 18 Aug 2016 12:39:23 -0400 lancea 8161965: Create initial javadoc description for modules
Wed, 17 Aug 2016 16:03:52 -0700 ascarpino 8156192: Provider#compute and #merge methods expect wrong permission & #compute ClassCastException even with wrong permission.
Wed, 17 Aug 2016 21:14:39 +0100 vinnie 6977937: The SunJCE PBKDF2KeyImpl is requiring the MAC instance also be from SunJCE.
Wed, 17 Aug 2016 14:41:17 -0400 mullan Merge
Wed, 17 Aug 2016 14:40:12 -0400 mullan 8164071: Default.policy file missing content for solaris
Wed, 17 Aug 2016 08:44:38 -0700 amurillo Merge
Tue, 16 Aug 2016 08:18:27 -0700 amurillo Merge
Fri, 12 Aug 2016 13:58:18 -0700 amurillo Merge
Mon, 08 Aug 2016 21:59:33 +0900 ysuenaga 8163272: jhsdb jinfo cannot show system properties
Fri, 05 Aug 2016 09:58:09 -0700 amurillo Merge
Thu, 04 Aug 2016 16:11:30 -0700 cjplummer 8162670: make of jtreg_tests fails if no tests are run, causing jprt test runs to also fail
Wed, 17 Aug 2016 10:08:18 +0800 weijun 8087144: sun/security/krb5/auto/MaxRetries.java fails with Retry count is -1 less
Tue, 16 Aug 2016 21:28:10 +0800 weijun 8141411: keytool can wrongly parse the start date value given by the -startdate option
Tue, 16 Aug 2016 12:34:00 +0530 ssahoo 8159964: Update Tests to verify JDK build for "JDK-8159488 Deprivilege java.xml.crypto"
Tue, 16 Aug 2016 15:26:41 +0900 nishjain 8129555: DateFormatSymbols: month-related methods must refer to Calendar constants
Mon, 15 Aug 2016 16:32:41 -0700 asmotrak 8162484: javax/net/ssl/Stapling/SSLSocketWithStapling.java test fails intermittently with "Address already in use" error
Mon, 15 Aug 2016 23:45:32 +0300 igerasim 8163896: Finalizing one key of a KeyPair invalidates the other key
Thu, 18 Aug 2016 21:01:22 +0000 lana Added tag jdk-9+132 for changeset 5542e4584972
Wed, 05 Jul 2017 22:06:09 +0200 duke Merge
Fri, 19 Aug 2016 11:22:14 -0700 amurillo Merge
Tue, 16 Aug 2016 09:56:18 -0400 hseigel 8030221: Checking for anonymous class should check for NULL as well as potential nesting
Mon, 15 Aug 2016 13:14:08 -0700 cjplummer 8133740: NMT for Linux/x86/x64 and bsd/x64 slowdebug builds includes NativeCallStack::NativeCallStack() frame in backtrace
Mon, 15 Aug 2016 13:13:48 -0700 cjplummer 8133747: NMT includes an extra stack frame due to assumption NMT is making on tail calls being used
Mon, 15 Aug 2016 13:06:50 -0700 cjplummer 8133749: os::current_frame() is not returning the proper frame on ARM and solaris-x64
Mon, 15 Aug 2016 16:15:16 +0200 erikj 8069540: Remove universal binaries support from hotspot build
Tue, 09 Aug 2016 21:57:29 +0900 ysuenaga 8163185: jhsdb jstack cannot work with normal mode
Fri, 12 Aug 2016 14:12:55 -0700 amurillo Merge
Fri, 12 Aug 2016 08:46:17 -0700 fparain 8146697: VM crashes in test Test7005594
Fri, 12 Aug 2016 00:19:44 -0400 dholmes 8159461: bigapps/Kitchensink/stressExitCode hits assert: Must be VMThread or JavaThread
Thu, 11 Aug 2016 16:22:08 -0700 iveresov Merge
Tue, 09 Aug 2016 16:47:47 +0300 dpochepk 8160299: Test8015436 doesn't check which method was executed
Tue, 09 Aug 2016 14:17:28 +0300 dpochepk 8163366: compiler/codecache/jmx/ThresholdNotificationsTest.java doesn't set -XX:+UnlockDiagnosticVMOptions while using WB
Tue, 09 Aug 2016 14:16:44 +0300 dpochepk 8160083: compiler.codecache.jmx.InitialAndMaxUsageTest can not be used w/ disabled SegmentedCodeCache
Mon, 08 Aug 2016 17:06:21 +0200 dnsimon 8163105: SIGSEGV: constantPoolHandle::constantPoolHandle(ConstantPool*)
Mon, 08 Aug 2016 11:30:46 +0300 dpochepk 8163243: [TESTBUG] compiler/codecache/jmx/UsageThresholdIncreasedTest.java failed with: Failed to find sun/hotspot/WhiteBox.class
Sat, 06 Aug 2016 11:52:37 -0700 iveresov 8163313: assert(comp != __null) failed: compiler not available
Fri, 05 Aug 2016 13:37:53 -0700 iveresov Merge
Fri, 05 Aug 2016 16:23:44 +0300 dpochepk 8157498: compiler/codecache/jmx/InitialAndMaxUsageTest.java times out on 32-bit platforms
Fri, 05 Aug 2016 16:22:30 +0300 dpochepk 8161279: Various JMX-tests timed out
Thu, 04 Aug 2016 22:42:05 -0400 mdoerr 8162369: PPC64: Wrong ucontext used after SIGTRAP while in HTM critical section
Thu, 04 Aug 2016 10:34:34 +0200 thartmann 8136818: Test compiler/arraycopy/TestEliminatedArrayCopyDeopt.java fails with "m1 failed"
Thu, 04 Aug 2016 08:58:22 +0200 thartmann 8162881: Effect of -XX:CICompilerCount depends on ordering of other flags
Wed, 03 Aug 2016 15:52:38 +0000 never Merge
Tue, 02 Aug 2016 17:12:16 -0700 never 8162477: [JVMCI] assert(wf.check_method_context(ctxk, m)) failed: proper context
Tue, 02 Aug 2016 19:46:29 -0700 kvn 8163018: Slow compiler tests in JPRT
Thu, 11 Aug 2016 21:35:09 +0200 dcubed Merge
Thu, 11 Aug 2016 16:13:05 +0000 lfoltan Merge
Thu, 11 Aug 2016 11:41:11 -0400 lfoltan 8162553: Crash in class unloading due to null CLD having a zero _keep_alive value
Thu, 11 Aug 2016 17:47:25 +0300 dsamersoff 8163143: illegal bci error with interpreted frames in SA due to mirror being stored in interpreted frames
Wed, 10 Aug 2016 21:02:14 -0400 ysuenaga 8163580: Cannot get Monitor Cache Dump in HSDB
Wed, 10 Aug 2016 09:24:42 +0200 rehn 8161026: GPL header missing comma in year
Thu, 18 Aug 2016 21:33:36 +0000 lana Merge
Tue, 16 Aug 2016 08:08:00 -0700 amurillo Merge
Thu, 11 Aug 2016 12:27:20 -0700 dcubed 8163879: quarantine serviceability/sa/sadebugd/SADebugDTest.java since it hangs intermittently
Fri, 12 Aug 2016 13:58:14 -0700 amurillo Merge
Mon, 08 Aug 2016 15:53:02 +0000 dsamersoff Merge
Mon, 08 Aug 2016 21:59:12 +0900 ysuenaga 8163272: jhsdb jinfo cannot show system properties
Mon, 08 Aug 2016 17:15:46 +0300 dsamersoff 8163269: Testcase missed in push for JDK-8160817
Fri, 05 Aug 2016 09:58:09 -0700 amurillo Merge
Thu, 04 Aug 2016 16:11:49 -0700 cjplummer 8162670: make of jtreg_tests fails if no tests are run, causing jprt test runs to also fail
Thu, 04 Aug 2016 23:17:33 +0200 mockner Merge
Thu, 04 Aug 2016 12:55:28 -0400 mockner 8145543: JPRT jobs see intermittent failures in compiler/floatingpoint/ModNaN.java
Thu, 04 Aug 2016 19:50:23 +0000 coleenp Merge
Thu, 04 Aug 2016 10:11:35 -0700 gthornbr 8162999: Build give extraneous find warnings
Thu, 04 Aug 2016 20:28:12 +0200 mockner Merge
Thu, 04 Aug 2016 18:34:40 +0200 mockner Merge
Thu, 04 Aug 2016 12:24:10 -0400 mockner 8159917: Space character is missing in ClassLoaderData::print_value_on
Thu, 04 Aug 2016 14:04:14 +0300 lmesnik 8162852: Mark stress compiler and gc tests with stress keyword
Wed, 03 Aug 2016 15:55:40 -0700 iveresov Merge
Tue, 02 Aug 2016 11:06:25 -0700 dlong 8029441: assert(!((nmethod*)_cb)->is_deopt_pc(_pc)) failed: invariant broken
Mon, 01 Aug 2016 22:34:23 -0700 kvn Merge
Sat, 30 Jul 2016 04:05:28 -0700 roland 8161652: Crash with assert(ft == _type) failed in PhiNode::Value()
Wed, 03 Aug 2016 13:56:27 -0700 cjplummer 8161030: GPL header missing comma after year
Wed, 03 Aug 2016 09:40:21 -0400 coleenp 8159284: bigapps/Jetty - assert(jfa->last_Java_sp() > sp()) failed with JFR in use
Tue, 02 Aug 2016 20:55:27 -0700 dcubed Merge
Tue, 02 Aug 2016 13:48:07 -0700 gthornbr 8161696: [TESTBUG] runtime/StackGuardPages/testme.sh uses invalid argument -Xss328k
Wed, 03 Aug 2016 02:10:23 +0000 jprovino Merge
Tue, 02 Aug 2016 16:39:33 -0400 jprovino 8071770: G1 does not implement millis_since_last_gc which is needed by RMI GC
Thu, 18 Aug 2016 21:01:21 +0000 lana Added tag jdk-9+132 for changeset a11ec8919fef
Mon, 22 Aug 2016 08:27:08 -0700 amurillo Merge
Fri, 19 Aug 2016 11:22:13 -0700 amurillo Merge
Mon, 15 Aug 2016 16:14:59 +0200 erikj 8069540: Remove universal binaries support from hotspot build
Fri, 19 Aug 2016 07:54:03 -0700 tbell 8164402: key word 'requires' appearing in comment causing a build failure
Thu, 18 Aug 2016 21:01:21 +0000 lana Added tag jdk-9+132 for changeset cbba9772b2be
Wed, 05 Jul 2017 22:05:30 +0200 duke Added tag jdk-9+132 for changeset 2e83d21d78cd
Wed, 05 Jul 2017 22:05:29 +0200 duke Mergejdk-9+132
Wed, 05 Jul 2017 22:05:22 +0200 duke Merge
Mon, 15 Aug 2016 08:28:26 +0200 jlahoda 8129421: JShell: unacceptable suggestions in 'extends', 'implements' in smart completion
Sat, 13 Aug 2016 09:42:26 -0700 vromero 8067485: ct.properties has no copyright notice
Fri, 12 Aug 2016 17:45:31 -0700 jjg 8052398: Uniqify test framework class names
Fri, 12 Aug 2016 16:03:36 -0700 jjg 8160137: HTMLDoclet and AbstractDoclet should implement Doclet
Fri, 12 Aug 2016 15:41:47 -0700 jjg 8163524: doclet resources doclet.usage.NAME.name are redundant
Fri, 12 Aug 2016 11:49:18 +0530 sadayapalam 8068626: Add javac lint warning when the @Deprecated annotation is used where it is a no-op
Thu, 11 Aug 2016 17:02:00 +0000 lana Merge
Thu, 11 Aug 2016 17:26:12 +0200 jlahoda 8133884: javac moduleName/className and moduleName/packageName options
Wed, 10 Aug 2016 16:19:09 -0700 ksrini 8152054: fix @ignored langtools/test/jdk/javadoc/tool/ tests
Wed, 10 Aug 2016 15:54:25 -0700 mchung Merge
Wed, 10 Aug 2016 15:47:46 -0700 jjg 8136930: Simplify use of module-system options by custom launchers
Wed, 10 Aug 2016 15:52:26 -0700 rfield 8163817: JShell tests: disable minor failing editor tool cases: 8161276, 8163816, 8159229
Wed, 10 Aug 2016 13:52:02 -0700 vromero 8160156: javac is generating let expressions unnecessarily
Wed, 10 Aug 2016 10:47:43 -0700 rfield 8163500: JShell: ProblemList.txt update: 8139872 and 8080843 fixed
Tue, 09 Aug 2016 23:00:49 -0700 rfield 8143964: JShell API: convert query responses to Stream instead of List
Tue, 09 Aug 2016 13:22:57 -0700 jjg 8160697: HTMLWriter needs perf cleanup
Tue, 09 Aug 2016 20:27:06 +0200 jlahoda 8143048: Re-examine dependency on property sun.boot.class.path
Tue, 09 Aug 2016 07:31:16 -0700 ksrini 8075529: Documentation in DocumentationTool.getTask(...) should mention about "null" parameter for doclet.
Thu, 11 Aug 2016 15:47:10 +0000 lana Added tag jdk-9+131 for changeset 48d9e26a8fa4
Wed, 05 Jul 2017 22:05:10 +0200 duke Merge
Thu, 11 Aug 2016 17:02:08 +0000 lana Merge
Wed, 10 Aug 2016 15:49:27 -0700 mchung 8136930: Simplify use of module-system options by custom launchers
Thu, 11 Aug 2016 15:47:08 +0000 lana Added tag jdk-9+131 for changeset 11487423d488
Wed, 05 Jul 2017 22:05:03 +0200 duke Merge
Thu, 11 Aug 2016 13:34:30 -0700 joehw 8163535: javax/xml/jaxp/unittest/catalog/CatalogSupport2.java failed due to SocketTimeoutException
Thu, 11 Aug 2016 17:02:17 +0000 lana Merge
Thu, 11 Aug 2016 10:20:44 +0800 fyuan 8163468: javax/xml/jaxp/unittest/validation/Bug6773084Test.java fails intermittently
Wed, 10 Aug 2016 15:49:23 -0700 mchung 8136930: Simplify use of module-system options by custom launchers
Thu, 04 Aug 2016 13:58:06 +0800 lana 8163145: Remove two null line in the end of message.properties
Thu, 11 Aug 2016 15:47:08 +0000 lana Added tag jdk-9+131 for changeset 64662417aa2d
Wed, 05 Jul 2017 22:04:55 +0200 duke Merge
Thu, 11 Aug 2016 17:02:59 +0000 lana Merge
Wed, 10 Aug 2016 15:49:16 -0700 mchung 8136930: Simplify use of module-system options by custom launchers
Wed, 10 Aug 2016 09:21:58 -0700 sdama 8134304: NPE in initialization of OptimisticTypesPersistence
Thu, 11 Aug 2016 15:47:10 +0000 lana Added tag jdk-9+131 for changeset b381e616c242
Wed, 05 Jul 2017 22:04:45 +0200 duke Merge
Thu, 11 Aug 2016 15:47:07 +0000 lana Added tag jdk-9+131 for changeset e0d360ea22db
Wed, 05 Jul 2017 22:04:38 +0200 duke Merge
Mon, 15 Aug 2016 09:16:31 -0700 dl 8162627: Miscellaneous changes imported from jsr166 CVS 2016-08
Mon, 15 Aug 2016 09:13:22 -0700 dl 8151158: [TESTBUG] java/util/concurrent/forkjoin/FJExceptionTableLeak.java fails due to out of memory
Mon, 15 Aug 2016 09:09:00 -0700 dl 8163210: java/util/concurrent/tck/JSR166TestCase.java testWriteAfterReadLock(StampedLockTest): timed out waiting for thread to terminate
Mon, 15 Aug 2016 09:04:40 -0700 dl 8162805: Optimize AtomicBoolean.getAndSet
Mon, 15 Aug 2016 14:25:51 +0100 vinnie 8163503: PKCS12 keystore cannot store non-X.509 certificates
Sat, 13 Aug 2016 02:21:30 +0000 xuelei 8162362: Introduce system property to control enabled ciphersuites
Fri, 12 Aug 2016 20:14:25 +0300 snikandrova 8145732: Duplicate entry in http.nonProxyHosts will ignore subsequent entries
Fri, 12 Aug 2016 17:35:01 +0200 redestad 8163946: java/lang/String/concat/WithSecurityManager.java fails after 8163878
Fri, 12 Aug 2016 11:30:23 +0200 redestad 8163878: Remove unnecessary bridge methods, allocations in java.lang.invoke
Fri, 12 Aug 2016 14:38:02 +0800 fyuan 8163435: Update issue number for SupportedDHKeys.java and UnsupportedDHKeys.java in ProblemList
Fri, 12 Aug 2016 14:36:14 +0800 fyuan 8161340: ProblemList.txt update for sun/security/tools/keytool/autotest.sh
Fri, 12 Aug 2016 14:34:45 +0800 fyuan 8160611: Clean up ProblemList.txt for closed/resolved issues
Fri, 12 Aug 2016 00:47:06 +0000 valeriep 8154113: java.security.AccessControlException: access denied ("java.security.SecurityPermission" "authProvider.SunMSCAPI")
Fri, 12 Aug 2016 00:39:34 +0000 valeriep 8157579: com/sun/crypto/provider/Mac/MacClone.java failed on solaris12(sparcv9 and x86)
Fri, 12 Aug 2016 00:10:07 +0000 valeriep 6469513: (smartcardio) CardPermission(String termName, String actions) violates specification
Thu, 11 Aug 2016 23:41:48 +0300 igerasim 8163877: Tests added in JDK-8163518 fail on some platforms
Thu, 11 Aug 2016 17:02:46 +0000 lana Merge
Thu, 11 Aug 2016 17:03:40 +0300 igerasim 8163518: Integer overflow in StringBufferInputStream.read() and CharArrayReader.read/skip()
Thu, 11 Aug 2016 13:10:54 +0800 weijun 8133910: Some sun/security/tools tests failed.
Wed, 10 Aug 2016 15:51:25 -0700 mchung 8136930: Simplify use of module-system options by custom launchers
Wed, 10 Aug 2016 22:48:25 +0100 prappo 8163586: java.net.http.RawChannel has been made public by mistake
Wed, 10 Aug 2016 22:49:05 +0200 redestad 8163814: JDK build has been failing after 8163373
Wed, 10 Aug 2016 21:55:25 +0200 redestad 8163373: Rewrite GenerateJLIClassesPlugin to avoid reflective calls into java.lang.invoke
Wed, 10 Aug 2016 17:55:08 +0200 simonis 8163408: Fix wrong prototype of getNativeScaleFactor() in systemScale.h
Wed, 10 Aug 2016 13:54:38 +0200 redestad 8163370: Reduce number of classes loaded by common usage of java.lang.invoke
Wed, 10 Aug 2016 11:54:12 +0100 coffeys 8163104: Unexpected NPE still possible on some Kerberos ticket calls
Tue, 09 Aug 2016 22:31:41 -0700 jnimeh 8132943: ServerHandshaker may select non-empty OCSPStatusRequest structures when Responder ID
Wed, 10 Aug 2016 11:30:53 +0800 weijun 8162739: Create new keytool option to access cacerts file
Wed, 10 Aug 2016 11:21:01 +0800 weijun 8163489: Avoid using Utils.getFreePort() in TsacertOptionTest.java test
Fri, 29 Jul 2016 09:58:28 -0700 sdrach 8158295: Add a multi-release jar validation mechanism to jar tool
Tue, 09 Aug 2016 07:50:26 -0700 bpb 8163305: Add some print instrumentation to java/nio/channels/Selector/RacyDeregister
Tue, 09 Aug 2016 07:43:48 -0700 bpb 8163431: probeContentType/Basic.java fails after changes for JDK-8146215
Thu, 11 Aug 2016 15:47:09 +0000 lana Added tag jdk-9+131 for changeset 6863c0579ecf
Wed, 05 Jul 2017 22:04:25 +0200 duke Merge
Fri, 12 Aug 2016 08:59:20 -0700 mhaupt 8163533: jdk.vm.ci.hotspot.test.MethodHandleAccessProviderTest fails on jdk9/dev
Thu, 11 Aug 2016 17:02:27 +0000 lana Merge
Wed, 10 Aug 2016 15:48:04 -0700 hseigel 8136930: Simplify use of module-system options by custom launchers
Thu, 11 Aug 2016 15:47:07 +0000 lana Added tag jdk-9+131 for changeset 2bf4f6d6a72f
Thu, 11 Aug 2016 17:01:55 +0000 lana Merge
Wed, 10 Aug 2016 15:49:03 -0700 mchung 8136930: Simplify use of module-system options by custom launchers
Thu, 11 Aug 2016 15:47:07 +0000 lana Added tag jdk-9+131 for changeset 1ca743d80734
Wed, 05 Jul 2017 22:04:05 +0200 duke Added tag jdk-9+131 for changeset 4d2a15091124
Wed, 05 Jul 2017 22:04:04 +0200 duke Mergejdk-9+131
Wed, 05 Jul 2017 22:03:58 +0200 duke Merge
Mon, 08 Aug 2016 11:48:02 -0700 vromero 8162874: AST nodes representing operators should have a common superclass
Mon, 08 Aug 2016 17:22:44 +0200 jlahoda 8144733: Iterating over elements of a Scope can return spurious inner class elements
Thu, 04 Aug 2016 17:48:48 +0000 amurillo Merge
Thu, 04 Aug 2016 10:07:48 +0200 erikj 8157100: missing dependency in build system
Wed, 03 Aug 2016 16:01:09 -0700 jjg 8162359: javac should use stdout for --help and --version
Wed, 03 Aug 2016 11:30:27 -0700 darcy 8163113: langtools repeating annotations tests depend rely on annotations toString output
Wed, 03 Aug 2016 10:05:37 -0700 darcy 8163115: Temporarily problem list javac repeating annotations tests
Tue, 02 Aug 2016 13:14:12 -0700 bpatel 8154817: Fix the click-through navigation for modules
Thu, 04 Aug 2016 17:32:55 +0000 amurillo Added tag jdk-9+130 for changeset 4923274643f2
Wed, 05 Jul 2017 22:03:48 +0200 duke Merge
Mon, 08 Aug 2016 10:15:29 -0400 rriggs 8163266: Doc for ValidationEvent#getSeverity() should say it returns a constant from ValidationEvent instead of ValidationError
Thu, 04 Aug 2016 17:32:53 +0000 amurillo Added tag jdk-9+130 for changeset 86902ef5ff79
Wed, 05 Jul 2017 22:03:41 +0200 duke Merge
Mon, 08 Aug 2016 12:50:00 +0800 fyuan 8067170: Enable security manager on JAXP unit tests and make some improvement
Thu, 04 Aug 2016 17:47:31 -0700 joehw 8160069: RuntimeException thrown by XPathFactory::newInstance missing the cause
Thu, 04 Aug 2016 17:32:53 +0000 amurillo Added tag jdk-9+130 for changeset 00e4298ae168
Wed, 05 Jul 2017 22:03:31 +0200 duke Merge
Mon, 08 Aug 2016 12:51:44 +0200 hannesw 8162955: Activate anonymous class loading for small sources
Thu, 04 Aug 2016 17:49:29 +0000 amurillo Merge
Tue, 02 Aug 2016 12:39:25 +0200 hannesw 8162771: Strict equality operators should not be optimistic
Thu, 04 Aug 2016 17:32:55 +0000 amurillo Added tag jdk-9+130 for changeset bb2621620e5f
Wed, 05 Jul 2017 22:03:22 +0200 duke Merge
Thu, 04 Aug 2016 17:32:52 +0000 amurillo Added tag jdk-9+130 for changeset 78f922bcd6cf
Wed, 05 Jul 2017 22:03:13 +0200 duke Merge
Tue, 09 Aug 2016 15:02:27 +0200 redestad 8163476: java/lang/StackWalker/VerifyStackTrace.java fails after JDK-8163369
Tue, 09 Aug 2016 10:00:31 +0200 redestad 8163369: Enable generating DMH classes at link time
Tue, 09 Aug 2016 09:42:01 +0200 redestad 8162815: unnecessary object creation in reflection
Tue, 09 Aug 2016 09:44:25 +0530 sundar 8163382: ResourcePoolManager.findEntry has a bug in startsWith call
Mon, 08 Aug 2016 13:58:14 -0700 bpb 8162745: content-types.properties files are missing some modern types
Mon, 08 Aug 2016 13:57:51 -0700 bpb 8146215: (fs) java/nio/file/Files/probeContentType/Basic.java failed frequently on Solaris-sparc with Unexpected type: text/plain
Mon, 08 Aug 2016 11:04:57 -0700 amurillo Merge
Mon, 08 Aug 2016 08:12:20 -0700 amurillo Merge
Fri, 05 Aug 2016 09:50:29 -0700 amurillo Merge
Tue, 02 Aug 2016 18:36:47 +0200 mgronlun 8162945: HotspotDiagnosticMXBean getFlags erroneously reports OutOfMemory
Mon, 01 Aug 2016 14:09:27 +0000 dsamersoff Merge
Mon, 01 Aug 2016 15:39:10 +0300 dsamersoff 8160817: Add jsadebugd functionality to jhsdb
Mon, 01 Aug 2016 15:27:07 +0300 dsamersoff 8162702: com.sun.management.internal.GcInfoBuilder.getPoolNames should not return reference of it's private member
Mon, 01 Aug 2016 13:53:55 +0300 dsamersoff 8162524: src/jdk.management/share/native/libmanagement_ext/Flag.c doesn't handle JNI exceptions
Mon, 01 Aug 2016 10:51:32 +0300 dsamersoff 8158050: Remove SA-JDI
Sat, 30 Jul 2016 00:11:02 +0000 amurillo Merge
Fri, 29 Jul 2016 16:11:57 -0700 amurillo Merge
Fri, 29 Jul 2016 10:18:47 +0200 psandoz 8162458: Buffer view implementations use incorrect offset for Unsafe access
Wed, 27 Jul 2016 13:33:55 +0000 acorn Merge
Wed, 27 Jul 2016 08:33:15 -0400 acorn 8162340: Better class stream parsing
Tue, 26 Jul 2016 23:52:29 -0400 dholmes 8140723: Remove source code conditionalized on JAVASE_EMBEDDED
Tue, 26 Jul 2016 16:18:24 -0700 amurillo Merge
Fri, 22 Jul 2016 10:35:48 -0700 amurillo Merge
Thu, 21 Jul 2016 20:09:20 -0700 amurillo Merge
Thu, 21 Jul 2016 16:29:17 +0200 psandoz 8161947: runtime/Unsafe/GetUnsafe.java is failing on jdk9/dev
Wed, 20 Jul 2016 12:53:25 -0700 dcubed 8161057: Solaris: deprecated/obsolete compiler flags should be removed
Mon, 18 Jul 2016 14:21:17 -0700 dcubed 8161164: quarantine more tests that can't attach symbolicator to the process on MacOS X
Mon, 18 Jul 2016 08:28:32 -0700 fparain 8161034: GPL header missing comma after year
Fri, 15 Jul 2016 23:54:37 -0700 sspitsyn 8158350: Table in ThreadInfo.from(CompositeData) may need updates for new stack trace attributes
Fri, 15 Jul 2016 18:09:33 +0000 dcubed Merge
Fri, 15 Jul 2016 09:37:38 -0700 dcubed 8160997: Solaris: deprecated <pwd.h> and <gid.h> interfaces should be replaced
Fri, 15 Jul 2016 09:10:36 -0700 amurillo Merge
Fri, 15 Jul 2016 12:36:15 +0200 psandoz 8151163: All Buffer implementations should leverage Unsafe unaligned accessors
Mon, 08 Aug 2016 13:55:16 -0400 rriggs 8161431: JNI pending exceptions in ProcessHandleImpl_linux.c and ProcessHandleImpl_unix.c
Mon, 08 Aug 2016 20:16:53 +0300 snikandrova 8162876: [TEST_BUG] sun/net/www/protocol/http/HttpInputStream.java fails intermittently
Mon, 08 Aug 2016 21:51:01 +0800 weijun 8163303: Remove identity scope information from jarsigner -verbose output
Fri, 05 Aug 2016 18:45:40 -0700 xiaofeya 8163149: Typo in java.net.http.AuthenticationFilter
Sat, 06 Aug 2016 00:34:50 +0200 redestad 8161379: Force inline methods calling Reflection.getCallerClass
Fri, 05 Aug 2016 10:23:28 -0700 prr Merge
Wed, 03 Aug 2016 14:49:01 +0530 aghaisas 6427331: NullPointerException in LookupOp.filter(Raster, WritableRaster)
Wed, 03 Aug 2016 14:45:25 +0530 psadhukhan 6575247: Banner checkbox in PrinterJob print dialog doesn't work
Tue, 02 Aug 2016 10:43:31 -0700 prr 8074843: Resolve disabled warnings for libmlib_image and libmlib_image_v
Tue, 02 Aug 2016 16:14:59 +0530 jdv 8160736: KSS : unnecessary class.forName in TIFFJPEGCompressor.java
Tue, 02 Aug 2016 15:55:03 +0530 jdv 8160943: skipImage() in JPEGImageReader class throws IIOException if we have gaps between markers in Jpeg image.
Tue, 02 Aug 2016 10:46:08 +0530 rchamyal 8144594: HiDPI: awt.Choice looks improperly (Win 8)
Mon, 01 Aug 2016 10:06:09 -0700 prr Merge
Fri, 29 Jul 2016 11:25:59 +0300 ssadetsky 8157827: AWT_Desktop/Automated/Exceptions/BasicTest loads incorrect GTK version when jdk.gtk.version=3
Fri, 29 Jul 2016 11:19:28 +0300 ssadetsky 8160448: Make GTK3 menus appearence similar to native.
Fri, 29 Jul 2016 11:14:05 +0300 ssadetsky 8161195: Regression: closed/javax/swing/text/FlowView/LayoutTest.java
Fri, 29 Jul 2016 11:08:34 +0300 ssadetsky 8016313: java.awt.Headless exception has no spec since its creation
Fri, 29 Jul 2016 11:04:52 +0300 ssadetsky 8117886: There is no tooltip while moving the mouse on the tray icon.
Fri, 29 Jul 2016 10:59:43 +0300 ssadetsky 8161273: [hidpi] The frame insets size is wrong on Linux HiDPI because it is not scaled.
Fri, 29 Jul 2016 10:56:30 +0300 ssadetsky 8160246: Regression: 4410243 reproducible with GTK LaF
Fri, 29 Jul 2016 10:50:49 +0300 ssadetsky 8161007: GPL header missing comma in year
Thu, 28 Jul 2016 10:27:46 -0700 ddehaven Merge
Thu, 28 Jul 2016 09:29:38 -0700 ddehaven Merge
Thu, 28 Jul 2016 09:54:55 -0700 prr 8056210: Move libawt file to windows directory
Thu, 28 Jul 2016 09:53:08 -0700 prr 8148477: Native memory leak in font layout subsystem
Thu, 28 Jul 2016 06:02:40 -0700 prr 8149714: [parfait] char array lengths don't match in awt_Font.cpp:1701
Wed, 27 Jul 2016 15:32:25 +0300 aivanov 8160664: JVM crashed with font manager on Solaris 12
Tue, 26 Jul 2016 11:50:19 -0700 prr 8162488: JDK should be updated to use LittleCMS 2.8
Tue, 26 Jul 2016 11:30:40 -0700 prr 8074827: Resolve disabled warnings for libjavajpeg
Tue, 26 Jul 2016 18:45:05 +0300 vadim 8162545: Mac build failure
Tue, 26 Jul 2016 15:55:22 +0300 serb 8159899: [TEST_BUG] Timeout in tests when OOM should be generated
Tue, 26 Jul 2016 14:54:26 +0300 vadim 8161742: [parfait] Uninitialised memory in isXTestAvailable of awt_Robot.c:65
Tue, 26 Jul 2016 14:19:40 +0300 vadim 8161733: [parfait] Memory leak in imageioJPEG.c:2803
Tue, 26 Jul 2016 14:19:15 +0300 vadim 8161740: [parfait] Memory leak in Java_sun_awt_UNIXToolkit_load_1gtk_1icon of awt_UNIXToolkit.c:132
Tue, 26 Jul 2016 14:18:43 +0300 vadim 8161761: [parfait] 2 JNI exception pending defect groups in GraphicsPrimitiveMgr.c
Tue, 26 Jul 2016 12:37:21 +0530 psadhukhan 6591280: getting IPP connection causes disabling jar caches
Mon, 25 Jul 2016 11:03:53 -0700 prr 7175487: Cannot customize font configuration on Linux
Mon, 25 Jul 2016 10:36:12 -0700 prr 8147542: ClassCastException when repainting after display resolution change
Mon, 25 Jul 2016 15:29:24 +0530 rchamyal 8147648: [hidpi] multiresolution image: wrong resolution variant is used as icon in the Unity panel
Fri, 22 Jul 2016 16:09:52 -0700 prr 8162429: Clean up obsolete font preferences for JDS.
Fri, 22 Jul 2016 16:07:45 -0700 prr 8162432: Clean up references in font code to old Solaris releases.
Fri, 22 Jul 2016 15:57:57 -0700 prr 8140314: Verify IIOMetadataFormat class on loading
Fri, 22 Jul 2016 14:32:49 -0700 bpb 8148454: [PIT] Failure of ReplaceMetadataTest on TIFF with IllegalStateException
Sat, 23 Jul 2016 02:08:17 +0530 jdv 8161902: [PIT][TEST_BUG]sun/awt/image/OffScreenImageSource/ImageConsumerUnregisterTest.java compilation fails
Fri, 22 Jul 2016 11:16:08 -0700 bpb 8149016: Misleading IllegalArgumentException message when a type that is neither LONG nor IFD pointer is supplied to TIFFField constructor
Fri, 22 Jul 2016 12:16:33 +0530 pkbalakr 8144709: [hidpi] [TestBug] java/awt/GridLayout/ChangeGridSize/ChangeGridSize.java, java/awt/GridLayout/ComponentPreferredSize/ComponentPreferredSize.java are failing
Fri, 22 Jul 2016 12:13:24 +0530 aghaisas 7096375: Swing ignores first click after decreasing system's time
Fri, 22 Jul 2016 10:53:01 +0530 psadhukhan 4882305: StreamPrintServ.getSupportedAttributeValues returns null for Orientation attr
Thu, 21 Jul 2016 12:27:27 -0700 dtitov 8156960: Deprecate JSObject.getWindow(Applet) method
Thu, 21 Jul 2016 20:30:18 +0530 rchamyal 8158918: setExtendedState(1) for maximized Frame results in state==7
Wed, 20 Jul 2016 17:08:04 +0200 simonis 4908075: Press shift and another key using robot does not trigger events properly - WinXP
Thu, 07 Jul 2016 16:21:45 +0200 goetz 8160974: [TESTBUG] Mark more headful tests with @key headful.
Wed, 20 Jul 2016 14:17:41 +0530 aniyogi 8161470: Failure javax/swing/JRadioButton/FocusTraversal/FocusTraversal.java
Wed, 20 Jul 2016 11:25:57 +0530 aniyogi 8160438: javax/swing/plaf/nimbus/8057791/bug8057791.java fails
Fri, 05 Aug 2016 18:16:45 +0530 sundar 8163256: jlink/plugins/ExcludeVMPluginTest.java failed with Selected VM server doesn't exist
Fri, 05 Aug 2016 09:42:05 +0530 sundar 8163116: jlink exclude VM plugin does not fully support cross platform image creation
Thu, 04 Aug 2016 14:29:27 -0700 bpb 8162902: Add some debugging output to test/java/nio/file/WatchService/DeleteInterference
Thu, 04 Aug 2016 17:49:12 +0000 amurillo Merge
Thu, 04 Aug 2016 19:39:42 +0530 sundar 8146721: FileCopierPlugin should not create fake module
Thu, 04 Aug 2016 16:05:37 +0300 igerasim 8163180: Typos around @code javadoc tag usage
Thu, 04 Aug 2016 15:45:24 +0800 amlu 8161024: Remove intermittent key from java/lang/Runtime/exec/LotsOfOutput.java
Wed, 03 Aug 2016 21:15:05 +0200 clanger 8162819: fix minor Javadoc issues and remove warnings in java.net.Socket
Wed, 03 Aug 2016 12:55:44 -0400 rriggs 8160151: java/lang/ProcessBuilder/Zombies.java failed with error "1 zombies!"
Wed, 03 Aug 2016 08:13:45 -0700 darcy 8162817: Annotation toString output not reusable for source input
Wed, 03 Aug 2016 13:32:59 +0800 amlu 8161970: Remove tools/jlink/JLinkOptimTest.java from ProblemList.txt
Wed, 03 Aug 2016 09:37:57 +0900 nishjain 8035133: Locale matching: Weight q=0 isn't handled correctly.
Tue, 02 Aug 2016 10:58:16 -0700 naoto 8162797: Code clean-up in IncludeLocalesPlugin
Tue, 02 Aug 2016 10:36:33 -0700 tidu 8160337: Remove intermittent key from sun/security/pkcs11/rsa/TestKeyPairGenerator.java
Tue, 02 Aug 2016 17:33:50 +0530 sundar 8159487: Add JAVA_VERSION, OS_NAME, OS_ARCH properties in release file
Thu, 04 Aug 2016 17:32:53 +0000 amurillo Added tag jdk-9+130 for changeset cd4f403f9618
Wed, 05 Jul 2017 22:02:42 +0200 duke Merge
Fri, 05 Aug 2016 09:50:25 -0700 amurillo Merge
Tue, 02 Aug 2016 16:24:04 -0400 dholmes 7008747: Header files with conditional behaviour can not be precompiled
Tue, 02 Aug 2016 15:22:41 +0300 mchernov 8161604: TestNewSizeFlags fails with RuntimeException: max new size != MaxNewSize value
Mon, 01 Aug 2016 20:47:51 -0700 kvn Merge
Fri, 29 Jul 2016 17:41:14 +0300 tpivovarova 8161138: testlibrary_tests/ctw/* failed with "Failed. Unexpected exit from test [exit code: 0]"
Mon, 01 Aug 2016 20:41:15 -0400 clanger 8162869: Small fixes for AIX perf memory and attach listener
Mon, 01 Aug 2016 16:28:23 -0400 coleenp 8161445: [BACKOUT] MemberNameTable doesn't purge stale entries
Mon, 01 Aug 2016 15:38:58 +0300 dsamersoff 8160817: Add jsadebugd functionality to jhsdb
Mon, 01 Aug 2016 10:51:22 +0300 dsamersoff 8158050: Remove SA-JDI
Fri, 29 Jul 2016 16:50:45 -0700 amurillo Merge
Fri, 29 Jul 2016 16:11:55 -0700 amurillo Merge
Fri, 29 Jul 2016 20:23:24 +0000 jmasa Merge
Wed, 08 Jun 2016 14:11:51 -0700 jmasa 8159073: : Error handling incomplete when creating GC threads lazily
Fri, 29 Jul 2016 11:38:07 -0700 dcubed 8161601: Solaris: __USE_LEGACY_PROTOTYPES__ is redundant and should be removed
Fri, 29 Jul 2016 08:17:43 +0000 rbackman Merge
Fri, 29 Jul 2016 09:23:05 +0200 rbackman Merge
Thu, 28 Jul 2016 16:09:31 +0300 dpochepk 8162603: Unrecognized VM option 'UseCountedLoopSafepoints'
Thu, 28 Jul 2016 08:19:35 +0000 zmajo Merge
Wed, 27 Jul 2016 12:33:33 +0200 roland 8162384: Performance regression: bimorphic inlining may be bypassed by type speculation
Wed, 27 Jul 2016 10:56:01 -0700 dlong 8160742: Node::operator new invokes undefined behavior
Wed, 20 Jul 2016 12:34:11 +0200 goetz 8161907: adlc: Fix crash in cisc_spill_match if _rChild == NULL
Mon, 25 Jul 2016 14:31:42 -0700 roland 8161147: jvm crashes when -XX:+UseCountedLoopSafepoints is enabled
Thu, 23 Jun 2016 17:58:59 +0000 aph 8157306: Random infrequent null pointer exceptions in javac
Mon, 25 Jul 2016 21:02:51 +0300 dpochepk 8162376: TestSHA512Intrinsics.java failed with Unexpected count of intrinsic _sha5_implCompress is expected
Fri, 22 Jul 2016 12:47:08 -1000 twisti 8162427: fix indent in CompileTask::print_tty
Mon, 18 Jul 2016 20:45:51 +0200 roland 8161651: Logic in ConnectionGraph::split_unique_types() wrongly assumes node always have memory input
Fri, 22 Jul 2016 17:52:03 +0000 dnsimon Merge
Wed, 20 Jul 2016 22:18:13 +0000 dnsimon 8161265: [JVMCI] EnableJVMCI should only be required when its not implied by other flags
Fri, 22 Jul 2016 17:05:08 +0100 aph 8161190: AArch64: Fix overflow in immediate cmp instruction
Wed, 20 Jul 2016 19:35:08 +0300 dpochepk 8071652: -XX:CompileOnly does not behave as documented
Wed, 20 Jul 2016 19:33:22 +0300 dpochepk 8161695: compiler/jsr292/MHInlineTest.java can't be run on client-only platforms
Wed, 20 Jul 2016 19:31:34 +0300 dpochepk 8158756: [Testbug] serviceability/dcmd/compiler/CompilerQueueTest.java fails with TieredStopAtLevel=1
Wed, 20 Jul 2016 19:29:10 +0300 dpochepk 8161508: JVMCI: MaterializeVirtualObjectTest fails w/ "CASE: invalidate=true: has no virtual object before materialization
Tue, 19 Jul 2016 18:17:40 -0700 never 8161603: [JVMCI] HotSpotVMConfig.baseVtableLength is incorrectly computed
Tue, 19 Jul 2016 18:59:11 +0000 dnsimon 8161274: [JVMCI] compiler/jvmci/events/JvmciNotifyInstallEventTest.java fails with NoClassDefFound
Tue, 19 Jul 2016 18:11:03 +0000 never 8161292: [JVMCI] missing test files from 8159368
Tue, 19 Jul 2016 13:15:46 +0200 rbackman Merge
Thu, 23 Jun 2016 22:33:46 +0200 goetz 8160245: C1: Clean up platform #defines in c1_LIR.hpp.
Thu, 14 Jul 2016 20:11:55 +0300 dpochepk 8157861: [TESTBUG] compiler/jvmci/compilerToVM/ReprofileTest.java failed with RuntimeException
Thu, 14 Jul 2016 20:10:16 +0300 dpochepk 8157984: [TESTBUG] Several compiler tests fails when are executed with -XX:TieredStopAtLevel=1
Thu, 14 Jul 2016 14:44:53 +0000 tpivovarova Merge
Wed, 13 Jul 2016 18:03:15 +0300 tpivovarova 8151280: update hotspot tests to use vm.compMode instead of their own logic
Thu, 14 Jul 2016 15:18:15 +0100 aph Merge
Wed, 13 Jul 2016 15:19:34 +0100 aph 8159467: AArch64: Enable compact strings
Fri, 08 Jul 2016 17:11:37 +0100 aph 8161072: AArch64: jtreg compiler/uncommontrap/TestDeoptOOM failure
Thu, 14 Jul 2016 08:33:08 +0200 mhaupt 8161068: jdk.vm.ci.hotspot.test.MethodHandleAccessProviderTest fails
Wed, 13 Jul 2016 19:08:07 +0300 ppunegov 8160761: [TESTBUG] Several compiler tests fail with product bits
Mon, 04 Jul 2016 16:28:27 +0200 goetz 8056950: Compiled code (64-bit) on SPARC should sign extend INT parameters passed on registers to runtime or native methods.
Tue, 12 Jul 2016 20:42:46 +0000 sanzinger 8159368: [JVMCI] SPARCHotSpotRegisterConfig.callingConvention gives incorrect calling convention for native calls containing fp args
Tue, 12 Jul 2016 18:24:48 +0300 tpivovarova 8132919: Put compiler tests in packages
Tue, 12 Jul 2016 08:42:46 +0000 zmajo Merge
Tue, 12 Jul 2016 10:16:36 +0200 zmajo 8098573: Compiler accesses to shared archive fail if archive is remapped
Tue, 12 Jul 2016 08:57:00 +0200 thartmann 8160898: assert while replaying ciReplay file created using TieredStopAtLevel=1
Mon, 11 Jul 2016 19:15:21 +0000 dnsimon 8160730: [JVMCI] compiler selection should work without -Djvmci.Compiler
Mon, 11 Jul 2016 13:14:19 +0200 rbackman Merge
Fri, 08 Jul 2016 21:26:02 +0300 iignatyev 8160657: Compiler HotSpot tests should use the "run driver" directive where applicable
Fri, 08 Jul 2016 20:14:18 +0300 dpochepk 8160276: Jittester: bytecode tests generation hangs in ClassWriter infinite loop
Fri, 08 Jul 2016 17:02:10 +0100 aph 8160969: aarch64: CDS is broken after 8079507
Thu, 07 Jul 2016 15:39:12 +0100 aph Merge
Thu, 07 Jul 2016 15:07:13 +0100 aph 8141633: Implement VarHandles/Unsafe intrinsics on AArch64
Thu, 07 Jul 2016 13:53:52 +0300 tpivovarova 8160773: error: package jdk.internal.jimage does not exist
Wed, 06 Jul 2016 15:05:28 +0300 vlivanov 8160360: Mismatched field loads are folded in LoadNode::Value
Tue, 05 Jul 2016 17:57:20 -0700 dnsimon 8159888: [JVMCI] the client VM build is broken when INCLUDE_JVMCI is defined
Tue, 05 Jul 2016 07:57:09 +0200 thartmann 8159129: TestStringIntrinsicRangeChecks fails w/ No exception thrown for compressByte/inflateByte
Mon, 04 Jul 2016 09:14:02 +0200 thartmann 8160651: StubRoutines::_dtan does not restore callee save register rbx
Sat, 02 Jul 2016 00:27:19 +0000 dnsimon 8160647: [JVMCI] need to be able to copy internal arrays from LocalVariableTable and LineNumberTable
Thu, 30 Jun 2016 05:05:52 -0700 rraghavan 8153194: PreserveFPRegistersTest.java runs out of memory in the nightlies.
Tue, 24 May 2016 01:13:57 -0700 enevill 8156943: aarch64: string compare does not support CompactStrings
Thu, 30 Jun 2016 08:24:51 +0200 thartmann 8160425: Vectorization with signalling NaN returns wrong result
Wed, 29 Jun 2016 18:04:04 +0300 ppunegov 8160471: compiler/rangechecks/TestRangeCheckEliminationDisabled.java fails after JDK-8150900
Wed, 29 Jun 2016 11:38:58 +0000 tpivovarova Merge
Wed, 29 Jun 2016 14:32:13 +0300 tpivovarova 8153515: [ctw] CompileTheWorld testlibrary should trigger compilation of <clinit> and <init>
Wed, 29 Jun 2016 11:24:13 +0000 enevill 8160534: aarch64: fails to build after 8157834
Tue, 28 Jun 2016 20:08:43 +0000 never Merge
Tue, 28 Jun 2016 17:22:56 +0000 never 8160121: [JVMCI] JvmciNotifyBootstrapFinishedEventTest.java failed NoClassDefFoundError: jdk/vm/ci/runtime/JVMCI
Tue, 28 Jun 2016 19:58:15 +0300 tpivovarova 8143081: [ctw] Test CompileTheWorld.java needs to be updated for Jigsaw
Mon, 27 Jun 2016 17:23:15 +0300 dpochepk 8132318: -XX:TraceJumps is broken on Sparc
Mon, 27 Jun 2016 10:10:11 +0200 thartmann 8159016: Over-unrolled loop is partially removed
Fri, 24 Jun 2016 15:30:50 -0700 kvn Merge
Fri, 24 Jun 2016 19:06:00 +0000 iveresov Merge
Fri, 24 Jun 2016 11:22:08 -0700 iveresov 8157249: [JVMCI] remove ConstantReflectionProvider.isEmbeddable method
Fri, 24 Jun 2016 17:12:50 +0000 ppunegov Merge
Fri, 24 Jun 2016 19:06:15 +0300 ppunegov 8160085: @library' must appear before first `@run'
Fri, 24 Jun 2016 17:11:17 +0000 rschatz Merge
Fri, 24 Jun 2016 15:45:47 +0000 rschatz 8160177: [JVMCI] race condition in HotSpotMemoryAccessProviderImpl.verifyReadRawObject
Thu, 16 Jun 2016 06:42:08 -0400 enevill 8159063: aarch64: optimise unaligned array copy long
Wed, 22 Jun 2016 17:05:40 +0200 simonis 8159620: -XX:-UseOnStackReplacement does not work together with -XX:+TieredCompilation on ppc64 and sparc
Fri, 29 Jul 2016 08:36:13 +0200 thartmann 8162540: Crash in C2 escape analysis with assert: "node should be registered"
Thu, 28 Jul 2016 09:57:49 -0400 lfoltan 8160487: JVM should validate a module by checking for an instance of java.lang.reflect.Module
Wed, 27 Jul 2016 18:43:52 +0300 mchernov 8159606: gc/g1/TestShrinkAuxiliaryData* tests fail because GC triggered before VM initialization completed
Wed, 27 Jul 2016 21:16:38 +0400 dfazunen 8161990: Un-quarantine TestParallelHeapSizeFlags.java and TestSmallHeap.java.
Wed, 27 Jul 2016 13:33:52 +0000 acorn Merge
Wed, 27 Jul 2016 08:31:48 -0400 acorn 8162340: Better class stream parsing
Tue, 26 Jul 2016 23:52:25 -0400 dholmes 8140723: Remove source code conditionalized on JAVASE_EMBEDDED
Tue, 26 Jul 2016 17:25:58 -0400 jiangli 8156959: compiler/codecache/jmx/UsageThresholdExceededSeveralTimesTest.java fails with exit 134.
Tue, 26 Jul 2016 10:29:27 -0400 lfoltan 8154239: -Xbootclasspath/a breaks exploded build
Tue, 26 Jul 2016 11:04:20 +0200 tschatzl 8161993: G1 crashes if active_processor_count changes during startup
Tue, 26 Jul 2016 11:04:20 +0200 tschatzl 8147910: Cache initial active_processor_count
Wed, 13 Jul 2016 12:23:05 +0200 goetz 8161258: Simplify including platform files.
Mon, 25 Jul 2016 18:52:59 +0000 amurillo Merge
Mon, 25 Jul 2016 15:30:23 +0000 amurillo Merge
Fri, 22 Jul 2016 19:04:38 +0000 amurillo Merge
Fri, 22 Jul 2016 10:35:46 -0700 amurillo Merge
Fri, 22 Jul 2016 10:14:23 -0700 amurillo Merge
Mon, 25 Jul 2016 17:35:25 +0200 ddmitriev Merge
Fri, 22 Jul 2016 16:55:55 +0300 akulyakh 8153978: New test to verify the modules info as returned by the JVMTI
Mon, 25 Jul 2016 09:40:31 -0400 mockner 8038332: The trace event vm/class/load is not always being sent
Fri, 22 Jul 2016 10:15:42 -0700 bchristi 8161028: GPL header missing comma after year
Thu, 21 Jul 2016 14:55:54 +0200 ehelin 8159464: DumpHeap.java hits assert in G1 code
Fri, 22 Jul 2016 02:36:39 -0700 sspitsyn 8145627: sun.jvm.hotspot.oops.InstanceKlass::getSize() returns the incorrect size and has no test
Fri, 22 Jul 2016 04:05:04 +0000 amurillo Merge
Thu, 21 Jul 2016 20:09:19 -0700 amurillo Merge
Thu, 21 Jul 2016 19:50:41 -0700 amurillo Merge
Thu, 21 Jul 2016 19:29:33 -0700 ccheung 8161539: 8159666 breaks minimal VM
Thu, 21 Jul 2016 16:45:56 +0000 dfazunen Merge
Thu, 21 Jul 2016 17:12:35 +0400 dfazunen 8161552: Test issue: VM init failed: GC triggered before VM initialization completed. Try increasing NewSize, current value 768K.
Thu, 21 Jul 2016 16:29:21 +0200 psandoz 8161947: runtime/Unsafe/GetUnsafe.java is failing on jdk9/dev
Thu, 21 Jul 2016 14:06:22 +0200 mgerdin 8161915: Linking gtestLauncher may end up linking with non-gtest libjvm
Wed, 20 Jul 2016 14:47:53 +0300 bmoloden 8160119: Utils.tryFindJvmPid sometimes find incorrect pid
Tue, 19 Jul 2016 22:14:22 +0200 jiangli Merge
Tue, 19 Jul 2016 20:39:23 +0200 jiangli Merge
Tue, 19 Jul 2016 20:07:06 +0200 jiangli Merge
Tue, 19 Jul 2016 13:52:14 -0400 jiangli 8141341: CDS should be disabled if JvmtiExport::should_post_class_file_load_hook() is true.
Tue, 19 Jul 2016 19:05:06 +0000 jmasa Merge
Wed, 06 Jul 2016 13:23:10 -0700 jmasa 8155263: DisableStartThread should not be applied to GC worker threads
Tue, 19 Jul 2016 17:26:51 +0000 gziemski Merge
Tue, 19 Jul 2016 11:00:45 -0500 gziemski 8138760: [JVMCI] VM warning: Performance bug: SystemDictionary lookup_count=21831450 lookup_length=1275207287 average=58.411479 load=5.572844
Tue, 19 Jul 2016 18:15:46 +0300 mchernov 8160827: gc/stress/TestStressG1Humongous.java fails with OOME
Tue, 19 Jul 2016 09:30:30 +0200 tschatzl 8157459: G1 IHOP JFR event attribute with incorrect content type
Tue, 19 Jul 2016 10:31:41 +0200 tschatzl 8034842: Parallelize the Free CSet phase in G1
Mon, 18 Jul 2016 14:20:30 -0700 dcubed 8161173: quarantine compiler/arraycopy/TestEliminatedArrayCopyDeopt.java
Mon, 18 Jul 2016 14:30:39 +0200 mgerdin 8161027: GPL header missing comma after year
Sat, 16 Jul 2016 23:10:00 +0300 igerasim 8160892: Race at the VM exit causes "WaitForMultipleObjects timed out"
Fri, 15 Jul 2016 17:05:10 -0700 dcubed Merge
Fri, 15 Jul 2016 10:46:08 -0700 gthornbr 8144278: [TESTBUG] hotspot/runtime/StackGuardPages/testme.sh should use native library build support
Fri, 15 Jul 2016 10:31:50 -0700 gthornbr 8144279: [TESTBUG] hotspot/runtime/jsig/Test8017498.sh should use native library build support
Fri, 15 Jul 2016 10:25:16 -0700 gthornbr 8081770: [TESTBUG] regression Test7107135 needs to remove dependence on locally installed gcc
Fri, 15 Jul 2016 18:09:33 +0000 dcubed Merge
Fri, 15 Jul 2016 09:36:28 -0700 dcubed 8160997: Solaris: deprecated <pwd.h> and <gid.h> interfaces should be replaced
Fri, 15 Jul 2016 09:10:36 -0700 amurillo Merge
Fri, 15 Jul 2016 12:40:47 +0000 psandoz Merge
Fri, 15 Jul 2016 12:36:18 +0200 psandoz 8151163: All Buffer implementations should leverage Unsafe unaligned accessors
Fri, 15 Jul 2016 13:33:44 +0200 tschatzl 8160897: Concurrent mark mark stack memory allocation leaks memory
Tue, 12 Jul 2016 15:06:18 +0300 mchernov 8158508: gc/logging/TestUnifiedLoggingSwitchStress.java timeout