log

age author description
Fri, 08 Dec 2017 13:04:43 -0800 bchristi 8193271: ProblemList tools/launcher/TestXcheckJNIWarnings.java
Fri, 08 Dec 2017 11:03:37 -0800 iignatyev 8181118: update java/time tests to use RandomFactory from the top level testlibrary
Fri, 08 Dec 2017 11:05:42 -0800 darcy 8193194: Update javax.lang.model.util visitors for 10
Fri, 08 Dec 2017 17:40:57 +0000 dfuchs 8187073: The java.util.logging.Level.findLevel() will not correctly find a Level by it's int value
Fri, 08 Dec 2017 16:41:30 +0000 xuelei 8148421: Transport Layer Security (TLS) Session Hash and Extended Master Secret Extension
Fri, 01 Dec 2017 16:40:08 -0500 rriggs 8080225: FileInput/OutputStream/FileChannel cleanup should be improved
Fri, 08 Dec 2017 20:46:40 +0530 sundar 8192986: Inconsistent handling of exploded modules in jlink
Fri, 08 Dec 2017 14:28:51 +0000 alanb 8193256: Configuration and ModuleLayer findModule cleanup
Fri, 08 Dec 2017 11:50:39 +0000 dfuchs 8191033: Regression in logging.properties: specifying .handlers= for root logger (instead of handlers=) no longer works
Fri, 08 Dec 2017 12:02:30 +0100 hannesw 8193137: Nashorn crashes when given an empty script file
Fri, 08 Dec 2017 11:48:38 +0100 attila 8192970: Element getters/setters with fixed key fail to link properly
Fri, 08 Dec 2017 09:48:10 +0100 clanger 8193183: Fix format string in libdt_shmem/shmemBase.c
Thu, 07 Dec 2017 21:07:12 -0800 ksrini 8034254: Don't use binary testing files broken.jar
Fri, 08 Dec 2017 09:40:14 +0800 weijun 8192987: keytool should remember real storetype if it is not provided
Thu, 07 Dec 2017 14:21:25 -0800 ksrini 8149402: "-group" option issue for classes from default package
Thu, 07 Dec 2017 14:23:52 -0800 smarks 8177681: Remove methods Runtime.getLocalized{Input,Output}Stream
Thu, 07 Dec 2017 14:15:14 -0800 ksrini 8191030: @value Tags are not resolved by javadoc 9.
Thu, 07 Dec 2017 22:37:45 +0100 erikj 8188789: Update JDK 9.0.1 and Future OpenJDK bundle names
Thu, 07 Dec 2017 21:06:02 +0000 lana Merge
Thu, 07 Dec 2017 21:04:24 +0000 lana Added tag jdk-10+35 for changeset d8c634b016c6
Thu, 07 Dec 2017 11:00:32 -0800 darcy 8193191: Update JavacTestingAbstractProcessor for JDK 10
Thu, 07 Dec 2017 19:24:27 +0100 jlahoda 8189248: Jshell: error with mutually dependent snippets, when one must be replaced
Thu, 07 Dec 2017 10:18:22 -0800 igerasim 8193156: Need to backout fixes for JDK-8058547, JDK-8055753, JDK-8085903
Thu, 07 Dec 2017 09:23:15 -0800 mchung 8192945: Need stable sort for MODULES entry in the release file
Thu, 07 Dec 2017 09:22:35 -0800 mchung 8193159: Reduce the number of classes loaded due to NativeLibrary
Thu, 07 Dec 2017 08:56:04 -0800 bpb 8191872: (fs) UnixNativeDispatcher conditionally compiles in support for high precision timestamps
Thu, 07 Dec 2017 16:45:19 +0000 alanb 8191867: Module attribute in 54.0+ class file cannot contains a requires java.base with ACC_TRANSITIVE or ACC_STATIC_PHASE
Tue, 05 Dec 2017 16:34:03 +0100 sjohanss 8193068: Add gc/g1/TestVerifyGCType.java to problem list
Wed, 06 Dec 2017 20:06:43 -0500 jiangli 8193065: [TESTBUG] [TESTBUG]GCSharedStringsDuringDump.java: Exception in thread "main" java.lang.RuntimeException: String is not shared.
Wed, 06 Dec 2017 18:37:57 -0800 dlong 8193009: compiler/c2/Test7029152.java crashes with SIGILL in java.lang.StringLatin1.indexOf with -XX:+UseJVMCICompiler
Tue, 05 Dec 2017 13:58:55 +0100 sjohanss 8192983: gc/g1/TestVerifyGCType.java might fail on loaded machines
Tue, 05 Dec 2017 21:26:11 +0530 hb 8192909: Invalid username or password in HashedPasswordFileTest.java
Sat, 02 Dec 2017 13:50:04 +0100 roland 8191950: assertion failed: no insertions allowed
Sat, 02 Dec 2017 06:51:10 +0100 jwilhelm Merge
Fri, 01 Dec 2017 16:58:30 -0800 vdeshpande 8170244: Update UseAVX after cpu feature detection to use more default mapping
Fri, 01 Dec 2017 16:23:17 -0800 vdeshpande 8190494: Different results with UseAVX=3 when calling AVX-512 native function via JNI
Fri, 01 Dec 2017 16:20:18 -0800 roland 8192762: LoopNode::verify_strip_mined() fails with "assert failed: only phis"
Fri, 01 Dec 2017 15:58:39 -0800 iignatyev 8191273: applications/ctw/modules tests fail intermittently
Fri, 01 Dec 2017 15:53:15 -0800 iklam 8190809: JVM crashes while generating appcds for classpath with empty directory entry
Fri, 01 Dec 2017 11:17:45 -0800 dlong 8192814: Update Graal
Fri, 01 Dec 2017 14:19:16 -0500 coleenp Merge
Fri, 01 Dec 2017 11:26:22 -0500 mdoerr 8192898: AIX build broken after JDK-8190308
Fri, 01 Dec 2017 17:10:33 +0100 mdoerr 8192825: PPC64: Missing null check in C1 inline cache check
Fri, 01 Dec 2017 17:09:43 +0100 lucy 8192818: [s390]: restoring register contents calculates wrong value
Fri, 01 Dec 2017 17:03:07 +0100 egahlin 8179083: Uninitialized notifier in Java Monitor Wait tracing event
Fri, 01 Dec 2017 11:00:46 -0500 dcubed 8192810: EnableThreadSMRStatistics should be default off in release builds
Fri, 01 Dec 2017 18:24:52 +0300 dpochepk 8189439: Parameters type profiling is not performed from aarch64 interpreter
Fri, 01 Dec 2017 18:20:00 +0300 dchuyko 8191129: AARCH64: Invalid value passed to critical JNI function
Fri, 01 Dec 2017 18:19:39 +0530 jgeorge 8191538: SA: tests for clhsdb commands: vmstructsdump, field, symboltable and symbol
Fri, 01 Dec 2017 00:57:01 -0800 jcm 8006887: Comment about LIR_OprDesc.value in c1_LIR.hpp is incorrect
Fri, 01 Dec 2017 08:56:22 +0100 sjohanss 8191821: Finer granularity for GC verification
Fri, 01 Dec 2017 11:40:39 +0530 jgeorge 8191914: New SA test timeout on windows
Thu, 30 Nov 2017 21:28:12 -0800 mseledtsov 8192866: [TESTBUG] Move UseAppCDS.java from the closed ProblemList.txt to the open one
Thu, 30 Nov 2017 20:45:03 -0800 mseledtsov 8191943: [TESTBUG] docker/TestCPUAwareness fails on machine with 2 CPUs
Fri, 01 Dec 2017 10:04:31 +0900 ysuenaga 8190837: BasicType and BasicTypeSize should refer to HotSpot values
Thu, 30 Nov 2017 16:28:47 -0800 cjplummer 8192840: serviceability/dcmd/jvmti/AttachFailed/AttachNoEntry.java failing on Windows
Thu, 30 Nov 2017 18:38:20 -0500 dcubed 8191787: move private inline functions from thread.inline.hpp -> thread.cpp
Thu, 30 Nov 2017 10:40:48 -0800 dlong 8191437: AOT doesn't work easily after thread local handshakes
Thu, 30 Nov 2017 14:25:33 -0800 ccheung 8174101: Bootclasspath append should not invalidate CDS archive
Thu, 30 Nov 2017 16:00:34 -0500 ecaspole 8192821: Make LogCompilation into a maven project
Thu, 30 Nov 2017 20:37:20 +0100 eosterlund 8186787: clang-4.0 SIGSEGV in Unsafe_PutByte
Thu, 30 Nov 2017 13:40:07 +0100 rkennke 8191564: Refactor GC related servicability code into GC specific subclasses
Thu, 30 Nov 2017 08:35:33 -0800 iveresov 8192756: SIGSEGV in nmethod::new_native_nmethod
Thu, 30 Nov 2017 21:24:52 +0530 jgeorge 8191324: SA cleanup -- part 2
Thu, 30 Nov 2017 16:08:13 +0100 rehn 8192072: 8191782 fix for VMDeprecatedOptions.java missed DeferThrSuspendLoopCount and duplicated DeferPollingPageLoopCount
Thu, 30 Nov 2017 10:01:26 -0500 ecaspole Merge
Thu, 30 Nov 2017 09:59:27 -0500 ecaspole 8191779: LogCompilation throws java.lang.Error: scope underflow
Thu, 30 Nov 2017 09:51:28 -0500 bobv Merge
Thu, 30 Nov 2017 09:49:45 -0500 bobv 8192154: JVM crashes inside some chroot environments on linux
Thu, 30 Nov 2017 19:46:20 +0530 sballal 8191658: SA: Testcases for attach, detach, reattach and Jhisto commands
Thu, 30 Nov 2017 15:05:03 +0100 sjohanss 8192807: testlibrary_tests/TestMutuallyExclusivePlatformPredicates.java fail due to new method in Platform.java
Thu, 30 Nov 2017 14:58:41 +0530 sballal 8184982: SA: Running ClassDump on a simple java program generates NullPointerException
Tue, 28 Nov 2017 21:43:45 +0100 stefank 8192061: Clean up allocation.inline.hpp includes
Wed, 29 Nov 2017 18:43:35 -0800 iklam 8191747: [TESTBUG] runtime/appcds/DumpClassList.java and ProhibitedPackage.java fail on product bits
Tue, 28 Nov 2017 09:47:04 -0800 iklam 8191927: Enable AppCDS for custom loaders on all 64-bit Linux and AIX
Wed, 29 Nov 2017 16:45:31 -0800 kkharbas 8190980: Develop test cases and collect test pass rate
Wed, 29 Nov 2017 17:03:10 -0800 kkharbas 8190308: Implementation: JEP 316: Heap Allocation on Alternative Memory Devices
Wed, 29 Nov 2017 10:30:51 -0800 kvn 8184361: AOT lib at jdk/lib/libjava.base-coop.so seems to override -XX:AOTLibrary=
Wed, 29 Nov 2017 14:34:19 +0300 dchuyko 8188221: Return type profiling is not performed from aarch64 interpreter
Wed, 29 Nov 2017 09:26:58 +0900 ysuenaga 8165736: Error message should be shown when JVMTI agent cannot be attached
Tue, 28 Nov 2017 17:11:02 -0500 coleenp Merge
Mon, 27 Nov 2017 17:19:53 -0500 zgu 8190729: Adjustment to anonymous metadata space chunk allocation algorithm
Tue, 28 Nov 2017 15:52:32 -0500 kbarrett 8191870: Remove badJNIHandle
Tue, 28 Nov 2017 19:02:23 +0100 thartmann 8191996: VM startup fails with CodeCacheExpansionSize=32768 is outside the allowed range
Tue, 28 Nov 2017 11:59:16 +0100 roland 8186027: C2: loop strip mining
Tue, 28 Nov 2017 21:04:42 +0530 hb 5016517: Replace plaintext passwords by hashed passwords for out-of-the-box JMX Agent
Tue, 28 Nov 2017 14:20:15 +0100 simonis 8191863: [s390] Fix CDS: some bytecode rewriting doesn't depend on RewriteControl
Tue, 28 Nov 2017 14:11:43 +0100 simonis 8191770: [ppc64] Fix CDS: don't rewrite invokefinal if DumpSharedSpaces
Tue, 28 Nov 2017 15:42:15 +0300 dchuyko 8191769: AARCH64: Fix hint instructions encoding
Tue, 28 Nov 2017 12:23:03 +0100 drwhite 8188877: Improper synchronization in offer_termination
Tue, 28 Nov 2017 14:16:24 +0530 jgeorge 8191961: SA: Remove left over quarantined SA tests due to 8184042 from ProblemList.txt
Mon, 27 Nov 2017 20:21:34 -0800 iklam 8188791: Move AppCDS from closed repo to open repo
Mon, 27 Nov 2017 20:35:56 -0500 jiangli 8191504: [TESTBUG] CDSTestUtils.isUnableToMap() should check OptionalData region mapping failure
Tue, 20 Jun 2017 16:25:53 +0800 njian 8181633: Vectorization fails for some multiplication with constant cases
Mon, 27 Nov 2017 16:05:11 -0800 roland 8191887: assert(b->is_Bool()) in PhaseIdealLoop::clone_iff() due to Opaque4 node
Mon, 27 Nov 2017 17:51:21 -0500 dcubed Merge
Mon, 27 Nov 2017 15:26:55 -0500 jgeorge 8191919: Include TestJhsdbJstackLock.java in ProblemList.txt
Mon, 27 Nov 2017 13:19:08 -0800 sangheki 8178497: Bug in MutableNUMASpace::ensure_parsability
Mon, 27 Nov 2017 10:44:19 -0800 roland 8191153: assert(u_ctrl != blk1 && u_ctrl != blk2) failed: won't converge
Fri, 10 Nov 2017 10:30:42 +0100 jtulach 8189116: Give the jdk.internal.vm.compiler.management only the permissions it really needs to expose the bean
Mon, 27 Nov 2017 17:26:47 +0000 aph Merge
Mon, 27 Nov 2017 17:04:45 +0000 aph Merge
Fri, 24 Nov 2017 17:19:47 +0000 aph 8189596: AArch64: implementation for Thread-local handshakes
Fri, 24 Nov 2017 12:16:25 +0100 glaubitz 8186461: Zero's atomic_copy64() should use SPE instructions on linux-powerpcspe
Tue, 21 Nov 2017 13:48:28 +0100 glaubitz 8187227: Zero should use compiler built-ins for atomics on linux-m68k
Mon, 27 Nov 2017 14:59:36 +0100 gromero 8191868: IdealGraphVisualizer: "ant build/run" fails due to outdated bootstrap.url
Mon, 27 Nov 2017 13:50:03 +0100 pliden 8191864: Provide a public destructor for WorkGang
Mon, 27 Nov 2017 13:34:00 +0100 pliden 8191862: Warn about UseNUMA/UseLargePages only when using ParallelGC
Mon, 27 Nov 2017 12:38:47 +0100 pliden 8191846: jstat prints debug message when debugging is disabled
Mon, 27 Nov 2017 03:11:38 -0800 rraghavan 8191227: issues with unsafe handle resolution
Mon, 27 Nov 2017 11:41:00 +0100 thartmann 8087339: The code heap might use different alignment for committed size and reserved size
Mon, 27 Nov 2017 11:39:21 +0100 thartmann 8179026: Remove explicit code cache options processing
Mon, 27 Nov 2017 10:51:31 +0100 ehelin 8080345: With perm gen gone, perfdata counter sun.gc.policy.generations should be 2, not 3
Fri, 24 Nov 2017 15:48:01 +0100 stefank 8191861: Move and refactor hSpaceCounters
Fri, 24 Nov 2017 15:21:30 +0100 stefank 8191860: Add perfData.inline.hpp
Fri, 24 Nov 2017 15:21:28 +0100 stefank 8191858: Add missing includes in memoryManager.hpp
Mon, 27 Nov 2017 11:20:38 +0530 ysuenaga 8185796: jstack and clhsdb jstack should show lock objects
Sun, 26 Nov 2017 09:05:13 -0800 rraghavan 8191313: compiler/runtime/SpreadNullArg.java fails in tier1
Sat, 25 Nov 2017 20:28:10 +0100 jwilhelm Merge
Sat, 25 Nov 2017 04:36:43 +0100 jwilhelm Merge
Fri, 24 Nov 2017 14:07:59 +0100 dholmes 8191707: Options with invalid values are incorrectly treated as obsolete and ignored
Fri, 24 Nov 2017 13:58:52 +0100 rehn 8191782: Missing deprecated options in VMDeprecatedOptions.java
Thu, 23 Nov 2017 19:42:56 -0800 dcubed Merge
Thu, 23 Nov 2017 06:01:57 -0800 dcubed Merge
Wed, 22 Nov 2017 17:54:50 -0800 dcubed 8167108: inconsistent handling of SR_lock can lead to crashes
Wed, 22 Nov 2017 18:58:01 -0500 aharlap 8185591: guarantee(_byte_map[_guard_index] == last_card) failed: card table guard has been modified
Thu, 23 Nov 2017 15:51:06 +0100 tschatzl 8190426: Lazily initialize refinement threads with UseDynamicNumberOfGCThreads
Thu, 23 Nov 2017 15:51:06 +0100 tschatzl 8182050: assert(_whole_heap.contains(p)) failed: Attempt to access p out of bounds of card marking array's _whole_heap
Thu, 23 Nov 2017 15:51:06 +0100 tschatzl 8179244: Assert failed in instanceMirrorKlass.inline.hpp
Thu, 23 Nov 2017 09:53:53 +0100 sjohanss 8189733: Cleanup Full GC setup and tear down
Wed, 22 Nov 2017 16:10:42 -0800 ccheung Merge
Wed, 22 Nov 2017 16:08:39 -0800 ccheung 8191653: Test failures in BootAppendTests - missing jdk.internal.vm.compiler module
Wed, 22 Nov 2017 17:57:27 +0100 simonis 8187280: Remove unused methods from StubQueue
Wed, 22 Nov 2017 14:31:48 -0500 ctornqvi 8191768: Introduce a concurrency factor to be able to scale up or down jtreg concurrency when running Hotspot tests
Wed, 22 Nov 2017 09:27:06 -0800 dlong 8191688: Assert failed in > 200 tests: failed dependencies, but counter didn't change
Wed, 22 Nov 2017 17:10:38 +0100 lucy 8189793: [s390]: Improve String compress/inflate by exploiting vector instructions
Wed, 22 Nov 2017 16:57:34 +0100 jwilhelm Merge
Thu, 16 Nov 2017 14:06:44 -0500 aharlap 8187819: gc/TestFullGCALot.java fails on jdk10 started with "-XX:-UseCompressedOops" option
Mon, 13 Nov 2017 15:28:17 +0100 lkorinth 8190408: Run G1CMRemarkTask with the appropriate amount of threads instead of starting up everyone
Wed, 22 Nov 2017 14:53:20 +0100 ihse 8191202: Remove duplicated jmm.h
Wed, 22 Nov 2017 14:43:37 +0300 rlupusoru 8190800: Support vectorization of Math.sqrt() on floats
Wed, 22 Nov 2017 01:12:23 -0800 iveresov 8191683: Compile problem on ARM after JDK-8043070
Wed, 06 Dec 2017 15:14:13 -0800 ksrini 8192933: Wrong generic type parameter in serialized form javadoc
Wed, 06 Dec 2017 14:39:15 -0800 bpb 8191706: Add Reader::transferTo(Writer)
Wed, 06 Dec 2017 11:43:50 -0800 ksrini 8191078: Wrong "Package not found" warning
Wed, 06 Dec 2017 19:17:07 +0000 chegar Merge
Wed, 06 Dec 2017 11:11:59 -0800 chegar 8191494: Refresh incubating HTTP Client
Wed, 06 Dec 2017 13:36:34 -0500 vromero 8192885: Compiler in JDK 10-ea+33 misses to include entry in LineNumberTable for goto instruction of foreach loopjdk-10+35
Fri, 03 Nov 2017 10:01:08 -0700 psandoz 8188870: Bump classfile version number to 54
Wed, 06 Dec 2017 14:33:33 +0000 coffeys 8185855: Debug exception stacks should be clearer
Wed, 06 Dec 2017 13:47:35 +0100 ihse 8193060: Set MAKE env variable in jib profile for gnumake
Wed, 06 Dec 2017 13:45:46 +0100 ihse 8193061: Add run-test-prebuilt functionality
Wed, 06 Dec 2017 02:09:08 -0800 sspitsyn 8182413: jdwp-protocol is generated without a DOCTYPE directive
Wed, 06 Dec 2017 08:36:09 +0000 alanb 8182742: ClassLoader.getResourceXXX throws NPE when ClassLoader created by defineModulesWithXXX
Wed, 06 Dec 2017 08:33:04 +0000 alanb 8186736: Spec clarifications for IllegalArgumentException throwing - ModuleLayer.defineX methods
Wed, 06 Dec 2017 08:28:46 +0000 alanb 8192973: Adding "Module Resolution" to javadoc search index
Wed, 06 Dec 2017 12:05:46 +0530 akolarkunnu 8192958: TEST.groups, group jdk_util_other:file not found: jdk/internal/uti
Wed, 06 Dec 2017 11:21:04 +0530 nishjain 8187551: MessageFormat.setFormat(int, Format) AIOOBE not thrown when documented
Wed, 06 Dec 2017 08:04:35 +0530 sundar 8185130: jlink should throw error if target image and current JDK versions don't match
Tue, 05 Dec 2017 18:33:05 -0800 mikael Initial musl support (ported from old repository layout)
Tue, 05 Dec 2017 15:31:50 -0800 psandoz 8015667: Stream.toArray(IntFunction) ArrayStoreException should refer to component type of array
Tue, 05 Dec 2017 23:14:35 +0100 erikj 8192771: Boot JDK jar tool used to construct the modular JAR for java.jnlp
Tue, 05 Dec 2017 23:11:27 +0100 erikj 8191439: Race in building jdk.rmic.interim
Tue, 05 Dec 2017 22:26:17 +0100 redestad 8193064: JarFile::getEntry0 method reference use cause for startup regression
Tue, 05 Dec 2017 09:44:32 -0800 bchristi 8187222: ClassLoader.getSystemClassLoader not clear if recursive initialization leads to ISE or unspecified error
Tue, 05 Dec 2017 14:25:16 +0100 redestad 8176188: jdk/internal/misc/JavaLangAccess/NewUnsafeString.java failing since 9-b93
Tue, 05 Dec 2017 14:10:11 +0100 ihse 8193055: ADD_JVM_ARG_IF_OK always fails
Tue, 21 Nov 2017 17:39:04 +0100 goetz 8191678: [TESTBUG] Add keyword headful in java/awt and javax tests.
Tue, 05 Dec 2017 17:19:48 +0800 weijun 8190674: sun/security/tools/jarsigner/TimestampCheck.java failed with java.nio.file.NoSuchFileException: ts2.cert
Mon, 04 Dec 2017 22:31:13 +0100 ihse 8193014: Add "special" tests to run-test to cover odd cases
Mon, 04 Dec 2017 10:04:51 -0800 ksrini 8184683: Add @since and default methods of Compiler Tree API methods
Mon, 04 Dec 2017 11:50:04 -0800 smarks 8177290: add copy factory methods for unmodifiable List, Set, Map
Mon, 04 Dec 2017 19:49:01 +0100 ihse 8192995: run-test gtest should use all jvm variants, not just "server"
Mon, 04 Dec 2017 19:12:57 +0100 ihse 8146977: Move the output "Building configuration X (matching Y)" to lower log level
Mon, 04 Dec 2017 19:10:15 +0100 ihse 8175795: configure should verify that system zlib contains needed functionality
Mon, 04 Dec 2017 19:08:56 +0100 ihse 8192854: FONTCONFIG_CFLAGS missing from spec.gmk.in
Mon, 04 Dec 2017 17:54:49 +0000 mcimadamore 8189749: Devise strategy for making source level checks more uniform
Mon, 04 Dec 2017 10:13:58 +0100 clanger 8192961: Remove some double semicolons
Mon, 04 Dec 2017 09:59:33 +0100 njian 8191955: AArch64: incorrect prefetch distance causes an internal error
Mon, 04 Dec 2017 13:24:00 +0530 vtewari 8190843: can not set/get extendedOptions to ServerSocket
Sun, 03 Dec 2017 01:47:23 -0800 igerasim 8187985: Broken certificate number in debug output
Sat, 02 Dec 2017 18:37:45 -0800 igerasim 8187497: Redundant variable assignment in Java_sun_security_jgss_wrapper_GSSLibStub_getMic
Sat, 02 Dec 2017 10:13:18 -0800 dl 8191069: Miscellaneous changes imported from jsr166 CVS 2017-12
Sat, 02 Dec 2017 10:08:55 -0800 dl 8187947: A race condition in SubmissionPublisher
Sat, 02 Dec 2017 10:03:41 -0800 dl 8191937: Lost interrupt in AbstractQueuedSynchronizer when tryAcquire methods throw
Fri, 01 Dec 2017 22:04:03 -0800 sherman 8191918: tomcat gzip-compressed response bodies appear to be broken in update 151
Fri, 01 Dec 2017 17:06:09 -0800 psandoz 8186961: Class.getFields() does not return fields of previously visited super interfaces/classes.
Fri, 01 Dec 2017 16:58:11 -0800 jjg 8034252: Fix non ASCII text file T6302184.java
Fri, 01 Dec 2017 21:52:54 +0100 ihse 8192816: Let run-test save exit code
Fri, 01 Dec 2017 10:02:25 -0800 joehw 8191938: Fix lint warnings in JAXP repo: a few Deprecation warrnings and enable -Xlint:all
Fri, 01 Dec 2017 09:46:36 -0800 erikj 8192876: MacOS build fails intermittently after JDK-8139653
Fri, 01 Dec 2017 17:00:34 +0100 redestad 8192892: Improve JrtPath::getResolved fast-path test
Fri, 01 Dec 2017 05:27:44 +0000 lana Merge
Fri, 01 Dec 2017 05:26:38 +0000 lana Added tag jdk-10+34 for changeset 89deac44e515
Thu, 30 Nov 2017 19:58:20 -0800 mchung 8192879: jdk.internal.util.jar.VersionedStream is no longer needed
Thu, 30 Nov 2017 17:28:21 -0800 erikj 8190464: OpenJDK on macosx needs to bundle freetype
Thu, 30 Nov 2017 14:49:36 -0800 smarks 8160406: Collection.toArray() spec should be explicit about returning precisely an Object[]
Thu, 30 Nov 2017 16:38:31 -0500 rriggs 8189331: java/io/Serializable/maskSyntheticModifier/MaskSyntheticModifierTest.java failed incorrect serialVersionUID
Thu, 30 Nov 2017 13:29:50 -0800 erikj 8139653: Freetype bundled on macosx, but not correctly linked
Thu, 30 Nov 2017 11:19:14 -0800 sherman 8187910: Charset MS950_HKSCS not supported in JDK 9
Thu, 30 Nov 2017 18:07:41 +0000 aefimov 8186441: Change of behavior in the getMessage () method of the SOAPMessageContextImpl class
Thu, 30 Nov 2017 06:14:25 -0800 ksrini 8185985: Html files in doc-files directories should be wrapped with standard header and footer
Thu, 30 Nov 2017 04:43:09 -0800 ksrini 8190552: Augment the Compiler API tree with APIs to represent HTML content
Thu, 30 Nov 2017 07:54:28 -0500 mullan 8186535: Remove deprecated pre-1.2 SecurityManager methods and fields
Thu, 30 Nov 2017 13:31:30 +0530 nishjain 6354947: [Fmt-*] Clarify DecimalFormat description of FieldPosition usejdk-10+34
Fri, 24 Nov 2017 14:07:59 +0100 dholmes 8191707: Options with invalid values are incorrectly treated as obsolete and ignored
Wed, 22 Nov 2017 09:27:06 -0800 dlong 8191688: Assert failed in > 200 tests: failed dependencies, but counter didn't change
Wed, 22 Nov 2017 16:08:39 -0800 ccheung 8191653: Test failures in BootAppendTests - missing jdk.internal.vm.compiler module
Sun, 26 Nov 2017 09:05:13 -0800 rraghavan 8191313: compiler/runtime/SpreadNullArg.java fails in tier1
Sat, 25 Nov 2017 04:36:43 +0100 jwilhelm Merge
Tue, 21 Nov 2017 21:33:53 -0500 coleenp Merge
Tue, 21 Nov 2017 15:24:38 +0100 glaubitz 8191663: Zero variant broken after 8189170 and 8189871
Tue, 21 Nov 2017 15:45:33 -0800 ccheung 8191739: [TESTBUG] test/hotspot/jtreg/runtime/LoadClass/TestResize.java fails to compile after JDK-8191580
Tue, 21 Nov 2017 16:27:01 -0500 ecaspole 8191615: LogCompilation can show bytes
Tue, 21 Nov 2017 09:49:52 -0800 ccheung 8188122: Path length limits on Windows leads to obscure class loading failures
Tue, 21 Nov 2017 09:20:56 -0800 iklam 8191042: Deprecate VM option CheckEndorsedAndExtDirs
Tue, 21 Nov 2017 09:04:42 -0800 dlong 8190817: deopt special-case for _return_register_finalizer is confusing and leads to bugs
Tue, 21 Nov 2017 10:21:24 -0600 gziemski 8191580: open/test/hotspot/jtreg/runtime/LoadClass/TestResize fails on product build
Tue, 21 Nov 2017 12:48:17 +0100 rkennke 8191562: Missing include in gcArguments.cpp breaks minimal JVM build
Tue, 21 Nov 2017 15:02:17 +0100 ihse 8191203: Remove duplicated jimage.hpp
Tue, 21 Nov 2017 08:33:54 +0100 ehelin 8182284: G1Analytics uses uninitialized fields
Tue, 21 Nov 2017 09:44:50 +0100 ihse 8190418: Stop generating jvmtiEnvStub and jvmtiEnvRecommended
Tue, 21 Nov 2017 11:27:46 +0530 sballal 8191401: [TESTBUG] serviceability/sa/ClhsdbFlags.java can fail due to UseJVMCICompiler
Mon, 20 Nov 2017 19:00:22 -0800 iveresov 8043070: nmethod::verify_interrupt_point() shouldn't enter safepoint
Mon, 20 Nov 2017 17:10:02 -0500 dholmes Merge
Mon, 20 Nov 2017 15:56:32 -0500 dholmes 8189170: Add option to disable stack overflow checking in primordial thread for use with JNI_CreateJavaJVM
Mon, 20 Nov 2017 14:02:10 -0800 epavlova 8190975: [Graal] Tests which run with "--limit-modules java.base" could fail when Graal is used as JIT
Mon, 20 Nov 2017 09:46:55 +0000 smonteith 8191338: aarch64: fails to build after 8189745
Mon, 20 Nov 2017 09:50:27 +0100 neliasso 8160548: Inconsistent inlining behavior with CompileOnly
Wed, 11 Oct 2017 11:24:59 +0200 neliasso 8169766: c1 + Xcomp reresolving call target every invocation
Wed, 11 Oct 2017 11:22:21 +0200 neliasso 8160303: parse_method_pattern only scans 254 chars
Mon, 20 Nov 2017 09:50:23 +0100 neliasso 8065838: compiler/relocations/TestPrintRelocations.java times out after 1920 seconds
Mon, 20 Nov 2017 13:07:44 +0100 eosterlund 8189871: Refactor GC barriers to use declarative semantics
Mon, 20 Nov 2017 12:04:13 +0100 tschatzl Merge
Mon, 20 Nov 2017 10:15:34 +0100 tschatzl 8186480: Remove warning when AssumeMP is true and ergonomics determines to use one worker thread
Mon, 20 Nov 2017 10:10:58 +0100 rehn 8191373: Multiple NUMA nodes expected
Mon, 20 Nov 2017 09:40:42 +0100 rehn 8191329: Deprecate DeferPollingPageLoopCount
Mon, 20 Nov 2017 09:35:31 +0100 rehn 8191327: Deprecate DeferThrSuspendLoopCount
Mon, 20 Nov 2017 09:33:16 +0100 rehn 8191326: Deprecate SafepointSpinBeforeYield
Sun, 19 Nov 2017 23:30:41 -0500 jiangli 8187118: Remove appending -cp path to the boot class path at AppCDS dump time