log

age author description
Tue, 24 Jun 2014 02:19:59 -0700 poonam 8046282: SA update
Mon, 23 Jun 2014 14:51:10 -0700 ctornqvi 8047878: [TESTBUG] runtime/memory/ReadFromNoaccessArea.java and runtime/memory/ReserveMemory.java time out on Solaris
Mon, 23 Jun 2014 06:58:26 -0700 fparain 8043630: Method os::yield_all() should be removed
Sun, 22 Jun 2014 21:23:32 -0400 dholmes 8044818: [TESTBUG] runtime/CDSCompressedKPtrs/XShareAuto.java fails with RuntimeException 'sharing' found in stderr
Wed, 18 Jun 2014 12:35:32 -0700 mikael 8046471: Use OPENJDK_TARGET_CPU_ARCH instead of legacy value for hotspot ARCH
Fri, 20 Jun 2014 20:37:57 +0000 dcubed Merge
Fri, 20 Jun 2014 12:45:24 -0700 dcubed Merge
Fri, 20 Jun 2014 11:19:22 -0700 mikael 8046611: Build errors with gcc on sparc/fastdebug
Fri, 20 Jun 2014 10:12:02 -0700 gtriantafill 8038074: [TESTBUG] Add test for anewarray instruction with more than 255 dimensions
Thu, 19 Jun 2014 14:49:33 -0400 coleenp 6642881: Improve performance of Class.getClassLoader()
Thu, 19 Jun 2014 11:16:10 -0400 coleenp 8026977: NPG: Remove ConstantPool::lock
Thu, 10 Jul 2014 12:13:09 -0700 katleman Added tag jdk9-b22 for changeset 518d1fcc0799
Wed, 09 Jul 2014 10:42:04 -0700 lana Mergejdk9-b22
Tue, 01 Jul 2014 14:26:52 -0700 lana Merge
Fri, 20 Jun 2014 11:10:18 -0700 amurillo Merge
Thu, 19 Jun 2014 12:50:52 -0700 twisti Merge
Mon, 16 Jun 2014 16:27:41 -0700 mikael 8046769: Set T family feature bit on Niagara systems
Mon, 16 Jun 2014 15:12:24 +0400 iignatyev 8044742: testlibrary_tests/whitebox/vm_flags/BooleanTest.java NoClassDefFoundError: com/oracle/java/testlibrary/JDKToolFinder
Thu, 19 Jun 2014 09:44:12 -0700 jmasa Merge
Wed, 18 Jun 2014 12:39:57 -0700 jmasa Merge
Wed, 18 Jun 2014 13:02:33 +0000 jwilhelm Merge
Thu, 12 Jun 2014 20:15:51 +0200 jwilhelm 8046715: Add a way to verify an extended set of command line options
Wed, 18 Jun 2014 13:25:40 +0200 tschatzl 8043722: Swapped usage of idx_t and bm_word_t types in parMarkBitMap.cpp
Fri, 13 Jun 2014 17:07:39 -0400 jwilhelm 8046408: Build failure from multiple ptrace.h
Fri, 13 Jun 2014 19:05:56 -0700 amurillo Merge
Fri, 13 Jun 2014 13:46:06 +0200 pliden 8044796: G1: Enable G1CollectedHeap::stop()
Wed, 18 Jun 2014 14:21:28 -0700 dcubed 8047156: cleanup more non-indent white space issues prior to Contended Locking cleanup bucket
Wed, 18 Jun 2014 12:21:39 -0700 iveresov Merge
Wed, 18 Jun 2014 10:54:32 -0700 iveresov 8046684: sharedRuntime.cpp...assert(((nmethod*)cb)->is_at_poll_or_poll_return(pc)) failed: safepoint polling: type must be poll
Wed, 18 Jun 2014 13:58:13 -0400 coleenp 8039150: host_klass invariant fails when verifying newly loaded JSR-292 anonymous classes
Tue, 17 Jun 2014 11:18:10 -0700 ddehaven 8043340: [macosx] Fix hard-wired paths to JavaVM.framework
Tue, 17 Jun 2014 12:54:01 -0700 dcubed 8046758: cleanup non-indent white space issues prior to Contended Locking cleanup bucket
Fri, 13 Jun 2014 19:07:11 -0700 dcubed Merge
Fri, 13 Jun 2014 05:10:44 -0700 dsamersoff 8038392: Generating prelink cache breaks JAVA 'jinfo' utility normal behaviour
Thu, 12 Jun 2014 15:57:16 -0700 dcubed 8046287: [TESTBUG] runtime/Thread/TestThreadDumpMonitorContention.java failed error_cnt=12
Thu, 12 Jun 2014 13:37:53 -0400 lfoltan 6961433: Revisit need to disable Windows C++ compiler optimisation of sharedRuntimeTrig.cpp.
Thu, 12 Jun 2014 11:34:35 +0200 dsimms 8046662: Check JNI ReleaseStringChars / ReleaseStringUTFChars verify_guards test inverted
Wed, 11 Jun 2014 18:34:09 +0200 dsimms 8043224: -Xcheck:jni improvements to exception checking and excessive local refs
Wed, 11 Jun 2014 09:58:23 -0400 hseigel 8031819: Remove legacy jdk checks and code
Wed, 11 Jun 2014 12:09:12 +0200 dsimms 6311046: -Xcheck:jni should support checking of GetPrimitiveArrayCritical.
Tue, 10 Jun 2014 20:24:48 -0700 dcubed Merge
Tue, 10 Jun 2014 14:04:37 -0400 hseigel 8044738: Check attribute_length of EnclosingMethod attribute
Mon, 09 Jun 2014 11:03:09 +0200 sla 8044797: Building with clang gives: fatal error: file '...' has been modified since the precompiled header was built
Fri, 06 Jun 2014 14:46:42 +0200 ctornqvi 8043492: ad_x86_64_misc.obj : error LNK2011: precompiled object not linked in; image may not run
Wed, 04 Jun 2014 11:05:30 +0200 sla 8044107: Add Diagnostic Command to list all ClassLoaders
Mon, 02 Jun 2014 17:21:15 +0200 miauno 8044540: serviceability/sa/jmap-hashcode/Test8028623.java should be quarantined
Thu, 03 Jul 2014 11:36:49 -0700 katleman Added tag jdk9-b21 for changeset 17b4a5e831b3
Thu, 26 Jun 2014 12:51:26 -0700 katleman Added tag jdk9-b20 for changeset c1af79d122ecjdk9-b21
Fri, 20 Jun 2014 10:15:08 -0700 lana Mergejdk9-b20
Wed, 18 Jun 2014 10:56:06 -0700 lana Merge
Fri, 13 Jun 2014 12:04:33 -0700 amurillo Merge
Fri, 13 Jun 2014 10:21:30 -0700 kvn Merge
Thu, 12 Jun 2014 16:31:07 -0700 mduigou 8032045: Enable compiler and linker safety switches for debug builds
Thu, 12 Jun 2014 10:15:43 -0700 kvn 8046516: Segmentation fault in JVM (easily reproducible)
Wed, 11 Jun 2014 11:05:10 -0700 kvn 8035968: Leverage CPU Instructions to Improve SHA Performance on SPARC
Wed, 11 Jun 2014 09:16:19 +0200 thartmann 8044538: assert(which != imm_operand) failed: instruction is not a movq reg, imm64
Tue, 10 Jun 2014 20:53:23 +0000 iignatyev Merge
Tue, 10 Jun 2014 23:18:25 +0400 iignatyev 8044575: testlibrary_tests/whitebox/vm_flags/UintxTest.java failed: assert(!res || TypeEntriesAtCall::arguments_profiling_enabled()) failed: no profiling of arguments
Tue, 10 Jun 2014 12:57:50 -0700 kvn Merge
Tue, 10 Jun 2014 12:28:06 -0700 kvn 8035605: Expand functionality of PredictedIntrinsicGenerator
Mon, 09 Jun 2014 10:32:49 +0200 neliasso 8040244: compiler/whitebox/IsMethodCompilableTest.java fails
Tue, 10 Jun 2014 13:37:16 +0200 roland 8026796: Make replace_in_map() on parent maps generic
Tue, 10 Jun 2014 10:00:59 +0000 vlivanov 8033626: assert(ex_map->jvms()->same_calls_as(_exceptions->jvms())) failed: all collected exceptions must come from the same place
Tue, 10 Jun 2014 08:53:22 +0200 thartmann 8033145: Runtime1::arraycopy_count_address uses wrong _oop_arraycopy_cnt variable
Wed, 11 Jun 2014 18:56:01 +0400 iignatyev 8044673: Create jtreg groups to list GC specific tests
Tue, 10 Jun 2014 20:46:28 -0700 jmasa Merge
Fri, 02 May 2014 02:11:34 +0200 jwilhelm 8042298: Remove the names gen0 and gen1 from the GC code
Wed, 30 Apr 2014 02:41:00 +0200 jwilhelm 8026396: Remove information duplication in the collector policy
Mon, 09 Jun 2014 15:42:31 -0700 kvn 8046275: Fastdebug build failing on jdk9/hs/ control jobs after pulling some hs-comp changes
Mon, 09 Jun 2014 11:49:02 +0000 vlivanov 8046226: assert(_thread == Thread::current()) failed: thread must be current w/ -XX:+TraceDeoptimization -XX:+Verbose
Fri, 06 Jun 2014 13:31:55 -0700 amurillo Merge
Fri, 06 Jun 2014 11:37:23 -0700 kvn Merge
Thu, 05 Jun 2014 10:43:16 +0200 thartmann 8031389: On x86 C1 emits two relocations for polls
Thu, 22 May 2014 13:42:44 +0200 rbackman 8030976: Untaken paths should be more vigorously pruned at highest optimization level
Wed, 04 Jun 2014 10:01:28 +0200 rbackman 8031994: java/lang/Character/CheckProp test times out
Tue, 03 Jun 2014 18:24:38 -0700 mikael 8044735: Print format/argument warnings
Wed, 04 Jun 2014 00:25:21 +0400 iignatyev 8044339: Update FilterSpuriousWakeups documentation. Review "Solaris only" vm options descriptions
Mon, 02 Jun 2014 15:48:34 -0700 mikael 8044242: Remove dead NativeMovRegMemPatching class
Mon, 02 Jun 2014 13:53:52 -0700 twisti Merge
Mon, 02 Jun 2014 10:48:02 -0700 twisti Merge
Mon, 02 Jun 2014 15:49:53 -0400 drchase Merge
Mon, 02 Jun 2014 14:32:29 -0400 drchase 8029381: assert(is_method_type()) failed: bad cast
Mon, 02 Jun 2014 07:26:52 -1000 iveresov 8044496: 8034812 broke build with clang
Mon, 02 Jun 2014 10:01:15 +0200 roland 8043413: REGRESSION: Hotspot causes segmentation fault in jdk8ux, but not in jdk7ux
Mon, 02 Jun 2014 08:07:29 +0200 thartmann 8034812: remove IDX_INIT macro hack in Node class
Fri, 30 May 2014 20:01:11 +0000 iignatyev Merge
Fri, 30 May 2014 17:20:48 +0400 iignatyev 8038756: new WB API :: get/setVMFlag
Fri, 30 May 2014 19:21:42 +0000 anoll Merge
Fri, 30 May 2014 09:26:48 +0200 thartmann 8021775: compiler/8009761/Test8009761.java "Failed: init recursive calls: 51. After deopt 50"
Fri, 30 May 2014 09:49:50 -0700 twisti Merge
Thu, 29 May 2014 16:01:13 -0700 mikael 8044071: Print format/argument warnings
Fri, 30 May 2014 06:50:38 +0200 anoll 8011646: SEGV in compiled code with loop predication
Thu, 19 Jun 2014 11:22:25 -0700 katleman Added tag jdk9-b19 for changeset d4cffb3ae621
Wed, 18 Jun 2014 10:08:52 -0700 lana Mergejdk9-b19
Thu, 12 Jun 2014 19:03:25 -0700 lana Merge
Thu, 12 Jun 2014 15:36:49 -0700 lana Merge
Fri, 06 Jun 2014 10:19:50 -0700 amurillo Merge
Thu, 05 Jun 2014 10:34:57 -0700 jmasa Merge
Wed, 04 Jun 2014 14:16:20 +0200 pliden 8044768: Backout fix for JDK-8040807
Thu, 29 May 2014 14:31:28 +0200 ehelin 8042933: assert(capacity_until_gc >= committed_bytes) failed
Tue, 03 Jun 2014 09:34:04 +0000 brutisso Merge
Tue, 03 Jun 2014 10:44:36 +0200 brutisso 8043239: G1: Missing post barrier in processing of j.l.ref.Reference objects
Tue, 03 Jun 2014 10:37:46 +0200 pliden 8040807: G1: Enable G1CollectedHeap::stop()
Mon, 02 Jun 2014 06:29:34 -0700 jmasa Merge
Fri, 30 May 2014 10:43:51 +0200 pliden 8042310: TestStringDeduplicationMemoryUsage test failing
Fri, 30 May 2014 10:37:39 +0200 pliden 8044132: Quarantine unstable/broken GC tests
Mon, 02 Jun 2014 21:36:59 -0400 mseledtsov 8038587: [TESTBUG] Create CDS tests to exercise region sizes and base address
Tue, 03 Jun 2014 09:44:54 +0200 mgronlun 8044531: Event based tracing locks to rank as leafs where possible
Mon, 02 Jun 2014 18:15:18 +0000 ctornqvi Merge
Mon, 02 Jun 2014 19:08:18 +0200 ctornqvi 8044364: runtime/RedefineFinalizer test fails on windows
Mon, 02 Jun 2014 09:30:08 -0700 rdurbin 8038132: jprt bundles have libjsig.dylib in different place on OSX
Mon, 02 Jun 2014 11:20:14 +0200 ykantser 8043915: Tests get ClassNotFoundException: com.oracle.java.testlibrary.StreamPumper
Sun, 01 Jun 2014 11:56:15 -0400 coleenp Merge
Fri, 30 May 2014 19:13:07 +0200 sla 8044398: Attach code should propagate errors in Diagnostic Commands as errors
Fri, 30 May 2014 07:20:51 -0700 dcubed 8036823: Stack trace sometimes shows 'locked' instead of 'waiting to lock'
Thu, 29 May 2014 08:58:51 -0400 lfoltan 8041623: Solaris Studio 12.4 C++ 5.13, CHECK_UNHANDLED_OOPS use of class oop's copy constructor definitions causing error level diagnostic.
Wed, 28 May 2014 22:59:29 +0200 ctornqvi 8043786: [TESTBUG] runtime/CommandLine/TestHexArguments.java test fails in nightly
Wed, 28 May 2014 15:03:36 +0000 dsamersoff Merge
Wed, 28 May 2014 07:36:32 -0700 dsamersoff 6904403: assert(f == k->has_finalizer(),"inconsistent has_finalizer") with debug VM
Wed, 28 May 2014 06:26:05 -0700 poonam 8043086: Hotspot is expected to report OOM which is occurred String.intern(), but crashes in JDK8u5