log

age author description
Tue, 20 Dec 2016 19:52:52 -0800 dcubed Merge
Mon, 19 Dec 2016 15:48:57 -0800 goetz 8170655: [posix] Fix minimum stack size computations
Tue, 08 Nov 2016 16:30:36 +0100 goetz 8169373: Work around linux NPTL stack guard error.
Tue, 20 Dec 2016 20:42:15 -0500 dholmes 8171815: [TESTBUG] Update expected failure message in runtime/modules/IgnoreModulePropertiesTest.java
Tue, 20 Dec 2016 22:53:45 +0100 jwilhelm Merge
Tue, 20 Dec 2016 21:45:13 +0000 dholmes Merge
Tue, 20 Dec 2016 09:25:03 +0100 stuefe 8171408: [aix] TOC overflow when linking the gtest libjvm.so
Sun, 18 Dec 2016 10:57:49 +0100 stuefe 8171225: [aix] Fix gtests compile error on AIX 7.1 with xlC 12
Tue, 20 Dec 2016 11:50:40 -0800 ccheung 8171011: convert some CDS dump time warning and error messages to informational messages which will be printed with -XX:+PrintSharedSpaces
Tue, 20 Dec 2016 17:35:20 +0300 dpochepk 8170886: compiler/ciReplay/TestSAServer.java intermittently throws NumberFormatException
Tue, 20 Dec 2016 14:55:18 +0100 mdoerr 8171398: s390x: Make interpreter's math entries consistent with C1 and C2 and support FMA
Tue, 20 Dec 2016 13:02:16 +0000 dsamersoff Merge
Tue, 20 Dec 2016 15:40:01 +0300 dsamersoff 8165496: assert(_exception_caught == false) failed: _exception_caught is out of phase
Tue, 20 Dec 2016 12:16:41 +0000 dsamersoff Merge
Tue, 20 Dec 2016 11:19:36 +0000 dsamersoff Merge
Tue, 20 Dec 2016 14:15:02 +0300 dsamersoff 8150563: LoadAgentDcmdTest.java can't find libinstrument.so
Tue, 20 Dec 2016 11:32:47 +0000 dsamersoff Merge
Tue, 20 Dec 2016 10:53:52 +0000 dsamersoff Merge
Tue, 20 Dec 2016 13:35:40 +0300 dsamersoff 8159127: hprof heap dumps broken for lambda classdata
Tue, 20 Dec 2016 11:33:25 +0100 kzhaldyb Merge
Thu, 08 Dec 2016 15:56:57 +0300 kzhaldyb 8170919: LogStreamTest tests crash if they are run first
Thu, 01 Dec 2016 11:30:22 +0100 simonis 8170548: VM may crash at startup because StdoutLog/StderrLog logging stream can be badly aligned
Mon, 19 Dec 2016 16:26:22 +0100 erikj 8171310: Gtest libjvm.so is always stripped
Thu, 15 Dec 2016 14:24:04 +0100 mdoerr 8171244: PPC64: Make interpreter's math entries consistent with C1 and C2 and support FMA
Tue, 13 Dec 2016 17:45:13 +0300 bmoloden 8170464: Remove shell script from compiler/c2/cr7005594/Test7005594.java
Mon, 19 Dec 2016 18:21:59 -0800 gromero 8171236: RTM/HTM jtreg tests regression after transition to the new GNU-style options
Tue, 20 Dec 2016 01:05:39 +0000 dholmes Merge
Wed, 14 Dec 2016 16:46:50 -0500 drwhite 8171129: [aarch64] hs_err logs do not print register mappings
Mon, 19 Dec 2016 22:50:28 +0000 iveresov Merge
Mon, 19 Dec 2016 13:34:21 -0800 iveresov 8171394: [AOT] failed AOT compilation in compiler/aot/RecompilationTest.java
Mon, 19 Dec 2016 13:09:25 -0800 roland 8171092: C1's Math.fma() intrinsic doesn't correctly process its inputs
Mon, 19 Dec 2016 13:54:33 -0500 jiangli 8168797: do not load any archived classes from a patched module
Mon, 19 Dec 2016 15:21:11 +0000 jcm Merge
Mon, 19 Dec 2016 06:25:12 -0800 jcm 8170761: Buffer overrun in sharedRuntime_x86_64.cpp:477
Mon, 19 Dec 2016 14:12:33 +0000 coleenp Merge
Wed, 07 Dec 2016 13:37:37 +0100 sgehwolf 8170767: Zero fastdebug build triggers assertion
Mon, 19 Dec 2016 02:33:30 -0800 aph 8169177: AArch64: SIGSEGV when "-XX:+ZeroTLAB" is specified along with GC options
Mon, 19 Dec 2016 08:31:01 +0100 zmajo 8171155: Scanning method file for initialized final field updates can fail for non-existent fields
Mon, 19 Dec 2016 05:00:24 +0000 sspitsyn Merge
Sun, 18 Dec 2016 20:54:26 -0800 sspitsyn 8171417: post jigsaw review cleanup in the jtreg jvmti tests
Mon, 19 Dec 2016 04:04:48 +0000 sspitsyn Merge
Sun, 18 Dec 2016 19:21:18 -0800 sspitsyn 8139566: need proper sync for adding default read edges
Sun, 18 Dec 2016 22:07:31 -0500 dholmes 8170307: Stack size option -Xss is ignored
Tue, 13 Dec 2016 02:04:23 +0100 jwilhelm Merge
Thu, 22 Dec 2016 18:48:28 +0000 lana Merge
Wed, 21 Dec 2016 22:41:18 -0800 mchung 8171897: Remove third party readme files left from JDK-8169925
Tue, 20 Dec 2016 20:38:14 -0800 dlong 8169938: [AOT] SIGSEGV at ~BufferBlob::vtable chunks
Thu, 22 Dec 2016 08:26:01 +0000 lana Added tag jdk-9+150 for changeset 98fe046473c9
Mon, 19 Dec 2016 12:39:01 -0500 bobv 8168503: JEP 297: Unified arm32/arm64 Portjdk-9+150
Mon, 19 Dec 2016 00:49:34 +0100 jwilhelm Merge
Fri, 16 Dec 2016 01:46:00 -0800 kvn 8171276: More problems in compiler/aot/RecompilationTest.java tests
Wed, 14 Dec 2016 10:28:52 +0100 mdoerr 8170991: PPC64: Bad code for initialization of short arrays
Tue, 13 Dec 2016 17:58:19 -0800 kvn 8171187: Expected compilation level after compilation to be no less than 1
Tue, 13 Dec 2016 16:26:07 +0100 ihse 8171163: Merge 9de6a70d5d81 broke test/Makefile
Mon, 12 Dec 2016 21:56:45 -0800 kvn 8171137: Avoid warning: -Xint is not compatible with AOT (switching AOT off)
Mon, 12 Dec 2016 20:48:50 -0800 kvn 8171134: Unexpected output in compiler/aot/SharedUsageTest.java
Sun, 18 Dec 2016 15:37:50 +0100 jwilhelm Merge
Tue, 13 Dec 2016 02:04:23 +0100 jwilhelm Merge
Mon, 12 Dec 2016 15:41:50 -0500 dholmes 8170888: [linux] Experimental support for cgroup memory limits in container (ie Docker) environments
Mon, 12 Dec 2016 11:29:51 -0800 roland 8162338: AArch64: Intrinsify fused mac operations
Mon, 12 Dec 2016 21:18:54 +0300 dpochepk 8171059: [AOT] error in AotCompiler output in some aot tests
Mon, 12 Dec 2016 21:18:03 +0300 dpochepk 8171060: [AOT] aot tests: WARNING: Requested compilation levels are out of current vm capabilities.
Sun, 11 Dec 2016 19:07:04 -0800 kvn 8171008: Integrate AOT compiler into JDK
Sun, 11 Dec 2016 12:05:57 -0800 thomaswue 8166417: Integrate Graal-core into JDK for AOT compiler
Sat, 10 Dec 2016 03:08:23 +0100 jwilhelm 8171046: Quarantine TestStressG1Humongous.java until JDK-8171045 is fixed
Thu, 08 Dec 2016 17:03:45 +0100 jwilhelm Merge
Thu, 08 Dec 2016 15:49:29 +0100 jwilhelm Merge
Wed, 07 Dec 2016 23:45:31 +0000 sspitsyn Merge
Wed, 07 Dec 2016 15:10:18 -0800 sspitsyn 7034834: JVMTI xml file referring to old JDK version
Wed, 07 Dec 2016 23:38:37 +0100 mgronlun 8170847: Refactor trace/traceStream.hpp
Wed, 07 Dec 2016 09:29:28 -0800 kvn 8158012: Use SW prefetch instructions instead of BIS for allocation prefetches on SPARC Core S4
Tue, 06 Dec 2016 16:42:42 +0300 bmoloden 8166132: Convert TestGlobalDefinitions_test to GTest
Wed, 07 Dec 2016 14:37:35 +0300 iignatyev 8078450: Implement consistent process for quarantine of tests
Tue, 06 Dec 2016 22:49:17 +0100 mgronlun 8170672: Event-based tracing to support classloader instances
Sat, 03 Dec 2016 12:48:22 +0300 kzhaldyb 8170468: Convert ParallelCompact_test to GTest
Thu, 01 Dec 2016 12:09:02 +0300 kzhaldyb 8170490: Convert TestBufferingOopClosure_test to GTest
Mon, 05 Dec 2016 16:08:20 -0500 rprotacio 8169734: Update uses of string "java.base" to macro
Mon, 05 Dec 2016 18:00:34 +0000 rprotacio Merge
Mon, 05 Dec 2016 11:45:20 -0500 rprotacio 8168850: Mark module entries that have been specified by --patch-module
Mon, 05 Dec 2016 17:57:43 +0100 erikj 8066474: Remove the lib/ directory from Linux and Solaris images
Fri, 02 Dec 2016 11:07:27 +0100 simonis 8170409: CMS: Crash in CardTableModRefBSForCTRS::process_chunk_boundaries
Fri, 16 Dec 2016 08:18:00 +0000 alanb Merge
Fri, 16 Dec 2016 05:46:52 +0000 alanb 8170987: Module system implementation refresh (12/2016)
Wed, 14 Dec 2016 20:34:29 +0000 lana Merge
Wed, 14 Dec 2016 02:35:33 -0800 sspitsyn 8171226: simple typo in the JVMTI spec
Thu, 08 Dec 2016 15:49:29 +0100 jwilhelm Merge
Wed, 30 Nov 2016 22:44:51 +0100 kzhaldyb Merge
Wed, 30 Nov 2016 21:49:57 +0100 kzhaldyb Merge
Fri, 25 Nov 2016 20:53:36 +0300 kzhaldyb 8168341: Gtests on JSon produce an enormous amount of hardly understandable output to stdout
Wed, 30 Nov 2016 20:40:41 +0000 kvn Merge
Wed, 30 Nov 2016 12:07:17 -0800 roland 8170470: superword may miss reductions
Wed, 23 Nov 2016 14:36:32 +0100 stefank 8170358: [REDO] 8k class metaspace chunks misallocated from 4k chunk freelist
Mon, 28 Nov 2016 14:57:12 +0100 ehelin 8170388: Deprecate the flag -XX:ExplicitGCInvokesConcurrentAndUnloadsClasses
Fri, 25 Nov 2016 11:15:12 -0200 mdoerr 8170328: PPC64: Use andis instead of lis/and
Tue, 29 Nov 2016 17:41:08 -0800 vdeshpande 8170430: x86 pow() stub from Intel libm is inconsistent with pow() from fdlib
Tue, 29 Nov 2016 12:40:46 -0800 kvn 8170416: CompilerControl: VectorizeDebug option type is incorrect
Tue, 29 Nov 2016 19:20:03 +0000 stefank Merge
Tue, 29 Nov 2016 19:25:36 +0100 stefank 8170395: Metaspace initialization queries the wrong chunk freelist
Tue, 29 Nov 2016 11:26:25 -0500 jiangli 8170297: runtime/SharedArchiveFile/LargeSharedSpace.java didn't run out of memory
Mon, 28 Nov 2016 18:54:30 +0300 kzhaldyb 8166156: Convert test_semaphore to GTest
Fri, 25 Nov 2016 20:00:51 +0300 kzhaldyb 8169003: LogDecorations.iso8601_utctime_test fails if numeric locale uses "," as separator between integer and fraction part
Tue, 29 Nov 2016 08:48:14 +0100 thartmann Merge
Tue, 29 Nov 2016 08:16:15 +0100 thartmann 8168996: C2 crash at postaloc.cpp:140 : assert(false) failed: unexpected yanked node
Tue, 29 Nov 2016 06:20:56 +0000 dbuck 8170431: non-ASCII characters in source code comments (jimage.hpp)
Sun, 27 Nov 2016 19:58:30 -0800 iklam 8169867: Method::restore_unshareable_info does not invoke Method::link_method
Tue, 29 Nov 2016 00:25:13 +0300 iignatyev 8170227: use vm.jvmci property in compiler/jvmci tests
Tue, 29 Nov 2016 00:25:09 +0300 iignatyev 8170226: Implement setting jtreg @requires property vm.jvmci
Tue, 22 Nov 2016 08:46:49 -0800 aph 8170106: AArch64: Multiple JVMCI issues
Fri, 25 Nov 2016 17:56:30 +0000 iignatyev Merge
Fri, 25 Nov 2016 11:59:40 +0300 iignatyev 8170228: register closed @requires property setter
Fri, 25 Nov 2016 15:58:24 +0100 jwilhelm 8170355: [BACKOUT] 8k class metaspace chunks misallocated from 4k chunk freelist
Thu, 24 Nov 2016 16:07:53 +0100 erikj Merge
Thu, 24 Nov 2016 15:27:53 +0100 erikj 8170284: Move fine granular hotspot make targets to top level
Thu, 24 Nov 2016 16:52:34 +0300 lmesnik 8166761: Compiler testing in tier2 should be optimized to finish in 20 minutes.
Thu, 24 Nov 2016 16:48:22 +0300 lmesnik 8166898: G1SATBCardTableLoggingModRefBS::invalidate() incorrect with whole_heap == true
Thu, 24 Nov 2016 11:27:57 +0100 tschatzl 8057003: Large reference arrays cause extremely long synchronization times
Thu, 24 Nov 2016 09:33:54 +0000 tschatzl Merge
Thu, 24 Nov 2016 10:05:47 +0100 tschatzl 8169703: G1 crashes with guarantee(pretouch_gang != NULL) failed: No pretouch gang specified
Wed, 23 Nov 2016 14:36:32 +0100 stefank 8169931: 8k class metaspace chunks misallocated from 4k chunk freelist?
Wed, 23 Nov 2016 14:33:45 +0100 stuefe 8167650: NMT should check for invalid MEMFLAGS
Wed, 23 Nov 2016 12:01:57 +0300 kzhaldyb 8168492: Convert CollectedHeap_test to GTest
Tue, 01 Nov 2016 16:23:29 +0300 kzhaldyb 8168493: Convert TestBitMap_test to GTest
Wed, 23 Nov 2016 12:08:37 +0530 vtewari 8169232: SA: TestCpoolForInvokeDynamic.java fails with sun.jvm.hotspot.debugger.DebuggerException: binary search bug: should have found entry 1
Tue, 22 Nov 2016 20:50:31 -0500 kbarrett 8166811: Missing memory fences between memory allocation and refinement
Tue, 22 Nov 2016 20:24:47 -0500 kbarrett 8166607: G1 needs klass_or_null_acquire
Tue, 22 Nov 2016 13:59:45 -0800 vdeshpande 8165287: fix compress intrinsics to produce correct results with avx512
Tue, 22 Nov 2016 11:34:11 -0800 mcberg 8170039: Change UseAVX < 3 on SKX/KNL to not emit evex vector check
Tue, 22 Nov 2016 16:13:13 +0300 mchernov 8168396: Unexpected OOME in GcCauseTest02 and GcTest02
Mon, 21 Nov 2016 21:07:45 -0500 jiangli 8169870: CDS: "assert(partition_size <= size()) failed: partition failed" on 32 bit JVM
Mon, 21 Nov 2016 17:38:13 +0000 aph 8170100: AArch64: Crash in C1-compiled code accessing References
Mon, 21 Nov 2016 17:29:17 +0000 aph 8170098: AArch64: VM is extremely slow with JVMTI debugging enabled
Mon, 21 Nov 2016 09:33:06 +0100 thartmann 8169941: CodeBlob::is_frame_complete_at() does not honor CodeOffsets::frame_never_safe
Mon, 21 Nov 2016 08:27:10 +0100 thartmann 8169711: CDS does not patch entry trampoline if intrinsic method is disabled
Fri, 18 Nov 2016 19:04:48 +0000 rkennke 8169901: AArch64: CompareAndExchange intrinsics clobber address register
Fri, 18 Nov 2016 18:46:08 +0300 mchernov 8166719: gc/stress/TestStressG1Humongous.java fails with OOME
Fri, 18 Nov 2016 03:40:56 -0800 rraghavan 8169529: AArch64: Revert old JDK-8167595 changes after JDK-8159035 fix is pushed
Thu, 17 Nov 2016 21:59:52 +0000 rprotacio Merge
Thu, 17 Nov 2016 16:28:45 -0500 rprotacio 8165550: Add class loader names to ClassCastException message
Thu, 17 Nov 2016 14:23:29 -0500 hseigel 8166304: Skipping access check for classes generated by core reflection
Thu, 17 Nov 2016 15:54:48 +0300 dsamersoff 8169638: serviceability/sa/TestInstanceKlassSize.java and serviceability/sa/TestInstanceKlassSizeForInterface.java fail compilation
Wed, 16 Nov 2016 18:57:42 +0300 mchernov 8165955: TestFullGCCount test failed with CMS and -XX:+ExplicitGCInvokesConcurrent
Wed, 16 Nov 2016 14:11:30 +0300 dsamersoff 7107013: sun.jvm.hotspot.runtime.Bytes.swapLong conversion to long mishandled
Tue, 15 Nov 2016 19:39:51 -0500 kbarrett 8169423: Infinite loop in G1's ConcurrentMarkThread
Tue, 15 Nov 2016 08:34:56 -0500 hseigel 8169551: Segfaults in error traces when module version is null
Tue, 15 Nov 2016 15:30:03 +0300 mchernov Merge
Tue, 15 Nov 2016 14:04:39 +0300 mchernov 8168934: [TESTBUG] gc/g1/logging/TestG1LoggingFailure.java failed
Mon, 14 Nov 2016 19:24:14 -0500 jiangli Merge
Mon, 14 Nov 2016 18:03:44 -0500 jiangli 8168790: CDS: assert(max_delta <= (0x7FFFFFFF)) failed: range check.
Mon, 14 Nov 2016 19:21:18 +0000 ccheung Merge
Mon, 14 Nov 2016 10:42:13 -0800 ccheung 8168796: relax vm options checking during CDS dump time
Mon, 14 Nov 2016 10:10:10 -0800 kvn 8169261: Fix for JDK-8067744 creates build failures with some versions of gcc and/or linux
Fri, 11 Nov 2016 16:52:44 +0100 jwilhelm 8169597: Quarantine TestCpoolForInvokeDynamic.java until JDK-8169232 is solved
Fri, 11 Nov 2016 16:44:36 +0100 jwilhelm Merge
Mon, 14 Nov 2016 11:15:43 +0100 simonis 8169625: Libjsig build doesn't set flags for ppc64/s390 builds
Fri, 11 Nov 2016 12:27:22 +0100 ehelin Merge
Mon, 07 Nov 2016 10:38:42 +0100 ehelin 8167679: G1 phase logging is messy
Mon, 07 Nov 2016 12:37:28 +0100 goetz 8169317: [s390] Various minor bug fixes and adaptions.
Thu, 10 Nov 2016 23:26:56 -0800 rraghavan 8169201: Montgomery multiply intrinsic should use correct name
Thu, 10 Nov 2016 13:08:02 -0800 never 8169554: [JVMCI] expose missing StubRoutines for intrinsics
Thu, 10 Nov 2016 18:08:31 +0100 neliasso 8167656: Unstable MethodHandle inlining causing huge performance variations
Wed, 09 Nov 2016 10:21:56 -0800 kvn 8167067: Fix x86 SHA instructions to be non Vex encoded
Fri, 07 Oct 2016 15:59:38 +0200 roland 8169497: Aarch64: Improve internal array handling
Wed, 09 Nov 2016 08:45:51 +0000 dsamersoff Merge
Wed, 09 Nov 2016 10:56:32 +0300 dsamersoff 8169344: Potential open file descriptor in exists() of hotspot/agent/src/os/bsd/ps_core.c
Wed, 09 Nov 2016 13:38:52 +0530 vtewari 7107014: sun.jvm.hotspot.HSDB.FindObjectByTypeCleanupThunk.showConsole.attach infinite loop
Wed, 09 Nov 2016 09:30:27 +0300 dsamersoff 7107018: sun.jvm.hotspot.utilities.soql.JSJavaHeap.forEachClass incorrect test
Mon, 07 Nov 2016 17:02:46 +0100 dnsimon 8169331: [JVMCI] incomplete API to MethodParameters attribute
Fri, 28 Oct 2016 15:50:09 +0200 ehelin 8168904: Initialize and reset G1 phase times to zero
Tue, 01 Nov 2016 14:22:38 +0100 neliasso 8160543: C1: Crash in java.lang.String.indexOf in some java.sql tests
Mon, 31 Oct 2016 11:36:45 +0100 goetz 8166837: [TESTBUG] Fix tests on Linux/s390x
Mon, 07 Nov 2016 10:12:14 +0100 erikj 8169255: Link gtestLauncher statically if libjvm is configured for static linking
Tue, 13 Dec 2016 12:36:13 -0800 bchristi 8169389: Use a bitmap to control StackTraceElement::toString format and save footprint
Wed, 14 Dec 2016 20:23:23 +0000 lana Added tag jdk-9+149 for changeset 30e1996bd55d
Thu, 08 Dec 2016 21:21:56 +0000 lana Mergejdk-9+149
Wed, 07 Dec 2016 16:08:23 +0100 erikj 8141590: Cannot build Zero with devkit
Wed, 07 Dec 2016 09:48:57 +0100 ihse 8170629: Remove code duplication in test makefiles
Thu, 08 Dec 2016 18:03:34 +0000 lana Added tag jdk-9+148 for changeset 5e4e893520ec
Thu, 01 Dec 2016 21:40:08 +0000 lana Mergejdk-9+148
Thu, 01 Dec 2016 15:54:39 +0000 alanb 8170599: compiler/** tests using ToolProvider.getSystemClassLoader failing
Thu, 01 Dec 2016 11:16:11 +0000 alanb Merge
Thu, 01 Dec 2016 08:56:41 +0000 alanb 8169069: Module system implementation refresh (11/2016)
Mon, 28 Nov 2016 09:20:13 +0100 ihse 8031567: Better model for storing source revision information
Thu, 01 Dec 2016 21:01:52 +0000 lana Added tag jdk-9+147 for changeset 132a72c78207
Wed, 23 Nov 2016 19:15:01 +0000 lana Mergejdk-9+147
Tue, 22 Nov 2016 15:04:19 +0100 ihse 8170184: Remove incorrect comments about generated jvmt.h
Tue, 22 Nov 2016 14:48:16 +0100 ihse 8168037: Use ZIPEXE instead of ZIP to avoid clash with options for zip
Thu, 17 Nov 2016 22:19:25 +0000 lana Merge
Wed, 23 Nov 2016 16:16:34 +0000 lana Added tag jdk-9+146 for changeset a82cb5350cad
Mon, 21 Nov 2016 18:47:57 +0000 lana Mergejdk-9+146
Fri, 11 Nov 2016 16:52:44 +0100 jwilhelm 8169597: Quarantine TestCpoolForInvokeDynamic.java until JDK-8169232 is solved
Fri, 11 Nov 2016 16:44:36 +0100 jwilhelm Merge
Thu, 03 Nov 2016 10:44:17 -0400 bobv 8167501: ARMv7 Linux C2 compiler crashes running jtreg harness on MP systems
Thu, 03 Nov 2016 11:53:20 +0530 vtewari 8164783: SA: jhsdb clhsdb 'printall' often throws "Corrupted constant pool" assertion failure
Thu, 06 Oct 2016 18:51:24 +0200 simonis 8159611: C2: ArrayCopy elimination skips required parameter checks
Tue, 01 Nov 2016 09:19:14 +0100 zmajo 8167578: C1: compiler.escapeAnalysis.TestArrayCopy fails to throw ArrayStoreException
Mon, 31 Oct 2016 17:36:39 +0000 mchernov Merge
Mon, 31 Oct 2016 18:18:05 +0300 mchernov 8168535: Quarantine GcCauseTest02 and GcTest02
Wed, 19 Oct 2016 11:08:03 +0200 goetz 8168283: adlc: fix error expanding expanded nodes.
Mon, 10 Oct 2016 17:04:42 +0200 roland 8167300: Scheduling failures during gcm should be fatal
Thu, 13 Oct 2016 12:27:39 +0200 roland 8167298: assert(tp->base() != Type::AnyPtr) crash with Unsafe.compareAndExchangeObject*
Sat, 29 Oct 2016 01:09:42 +0200 dnsimon 8168915: [JVMCI] use MethodParameters attribute instead of depending on -g option for sanity checks
Mon, 31 Oct 2016 09:50:12 +0100 thartmann 8168770: Fix for 8151988 causes performance regression on SPARC
Fri, 28 Oct 2016 19:33:22 +0000 kvn Merge
Fri, 28 Oct 2016 12:28:46 -0700 kvn 8067744: XMM/SSE float register values corrupted by JNI_CreateVM call in JRE 8 (Windows)
Fri, 28 Oct 2016 08:40:35 +0200 sla 8168305: GC.class_stats should not require -XX:+UnlockDiagnosticVMOptions
Fri, 14 Oct 2016 14:47:01 -0700 psandoz 8166974: invokedynamic implementation should not wrap Errors
Thu, 27 Oct 2016 09:42:45 -0500 gziemski 8166145: runtime/threads/ThreadInterruptTest3 fails with ExitCode 0
Thu, 27 Oct 2016 12:22:28 +0200 goetz 8168318: PPC64: Use cmpldi instead of li/cmpld
Thu, 27 Oct 2016 12:18:36 +0200 mgronlun Merge
Thu, 27 Oct 2016 11:20:37 +0200 mgronlun Merge
Thu, 27 Oct 2016 11:14:30 +0200 mgronlun 8168662: Intrinsic support for event based tracing needs explicit control dependency
Thu, 27 Oct 2016 11:41:53 +0200 mdoerr 8168083: PPC64: Cleanup template interpreter after 8154580 and 8154867
Fri, 21 Oct 2016 10:14:54 +0200 mlarsson 8146009: "pure virtual method called" with using new GC logging mechanism
Fri, 21 Oct 2016 10:18:11 +0200 mlarsson 8166117: Add UTC timestamp decorator for UL
Thu, 13 Oct 2016 14:49:34 +0200 goetz 8167673: [s390] The s390 port.
Wed, 05 Oct 2016 15:20:35 +0200 goetz 8167184: [s390] Extend relocations for pc-relative instructions.
Thu, 22 Sep 2016 18:29:15 +0200 goetz 8166561: [s390] Adaptions needed for s390 port in C1 and C2.
Thu, 22 Sep 2016 18:23:15 +0200 goetz 8166560: [s390] Basic enablement of s390 port.
Tue, 25 Oct 2016 16:42:28 +0200 simonis 8168490: Use the LL/ULL suffixes to define 64-bit integer literals on Windows
Wed, 26 Oct 2016 20:13:29 +0000 rprotacio Merge
Wed, 26 Oct 2016 15:46:13 -0400 rprotacio 8167995: -Xlog:defaultmethods=debug: lengthy method descriptor triggers "StringStream is re-allocated with a different ResourceMark"
Wed, 26 Oct 2016 17:29:47 +0300 bmoloden 8165451: Convert WorkerDataArray_test to GTest
Wed, 26 Oct 2016 14:36:05 +0200 thartmann 8164612: NoSuchMethodException when method name contains NULL or Latin-1 supplement character
Mon, 23 May 2016 19:46:43 +0200 jwilhelm 8157455: Convert TestOS_test to GTest
Fri, 20 May 2016 16:45:00 +0200 jwilhelm 8157453: Convert DependencyContext_test to GTest
Wed, 11 May 2016 23:33:24 +0200 jwilhelm 8156800: Convert QuickSort_test to GTest
Mon, 24 Oct 2016 13:36:06 -0400 drwhite 8168567: Fix for 8166972 breaks aarch64 build
Wed, 26 Oct 2016 14:58:14 +0530 vtewari 8151099: java.lang.management.ManagementFactory.getPlatformMXBeans() should work even if jdk.management is not present.
Mon, 24 Oct 2016 14:12:32 -0700 cjplummer 8166679: JNI AsyncGetCallTrace replaces topmost frame name with <no Java callstack recorded> starting with Java 9 b133
Mon, 24 Oct 2016 11:48:30 -0700 kvn 8168317: [JVMCI] use reflection instead of jdk 9 Module API in Services.java
Mon, 24 Oct 2016 16:27:13 +0000 jprovino Merge
Mon, 24 Oct 2016 10:10:30 -0400 jprovino 8160055: Misplaced call to ClassLoaderDataGraph::clear_claimed_marks during initial mark
Mon, 24 Oct 2016 14:51:54 +0300 dsamersoff 8160376: DebuggerException: Can't attach symbolicator to the process
Mon, 24 Oct 2016 09:55:58 +0200 sla Merge
Mon, 24 Oct 2016 09:05:13 +0200 sla 8168483: Remove jtreg timeout handler timeout
Thu, 06 Oct 2016 18:04:11 +0200 simonis 8167299: -XX:+PrintRelocations crashes the VM
Fri, 21 Oct 2016 22:26:51 -0400 kbarrett 8166862: CMS needs klass_or_null_acquire
Fri, 21 Oct 2016 17:51:33 -0700 dlong 8160411: SIGSEGV in frame::safe_for_sender on incomplete DeoptimizationBlob frame
Fri, 21 Oct 2016 13:07:32 -0700 rraghavan 8165661: SPECjvm2008-crypto.signverify regression in 9-b105
Fri, 21 Oct 2016 20:12:47 +0200 neliasso 8166377: is_compiled_by_jvmci hot in some profiles - improve nmethod compiler type detection
Fri, 21 Oct 2016 10:16:09 -0700 kvn 8165381: Update for x86 SHA512 using AVX2
Fri, 21 Oct 2016 17:55:02 +0200 mgronlun Merge
Fri, 21 Oct 2016 16:20:18 +0200 mgronlun 8166806: Add intrinsic support for writer used in event based tracing
Fri, 21 Oct 2016 17:04:13 +0300 akulyakh 8168479: Quarantine serviceability/jdwp/AllModulesCommandTest.java test
Fri, 21 Oct 2016 12:30:12 +0300 dsamersoff 8164383: jhsdb dumps core on Solaris 12 when loading dumped core
Fri, 21 Oct 2016 10:27:32 +0200 mdoerr 8166684: PPC64: implement intrinsic code with vector instructions for Unsafe.copyMemory()
Thu, 20 Oct 2016 17:05:26 -0700 amurillo Merge
Thu, 20 Oct 2016 21:41:14 +0000 iklam Merge
Thu, 20 Oct 2016 13:41:07 -0700 iklam 8166203: NoClassDefFoundError should not be thrown if class is in_error_state at link time
Thu, 20 Oct 2016 23:09:03 +0300 kzhaldyb 8159817: Convert FreeRegionList_test to GTest
Thu, 20 Oct 2016 16:53:39 +0300 dpochepk 8155219: [TESTBUG] Rewrite compiler/ciReplay/TestVM.sh in java
Thu, 20 Oct 2016 10:51:54 +0300 kzhaldyb 8166910: Convert TestNewSize_test to GTest
Wed, 19 Oct 2016 18:57:06 +0000 dnsimon Merge
Wed, 19 Oct 2016 20:15:35 +0200 dnsimon 8168295: [JVMCI] -XX:+JVMCIPrintProperties should exit after printing
Wed, 19 Oct 2016 17:53:01 +0000 kvn Merge
Wed, 19 Oct 2016 10:48:48 -0700 mwalsh 8164002: Add a new CPU family (S_family) for SPARC S7 and above processors
Wed, 19 Oct 2016 16:56:31 +0000 dfazunen Merge
Wed, 19 Oct 2016 10:06:55 +0300 lmesnik 8166724: gc/g1/TestHumongousShrinkHeap.java fails with OOME
Wed, 19 Oct 2016 10:10:51 +0300 lmesnik 8155570: serviceability/tmtools/jstat/GcTest02.java fails with parallel GC
Tue, 18 Oct 2016 14:27:48 +0300 akulyakh 8166289: RuntimeException: canRead() reports false for reading from the same module: expected true, was false
Wed, 19 Oct 2016 12:10:43 +0200 kzhaldyb Merge
Wed, 28 Sep 2016 17:18:45 +0300 kzhaldyb 8166563: Convert GuardedMemory_test to Gtest
Wed, 28 Sep 2016 17:26:43 +0300 kzhaldyb 8166804: Convert TestMetachunk_test to GTest
Thu, 06 Oct 2016 16:32:46 +0200 ehelin 8166790: Add stress test GCBasher
Mon, 17 Oct 2016 05:44:43 -0700 hshi 8167421: AArch64: in one core system, fatal error: Illegal threadstate encountered
Tue, 18 Oct 2016 19:08:24 -0700 mcberg 8167987: change merge context to clear for mask register usage model
Thu, 17 Nov 2016 17:50:06 +0000 lana Added tag jdk-9+145 for changeset 61e7ea563123
Fri, 11 Nov 2016 05:11:52 +0000 lana Added tag jdk-9+144 for changeset 6187b582d02ajdk-9+145
Fri, 04 Nov 2016 17:52:18 +0000 lana Mergejdk-9+144
Thu, 03 Nov 2016 18:08:02 -0700 mchung 6479237: (cl) Add support for classloader names
Fri, 04 Nov 2016 17:24:23 +0000 lana Added tag jdk-9+143 for changeset d87d5d430c42
Wed, 02 Nov 2016 10:43:23 +0100 erikj 8063154: Checked in jvmti.h not in sync with generated jvmti.hjdk-9+143
Thu, 27 Oct 2016 21:22:32 +0000 lana Merge
Thu, 20 Oct 2016 16:53:56 -0700 amurillo Merge
Wed, 19 Oct 2016 00:16:02 +0000 dholmes Merge
Tue, 18 Oct 2016 20:03:17 -0400 dholmes 8165827: Support private interface methods in JNI, JDWP, JDI and JDB
Tue, 18 Oct 2016 16:15:03 -0700 ccheung 8166931: Do not include classes which are unusable during run time in the classlist file
Tue, 18 Oct 2016 17:38:17 -0400 jiangli Merge
Mon, 10 Oct 2016 20:50:33 -0400 jiangli 8167333: Invalid source path info might be used when creating ClassFileStream after CFLH transforms a shared classes in some cases
Tue, 18 Oct 2016 19:31:21 +0000 never Merge
Tue, 18 Oct 2016 17:47:03 +0000 never Merge
Tue, 18 Oct 2016 17:06:58 +0000 never 8166972: [JVMCI] reduce size of interpreter when JVMCI is enabled
Tue, 18 Oct 2016 18:59:01 +0000 dfazunen Merge
Tue, 18 Oct 2016 17:18:11 +0000 dfazunen Merge
Tue, 18 Oct 2016 16:02:14 +0000 dfazunen Merge
Tue, 18 Oct 2016 19:26:07 +0400 dfazunen 8165621: Convert TestG1BiasedArray_test to GTest
Tue, 18 Oct 2016 17:21:55 +0000 aph Merge
Tue, 18 Oct 2016 17:14:09 +0000 aph Merge
Wed, 12 Oct 2016 12:24:41 +0000 aph 8167595: AArch64: SEGV in stub code cipherBlockChaining_decryptAESCrypt
Tue, 18 Oct 2016 16:09:34 +0000 coleenp Merge
Tue, 18 Oct 2016 08:39:43 -0400 coleenp 8164921: Memory leaked when instrumentation.retransformClasses() is called repeatedly
Tue, 18 Oct 2016 15:15:51 +0000 dnsimon Merge
Tue, 11 Oct 2016 00:08:20 +0200 dnsimon 8167180: [JVMCI] Exported elements referring to inaccessible types in jdk.vm.ci
Tue, 18 Oct 2016 16:21:43 +0200 ehelin Merge
Wed, 05 Oct 2016 16:00:10 +0200 ehelin 8167190: Remove confusing timestamps from the gc log
Tue, 18 Oct 2016 12:26:04 +0000 ctornqvi Merge
Tue, 18 Oct 2016 06:17:10 -0400 ctornqvi 8159799: Tests using jcmd fails intermittently with Could not open PerfMemory on Windows
Tue, 18 Oct 2016 06:14:10 -0400 ctornqvi 8166738: Enable concurrency in Hotspot jtreg testing
Tue, 18 Oct 2016 13:24:02 +0200 rehn Merge
Tue, 18 Oct 2016 12:06:52 +0200 rehn Merge
Tue, 18 Oct 2016 10:51:25 +0200 rehn 8165526: Kitchensink sudden death - error code 0x406d1388
Mon, 17 Oct 2016 17:55:10 +0200 roland 8168086: 8166869 broke jvmci build on aarch64
Tue, 18 Oct 2016 09:43:12 +0200 thartmann 8153134: Infinite loop in handle_wrong_method in jmod
Mon, 17 Oct 2016 16:40:49 -0700 sangheki 8167494: Deprecate AutoGCSelectPauseMillis
Mon, 17 Oct 2016 21:21:53 -0700 sangheki 8166461: Deprecate UseAutoGCSelectPolicy
Tue, 18 Oct 2016 02:53:36 +0000 coleenp Merge
Tue, 18 Oct 2016 00:15:02 +0000 coleenp Merge
Wed, 12 Oct 2016 10:41:00 +0200 mdoerr 8166970: Adapt mutex padding according to DEFAULT_CACHE_LINE_SIZE
Tue, 18 Oct 2016 01:47:24 +0000 sangheki Merge
Mon, 17 Oct 2016 16:46:12 -0700 jmasa 8155948: Add message for CMS deprecation for Oracle builds
Mon, 17 Oct 2016 19:18:08 -0400 alanbur 8157141: Fix for JDK-8031290 is unnecessarily fragile
Mon, 17 Oct 2016 19:12:28 -0400 mwalsh 8165482: java in ldoms, with cpu-arch=generic has problems
Mon, 17 Oct 2016 18:54:12 -0400 stsmirno 8165687: Fix license and copyright headers in jd9 under hotspot/test
Mon, 17 Oct 2016 18:40:10 -0400 dholmes 8166197: assert(RelaxAssert || w != Thread::current()->_MutexEvent) failed: invariant
Fri, 14 Oct 2016 08:54:02 -0700 kvn Merge
Mon, 03 Oct 2016 19:09:26 +0000 rschatz Merge
Mon, 03 Oct 2016 17:54:28 +0000 rschatz 8166781: fix wrong comment in ReceiverTypeData
Mon, 03 Oct 2016 12:35:51 -0400 dlong Merge
Wed, 28 Sep 2016 11:17:51 +0200 roland 8166836: Elimination of clone's ArrayCopyNode may make compilation fail silently
Thu, 29 Sep 2016 22:37:05 -0700 jcm 8134389: Crash in HotSpot with jvm.dll+0x42b48 ciObjectFactory::create_new_metadata
Thu, 29 Sep 2016 10:00:56 -0700 never 8166869: [JVMCI] record metadata relocations for metadata references
Wed, 28 Sep 2016 10:11:40 -0700 rasbold 8166742: SIGFPE in C2 Loop IV elimination
Tue, 27 Sep 2016 04:48:51 -0700 dnsimon 8166517: [JVMCI] export JVMCI to auto-detected JVMCI compiler
Tue, 27 Sep 2016 09:25:26 +0100 adinn 8165673: AArch64: Fix JNI floating point argument handling
Tue, 27 Sep 2016 09:26:30 +0200 mdoerr 8166689: PPC64: Race condition between stack bang and non-entrant patching
Thu, 13 Oct 2016 08:57:54 -0700 amurillo Merge
Mon, 10 Oct 2016 08:34:32 -0400 hseigel 8166364: fatal error: acquiring lock DirtyCardQ_CBL_mon/16 out of order with lock Module_lock/6 -- possible deadlock
Fri, 07 Oct 2016 15:40:34 -0700 dnsimon 8167353: [JVMCI] JVMCI re-initialization check is in the wrong location
Thu, 06 Oct 2016 09:36:23 +0000 aph Merge
Thu, 06 Oct 2016 09:25:21 +0000 aph 8167200: AArch64: Broken stack pointer adjustment in interpreter
Wed, 05 Oct 2016 13:56:26 -0700 dnsimon 8167194: [JVMCI] no reliable mechanism for querying JVMCI system properties
Wed, 05 Oct 2016 21:35:05 +0200 kvn Merge
Thu, 22 Sep 2016 18:33:47 +0200 goetz 8166562: C2: Suppress relocations in scratch emit.
Wed, 05 Oct 2016 11:32:50 -0700 never 8166929: [JVMCI] Expose decompile counts in MDO
Wed, 05 Oct 2016 13:35:57 +0200 sjohanss 8165949: Serial and ConcMarkSweep do not unload strings when class unloading is disabled
Wed, 21 Oct 2015 15:18:30 +0200 jwilhelm 8166276: Refactor gen_process_roots to allow simpler fix for 8165949
Wed, 05 Oct 2016 12:28:35 +0200 mlarsson Merge
Thu, 08 Sep 2016 15:57:57 +0200 mlarsson 8165600: Convert internal logging tests to GTest
Thu, 08 Sep 2016 15:51:33 +0200 mlarsson 8165704: Convert LogStream internal tests to GTest
Thu, 08 Sep 2016 15:43:20 +0200 mlarsson 8165702: Convert LogFileOutput internal tests to GTest
Thu, 08 Sep 2016 15:28:05 +0200 mlarsson 8165700: Convert LogMessage internal tests to GTest
Thu, 08 Sep 2016 15:24:52 +0200 mlarsson 8165698: Convert LogTagSet related internal tests to GTest
Thu, 08 Sep 2016 15:24:52 +0200 mlarsson 8165696: Convert gcTraceTime internal tests to GTest
Wed, 05 Oct 2016 11:05:18 +0200 erikj 8164120: The minimal VM should be stripped using --strip-unneeded
Fri, 29 Apr 2016 15:23:15 +0200 mdoerr 8155729: C2: Skip transformation of LoadConP for heap-based compressed oops
Tue, 04 Oct 2016 21:21:10 +0300 iignatyev 8166129: hitting vmassert during gtest execution doesn't generate core and hs_err files
Tue, 04 Oct 2016 21:20:42 +0300 iignatyev 8166925: several native TESTs should be changed to TEST_VM
Tue, 24 May 2016 08:47:37 -0700 enevill 8157708: aarch64: StrIndexOfChar intrinsic is not implemented
Mon, 03 Oct 2016 21:48:21 -0400 dholmes 8081800: AbstractMethodError when evaluating a private method in an interface via debugger
Wed, 28 Sep 2016 18:40:50 +0300 kzhaldyb 8166462: Convert TestResourcehash_test to Gtest
Fri, 30 Sep 2016 12:11:02 -0700 ccheung 8166930: minor cleanups 1) remove reference to ZIP_ReadMappedEntry 2) checking of st_mode
Fri, 30 Sep 2016 03:24:03 -0700 amurillo Merge
Thu, 29 Sep 2016 18:00:01 +0000 rprotacio Merge
Thu, 29 Sep 2016 13:32:17 -0400 rprotacio 8160064: StackWalker implementation added logging option without using UL
Thu, 27 Oct 2016 16:28:59 +0000 lana Added tag jdk-9+142 for changeset 7b48d63dfd6b
Thu, 20 Oct 2016 20:01:43 +0000 lana Mergejdk-9+142
Mon, 25 Jul 2016 11:15:00 +0200 zmajo 8161044: PPC64: Improve internal array handling
Mon, 27 Jun 2016 15:26:08 -0400 hseigel 8157176: Improved classfile parsing
Fri, 01 Jul 2016 15:11:38 -0400 rprotacio 8159503: Amend Annotation Actions
Fri, 01 Jul 2016 09:33:34 +0200 zmajo 8160591: Improve internal array handling
Thu, 30 Jun 2016 08:11:30 -0400 hseigel 8159511: Stack map validation
Wed, 29 Jun 2016 11:52:27 -0400 coleenp 8159515: Improve indy validation
Thu, 09 Jun 2016 13:47:15 -0500 gziemski 8155968: Update command line options
Thu, 12 May 2016 17:37:45 -0400 jiangli 8156794: Extend data sharing
Thu, 20 Oct 2016 18:38:08 +0000 lana Added tag jdk-9+141 for changeset 160a00bc6ed0
Thu, 13 Oct 2016 23:03:14 +0000 lana Mergejdk-9+141
Thu, 13 Oct 2016 15:57:24 -0400 mockner 8167446: Add back PermSize and MaxPermSize
Thu, 13 Oct 2016 08:00:10 -0700 mchung 8167511: IgnoreModulePropertiesTest.java needs update for JDK-8162401
Tue, 11 Oct 2016 09:49:50 +0200 ihse 8167424: Various trivial fixes in build system
Thu, 13 Oct 2016 21:01:10 +0000 lana Added tag jdk-9+140 for changeset fec31089c2ef
Thu, 06 Oct 2016 18:05:53 -0700 iris 8166799: ASSEMBLY_EXCEPTION contains historical company namejdk-9+140
Thu, 06 Oct 2016 23:12:14 +0000 lana Merge
Wed, 05 Oct 2016 09:52:53 -0700 amurillo Merge
Wed, 05 Oct 2016 06:28:22 -0700 amurillo Merge
Fri, 30 Sep 2016 02:52:38 -0700 amurillo Merge
Tue, 27 Sep 2016 10:47:08 +0200 goetz 8166765: [ppc] Port "8163014: Mysterious/wrong value for long frame local variable on 64-bit"
Tue, 27 Sep 2016 15:45:44 +0200 goetz 8166777: [ppc] port "8164086: Checked JNI pending exception check should be cleared"
Wed, 28 Sep 2016 11:58:56 +0530 vtewari 8165537: runtime/SharedArchiveFile/SASymbolTableTest.java fails with NullPointerException
Tue, 27 Sep 2016 20:55:13 -0400 dlong Merge
Mon, 26 Sep 2016 14:21:21 -0400 dlong Merge
Mon, 19 Sep 2016 15:08:03 +0200 mdoerr 8166140: C1: Possible integer overflow in LIRGenerator::generate_address on several platforms
Mon, 26 Sep 2016 08:51:36 +0200 thartmann 8161085: PreserveFPRegistersTest fails with 'AssertionError: Final value has changed'
Wed, 17 Aug 2016 18:48:34 +0300 ppunegov 8156852: Convert JSON_test to Gtest
Thu, 22 Sep 2016 12:17:24 +0200 mdoerr 8164920: ppc: enhancement of CRC32 intrinsic
Wed, 21 Sep 2016 13:47:56 -0700 kvn 8078122: YMM registers upper 128 bits may get clobbered by a JNI call on windows
Wed, 21 Sep 2016 08:14:46 +0200 thartmann 8166046: [TESTBUG] compiler/stringopts/TestStringObjectInitialization.java fails with OOME
Tue, 20 Sep 2016 16:50:37 -0700 mcberg 8129376: SPECjvm98-client performance regression in 9-b66
Tue, 20 Sep 2016 16:34:45 -0400 dlong Merge
Tue, 20 Sep 2016 17:30:33 +0300 iignatyev 8166164: compiler/compilercontrol/share/processors/LogProcessor.java does not close Scanner
Mon, 19 Sep 2016 13:26:37 -0700 dnsimon 8165457: [JVMCI] increase InterpreterCodeSize for JVMCI
Fri, 16 Sep 2016 21:10:56 -0700 kvn 8166096: variable tracking size limit exceeded in jvmciCompilerToVM.cpp
Wed, 14 Sep 2016 19:55:08 +0000 dnsimon Merge
Wed, 14 Sep 2016 12:34:37 -0700 dnsimon 8165434: [JVMCI] remove uses of setAccessible
Wed, 14 Sep 2016 20:22:53 +0200 kvn Merge
Fri, 26 Aug 2016 12:17:50 -0700 vdeshpande 8154122: Intrinsify fused mac operations
Wed, 14 Sep 2016 05:48:18 -0700 dnsimon 8165755: [JVMCI] replace use of vm_abort with vm_exit
Thu, 01 Sep 2016 16:47:53 +0200 goetz 8165235: [TESTBUG] RTM tests must check OS version
Thu, 08 Sep 2016 18:17:50 -0400 gromero 8164987: RTM jtreg tests failing due to unnamed module unable to access class jdk.internal.misc.Unsafe
Fri, 09 Sep 2016 06:11:54 -0700 jcm 8164508: unexpected profiling mismatch in c1 generated code
Wed, 07 Sep 2016 12:23:25 -0700 mcberg 8165565: Shorten branches causes incorrect code for SKX
Tue, 27 Sep 2016 16:43:59 -0400 eosterlund 8165857: CMS _overflow_list is missing volatile specifiers.
Mon, 26 Sep 2016 17:49:01 +0300 kzhaldyb 8159818: Convert IHOP_test to GTest
Mon, 26 Sep 2016 20:24:34 +0000 fparain Merge
Mon, 26 Sep 2016 15:56:39 -0400 fparain 8146546: assert(fr->safe_for_sender(thread)) failed: Safety check
Mon, 26 Sep 2016 14:38:35 -0400 kbarrett 8166663: Simplify oops_on_card_seq_iterate_careful
Thu, 15 Sep 2016 18:18:39 +0300 kzhaldyb 8165602: Convert TestChunkedList_test to GTest
Sat, 24 Sep 2016 16:02:29 -0400 eosterlund 8165858: heapRegionManager is missing volatile specifier for _claims.
Fri, 23 Sep 2016 18:23:12 -0400 kbarrett 8166583: Add oopDesc::klass_or_null_acquire()
Fri, 23 Sep 2016 13:44:01 -0700 amurillo Merge
Thu, 22 Sep 2016 22:51:51 +0300 iignatyev 8166549: fix incorrectly @ignore-d hotspot/compiler tests
Thu, 22 Sep 2016 10:24:25 -0700 bchristi 8166501: compilation error in stackwalk.cpp on some gccs
Thu, 22 Sep 2016 16:41:01 +0200 iignatyev Merge
Thu, 08 Sep 2016 15:23:05 +0300 kzhaldyb 8165433: Convert Test_linked_list to Gtest
Thu, 22 Sep 2016 14:29:56 +0000 dsamersoff Merge
Thu, 22 Sep 2016 15:42:40 +0300 dsamersoff 8166552: SA: Missed testcase for add default methods to InstanceKlass
Thu, 22 Sep 2016 09:18:16 -0400 adinn 8166433: AArch64: Fix for JDK-8163014 broke AArch64 build
Thu, 22 Sep 2016 08:57:37 +0200 erikj 8166202: Tracefile gensrc cannot handle closed src dir in different location
Thu, 22 Sep 2016 00:21:25 +0200 kzhaldyb Merge
Fri, 16 Sep 2016 19:49:03 +0300 kzhaldyb 8165613: Convert TestKlass_test to Gtest
Wed, 21 Sep 2016 12:53:16 -0700 cjplummer 8161225: Assert failure in JVMTI GetNamedModule at JPLISAgent.c line: 792
Wed, 21 Sep 2016 18:40:50 +0000 ctornqvi Merge
Wed, 21 Sep 2016 16:52:45 +0000 ctornqvi Merge
Wed, 21 Sep 2016 12:45:18 -0400 ctornqvi 8164852: Move slow tier1/tier2 runtime tests to later tiers
Wed, 21 Sep 2016 16:47:26 +0000 coleenp Merge
Wed, 21 Sep 2016 09:56:18 -0400 coleenp 8163969: Cyclic interface initialization causes JVM crash
Wed, 21 Sep 2016 16:46:13 +0300 ddmitriev 8150758: [TESTBUG] need jvmti tests for module aware agents
Wed, 21 Sep 2016 11:31:23 +0200 kzhaldyb Merge
Thu, 08 Sep 2016 18:41:10 +0300 kzhaldyb 8165601: Convert arrayOopDesc_test to Gtest
Mon, 05 Sep 2016 20:31:03 +0300 kzhaldyb 8165439: Convert Test_TempNewSymbol to GTest
Wed, 21 Sep 2016 08:38:21 +0000 sspitsyn Merge
Wed, 21 Sep 2016 01:33:21 -0700 sspitsyn 8147943: jvmti.h generated with GPL header
Tue, 20 Sep 2016 22:38:26 +0000 jprovino Merge
Tue, 20 Sep 2016 20:45:35 +0000 jprovino Merge
Tue, 20 Sep 2016 10:27:51 -0400 jprovino 8164482: [REDO] G1 does not implement millis_since_last_gc which is needed by RMI GC
Tue, 20 Sep 2016 15:42:17 -0400 eosterlund 8033552: Fix missing missing volatile specifiers in CAS operations in GC code
Tue, 20 Sep 2016 20:22:19 +0200 ccheung Merge
Tue, 20 Sep 2016 10:37:19 -0700 ccheung 8164011: --patch-module support for CDS
Tue, 20 Sep 2016 10:04:55 -0700 bchristi 8165372: StackWalker performance regression following JDK-8147039
Tue, 20 Sep 2016 11:41:43 +0200 eosterlund 8165860: WorkGroup classes are missing volatile specifiers for lock-free code
Wed, 05 Oct 2016 17:11:14 +0200 erikj 8161025: GPL header missing comma in year
Wed, 05 Oct 2016 10:49:49 +0200 erikj 8150736: Excessive disk space used by build system
Thu, 06 Oct 2016 20:56:10 +0000 lana Added tag jdk-9+139 for changeset 08492e67bf32
Fri, 30 Sep 2016 09:06:02 +0200 erikj 8160630: libjimage.so and others should link statically to libgccjdk-9+139
Thu, 29 Sep 2016 17:23:47 +0000 lana Merge
Tue, 27 Sep 2016 09:04:49 -0700 amurillo Merge
Fri, 23 Sep 2016 13:32:17 -0700 amurillo Merge
Tue, 20 Sep 2016 00:34:54 +0000 kbarrett Merge
Mon, 19 Sep 2016 19:59:28 -0400 kbarrett 8166228: Remove unused HeapRegion::object_iterate_mem_careful()
Mon, 19 Sep 2016 19:25:09 -0400 hseigel 8166312: Backout 8165017
Mon, 19 Sep 2016 22:55:26 +0200 tschatzl 8166207: Use of Copy::conjoint_oops_atomic in global mark stack causes crashes on arm64
Mon, 19 Sep 2016 17:35:25 +0000 kbarrett Merge
Mon, 19 Sep 2016 13:12:26 -0400 kbarrett 8166229: Eliminate ParNew's use of klass_or_null()
Mon, 19 Sep 2016 12:04:28 -0400 lfoltan 8163406: The fixup_module_list must be protected by Module_lock when inserting new entries
Sun, 18 Sep 2016 21:10:48 -0400 jiangli 8078644: CDS needs to support JVMTI CFLH
Tue, 06 Sep 2016 13:01:27 +0200 mdoerr 8165489: Missing G1 barrier in Unsafe_GetObjectVolatile
Fri, 16 Sep 2016 13:15:01 -0700 amurillo Merge
Fri, 16 Sep 2016 12:09:53 -0500 gziemski 8136766: Enable ThreadStackSize range test
Fri, 16 Sep 2016 11:33:47 +0200 tschatzl 8157952: Parallelize Memory Pretouch
Thu, 15 Sep 2016 12:10:43 -0400 kbarrett 8165808: Add release barriers when allocating objects with concurrent collection
Thu, 15 Sep 2016 16:44:19 +0200 tschatzl 8159422: Very high Concurrent Mark mark stack contention
Wed, 14 Sep 2016 16:20:54 +0300 akulyakh 8165017: Additional test coverage of the JDWP CLASSLOADER and MODULE commands
Thu, 15 Sep 2016 10:19:11 +0300 dsamersoff 8027920: SA: Add default methods to InstanceKlass
Thu, 29 Sep 2016 16:45:09 +0000 lana Added tag jdk-9+138 for changeset fc0956308c7a
Thu, 22 Sep 2016 18:32:20 +0000 lana Mergejdk-9+138
Wed, 21 Sep 2016 09:29:30 -0700 amurillo Merge
Fri, 16 Sep 2016 10:57:18 -0700 amurillo Merge
Wed, 14 Sep 2016 11:53:20 -0700 mchung 8157464: Disallow StackWalker.getCallerClass() be called by caller-sensitive method
Tue, 13 Sep 2016 16:18:44 -0700 jmasa 8161029: GPL header missing comma after year
Wed, 14 Sep 2016 10:02:49 -0400 hseigel 8149607: [Verifier] Do not verify pop, pop2, swap, dup* against top
Wed, 14 Sep 2016 08:17:50 -0400 gtriantafill 8165889: Remove jdk.test.lib.unsafe.UnsafeHelper
Tue, 13 Sep 2016 21:29:30 +0000 sspitsyn Merge
Tue, 13 Sep 2016 20:17:46 +0000 sspitsyn Merge
Tue, 13 Sep 2016 13:10:42 -0700 sspitsyn 8165681: ClassLoad and ClassPrepare JVMTI events are missed in the start phase
Tue, 13 Sep 2016 18:22:21 +0000 cjplummer Merge
Tue, 13 Sep 2016 17:22:28 +0000 cjplummer Merge
Tue, 30 Aug 2016 16:08:52 +0200 goetz 8165315: [ppc] Port "8133749: NMT detail stack trace cleanup"
Tue, 13 Sep 2016 19:17:21 +0200 rehn Merge
Tue, 13 Sep 2016 09:04:44 +0200 dsimms 8164086: Checked JNI pending exception check should be cleared when returning to Java frame
Tue, 13 Sep 2016 18:19:05 +0200 mockner Merge
Tue, 13 Sep 2016 11:04:29 -0400 mockner 8163014: Mysterious/wrong value for "long" frame local variable on 64-bit
Tue, 13 Sep 2016 11:32:45 +0200 tschatzl 8164948: Initializing stores of HeapRegions are not ordered with regards to their use in G1ConcurrentMark
Mon, 12 Sep 2016 18:59:13 +0000 poonam Merge
Mon, 12 Sep 2016 17:18:19 +0000 poonam 8165493: SA: Add method in GrowableArray.java to be able to access the 'data' field
Mon, 12 Sep 2016 13:16:39 -0400 ctornqvi 8165881: Backout JDK-8164913
Mon, 12 Sep 2016 16:34:36 +0200 sjohanss 8114823: G1 doesn't honor request to disable class unloading
Thu, 08 Sep 2016 12:30:38 +0200 ehelin 8165455: Tracing events for G1 have incorrect metadata
Mon, 12 Sep 2016 09:34:51 +0200 tschatzl 8165313: Inserting freed regions during Free Collection Set serial phase takes very long on huge heaps
Sat, 10 Sep 2016 12:23:52 -0700 amurillo Merge
Sat, 10 Sep 2016 08:25:51 -0400 hseigel 8165634: Support multiple --add-modules options on the command line
Fri, 09 Sep 2016 19:41:41 +0000 dcubed Merge
Fri, 09 Sep 2016 11:23:59 -0700 dcubed Merge
Fri, 09 Sep 2016 11:14:57 -0700 rdurbin 8140520: segfault on solaris-amd64 with "-XX:VMThreadStackSize=1" option
Fri, 09 Sep 2016 19:30:08 +0300 avorobye 8146128: compiler/cpuflags/TestAESIntrinsicsOnSupportedConfig timeouts
Fri, 09 Sep 2016 06:44:31 +0000 sspitsyn Merge
Thu, 08 Sep 2016 23:38:56 -0700 ysuenaga 8164913: JVMTI.agent_load dcmd should show useful error message
Thu, 08 Sep 2016 23:43:45 -0400 dlong Merge
Tue, 06 Sep 2016 09:59:25 -0700 mcberg 8164989: Inflate and compress intrinsics produce incorrect results with avx512
Thu, 01 Sep 2016 20:16:04 +0300 tpivovarova 8165050: [TESTBUG] tests generated by jittester cannot be run with jtreg
Thu, 01 Sep 2016 21:15:12 +0300 dpochepk 8165244: Unquarantine compiler/jvmci/compilerToVM/ExecuteInstalledCodeTest.java
Thu, 01 Sep 2016 21:13:20 +0300 dpochepk 8146096: [TEST BUG] compiler/loopopts/UseCountedLoopSafepoints.java Timeouts
Thu, 01 Sep 2016 21:12:07 +0300 dpochepk 8157956: OverflowCodeCacheTest.java fails with Out of space in CodeCache for method handle intrinsic
Wed, 31 Aug 2016 12:10:40 -0700 dlong 8156137: SIGSEGV in ReceiverTypeData::clean_weak_klass_links
Wed, 31 Aug 2016 14:47:20 +0300 tpivovarova 8165030: [TESTBUG] ctw failed to build after 8157957
Tue, 30 Aug 2016 13:51:56 +0000 thartmann Merge
Tue, 30 Aug 2016 13:24:26 +0200 thartmann 8164480: Crash with assert(handler_address == SharedRuntime::compute_compiled_exc_handler(..) failed: Must be the same
Tue, 30 Aug 2016 13:53:36 +0200 neliasso 8157024: CodeCache JFR events reporting wrong data
Wed, 13 Jul 2016 12:10:22 +0200 neliasso 8160942: Unused code in GraphKit::record_profiled_receiver_for_speculation
Tue, 30 Aug 2016 09:01:33 +0000 zmajo Merge
Tue, 30 Aug 2016 10:50:29 +0200 zmajo 8141634: Implement VarHandles/Unsafe intrinsics on SPARC
Tue, 30 Aug 2016 09:30:16 +0200 zmajo 8161720: Better byte behavior for off-heap data
Mon, 29 Aug 2016 17:15:20 +0000 never 8161550: [JVMCI] Crash: assert(sig_bt[member_arg_pos] == T_OBJECT)
Mon, 29 Aug 2016 07:32:37 +0200 zmajo 8163880: Constant pool caching of fields inhibited/delayed unnecessarily
Wed, 21 Sep 2016 14:23:33 +0200 alanbur 8165161: Solaris: /usr/ccs /opt/sfw and /opt/csw are dead, references should be expunged
Thu, 22 Sep 2016 16:41:12 +0000 lana Added tag jdk-9+137 for changeset dfcbf839e299
Thu, 15 Sep 2016 21:09:16 +0000 lana Mergejdk-9+137
Sat, 10 Sep 2016 12:18:31 -0700 amurillo Merge
Fri, 02 Sep 2016 16:45:16 +0200 mgerdin 8161079: Default heap size causes native memory exhaustion on 32 bit Windows
Wed, 07 Sep 2016 23:17:24 +0200 dholmes Merge
Wed, 07 Sep 2016 16:43:32 -0400 dholmes 8165153: Crash in rebuild_cpu_to_node_map
Wed, 07 Sep 2016 19:29:01 +0000 coleenp Merge
Wed, 07 Sep 2016 15:25:21 -0400 coleenp 8165246: [REDO] InstanceKlass::_previous_version_count goes negative
Wed, 07 Sep 2016 12:52:20 -0400 fparain 8137035: nsk/stress/stack/stack tests got EXCEPTION_STACK_OVERFLOW on Windows 64 bit
Wed, 07 Sep 2016 15:21:45 +0200 mlarsson Merge
Wed, 07 Sep 2016 14:36:44 +0200 mlarsson 8165226: Bad -Xloggc: arguments crashes the VM
Wed, 07 Sep 2016 07:19:48 -0400 hseigel 8058575: IllegalAccessError trying to access package-private class from VM anonymous class
Wed, 07 Sep 2016 09:20:10 +0200 tschatzl 8165292: The gc+task logging is repeated a lot, decreasing the usefulness of -Xlog:gc*=info
Tue, 06 Sep 2016 22:52:35 +0200 rprotacio Merge
Tue, 06 Sep 2016 16:29:32 -0400 rprotacio 8161224: CONSTANT_NameAndType_info permits references to illegal names and descriptors
Tue, 06 Sep 2016 09:54:45 +0300 dsamersoff 8165114: stale reference to hotspot test Test8028623.java
Mon, 05 Sep 2016 20:40:08 -0400 mdoerr 8165018: Missing memory barrier for PPC64 in Unsafe_GetObjectVolatile
Wed, 31 Aug 2016 09:38:46 +0200 mlarsson 8164939: GTest LogDecorations.iso8601_time_test fails on macOS
Tue, 30 Aug 2016 21:35:56 +0300 kzhaldyb 8157468: gc/testlibrary contains a lot of duplicated code
Fri, 02 Sep 2016 11:18:04 +0200 tschatzl Merge
Fri, 02 Sep 2016 09:49:10 +0200 tschatzl 8164936: G1 age table printout contains contents from previous GC
Fri, 02 Sep 2016 08:51:26 +0200 rehn 8165215: Setting same UL tag multiple times matches wrong tagset
Fri, 02 Sep 2016 01:39:47 +0000 kzhaldyb Merge
Thu, 01 Sep 2016 20:46:40 +0300 kzhaldyb 8164039: Convert test_memset_with_concurrent_readers to GTest
Fri, 02 Sep 2016 00:08:18 +0000 coleenp Merge
Thu, 01 Sep 2016 18:02:13 -0400 coleenp 8165268: [BACKOUT] InstanceKlass::_previous_version_count goes negative
Thu, 01 Sep 2016 15:20:56 -0700 amurillo Merge
Thu, 01 Sep 2016 14:09:01 -0700 amurillo Merge
Thu, 01 Sep 2016 18:15:49 +0300 kzhaldyb Merge
Mon, 29 Aug 2016 20:15:12 +0300 kzhaldyb 8164230: Convert TestCodeCacheRemSet_test to GTest
Mon, 22 Aug 2016 16:43:56 +0300 kzhaldyb 8164028: Convert TestPredictions_test to GTest
Mon, 15 Aug 2016 13:18:35 +0300 kzhaldyb 8163860: Convert TestOldFreeSpaceCalculation_test to GTest
Mon, 29 Aug 2016 14:11:22 +0200 mlarsson 8157948: UL allows same log file with multiple file=
Wed, 24 Aug 2016 19:21:20 +0300 kzhaldyb 8164743: Convert TestAsUtf8 to GTest
Wed, 24 Aug 2016 18:10:09 +0300 kzhaldyb 8164738: Convert AltHashing_test to GTest
Thu, 01 Sep 2016 08:30:17 +0200 rehn 8163589: Add back class id intrinsic method for event based tracing
Wed, 31 Aug 2016 19:41:57 -0400 mdoerr 8165014: Unaligned unsafe access should throw InternalError on Solaris
Wed, 31 Aug 2016 16:41:01 +0000 hseigel Merge
Wed, 31 Aug 2016 10:27:32 -0400 hseigel 8162412: Ignore any System property specified as -Djdk.module that matches reserved module system properties
Wed, 31 Aug 2016 16:48:26 +0200 erikj 8164862: 2 JVMCI tests should not be executed on linux-x86
Wed, 31 Aug 2016 06:35:19 -0400 coleenp 8164692: InstanceKlass::_previous_version_count goes negative
Wed, 31 Aug 2016 11:47:14 +0300 dsamersoff 8163150: SA: CLHSDB printmdo throws an exception with "java.lang.InternalError: missing reason for 22"
Tue, 30 Aug 2016 23:48:16 -0400 kbarrett 8156500: Move Reference pending list into VM to prevent deadlocks
Tue, 30 Aug 2016 12:48:03 +0300 akulyakh 8148103: add more tests for task "Update JDI and JDWP for modules"
Tue, 30 Aug 2016 09:25:18 +0000 dsamersoff Merge
Tue, 30 Aug 2016 11:06:25 +0300 dsamersoff 8164562: serviceability/sa/TestInstanceKlassSizeForInterface.java: fails with NPE
Tue, 30 Aug 2016 09:17:49 +0200 tschatzl 8155917: Memory access in free regions during G1 full gc causes regressions in SPECjvm2008 scimark.fft,lu,sor,sparse with 9+116 on Linux-x64
Mon, 29 Aug 2016 20:13:45 -0400 dholmes 8158854: Ensure release_store is paired with load_acquire in lock-free code
Mon, 29 Aug 2016 23:04:48 +0400 dfazunen 8164660: MinimalVM is not tested with GC tests
Fri, 26 Aug 2016 14:27:41 +0200 mlarsson 8150823: UL disables log outputs incorrectly
Tue, 05 Apr 2016 16:51:58 +0200 mlarsson 8150894: Unused -Xlog tag sequences are silently ignored.
Fri, 26 Aug 2016 14:47:52 -0700 iveresov Merge
Thu, 25 Aug 2016 02:10:03 -0700 jcm 8158639: C2 compilation fails with SIGSEGV
Thu, 25 Aug 2016 12:52:18 +0300 vlivanov 8155635: C2: Mixed unsafe accesses break alias analysis
Thu, 25 Aug 2016 12:51:10 +0300 vlivanov 8162101: C2: Handle "wide" aliases for unsafe accesses
Tue, 23 Aug 2016 22:31:48 +0000 dnsimon Merge
Tue, 23 Aug 2016 22:24:31 +0000 dnsimon 8164358: [JVMCI] expose Hotspot intrinsics and HotSpotIntrinsicCandidate info to JVMCI
Tue, 23 Aug 2016 12:26:05 -0700 vdeshpande 8151988: Hotspot deoptimizes div/mod pair usage
Tue, 23 Aug 2016 18:03:37 +0000 tpivovarova Merge
Tue, 23 Aug 2016 19:53:40 +0300 tpivovarova 8164648: [TESTBUG] jittester failed compilation after 8157957
Tue, 23 Aug 2016 18:57:21 +0200 dpochepk Merge
Tue, 23 Aug 2016 19:30:56 +0300 dpochepk 8164608: [TESTBUG] compiler/profiling tests fail to compile
Tue, 23 Aug 2016 15:16:45 +0000 dnsimon 8164214: [JVMCI] include VarHandle in signature polymorphic method test
Tue, 23 Aug 2016 13:44:26 +0200 thartmann 8038348: Instance field load is replaced by wrong data Phi
Mon, 22 Aug 2016 20:30:37 +0000 dnsimon Merge
Mon, 22 Aug 2016 19:29:15 +0000 dnsimon 8163864: [JVMCI] move MethodProfileWidth to jvmci_globals.hpp
Mon, 22 Aug 2016 11:47:15 -0700 iveresov 8164122: C1: assert(false) failed: stack or locks not matching (invalid bytecodes)
Fri, 19 Aug 2016 18:51:15 -0700 iveresov Merge
Fri, 19 Aug 2016 15:29:57 -0700 iveresov Merge
Sat, 20 Aug 2016 00:15:45 +0300 dpochepk 8139700: compiler/jvmci/compilerToVM/DisassembleCodeBlobTest and InvalidateInstalledCodeTest timeout
Fri, 19 Aug 2016 14:35:15 -0700 iveresov Merge
Fri, 19 Aug 2016 08:34:30 +0200 thartmann 8064892: Non-methods code cache overflow is not handled correctly
Thu, 18 Aug 2016 14:31:02 -0700 kvn 8162496: missing precedence edge for anti_dependence
Fri, 26 Aug 2016 10:14:14 -0700 amurillo Merge
Fri, 26 Aug 2016 06:37:34 -0700 iklam 8161280: assert failed: reference count underflow for symbol
Fri, 26 Aug 2016 13:11:20 +0300 dsamersoff 8163346: Update jmap-hashcode/Test8028623.java for better diagnostic of timeout.
Thu, 25 Aug 2016 12:24:05 +0900 ysuenaga 8163581: Heap Parameters in HSDB cannot handle G1CollectedHeap
Thu, 25 Aug 2016 13:48:42 +0000 rprotacio Merge
Thu, 25 Aug 2016 09:23:45 -0400 rprotacio 8148854: Class names "SomeClass" and "LSomeClass;" treated by JVM as an equivalent
Thu, 25 Aug 2016 08:40:53 -0400 ctornqvi 8164737: Remove Unsafe dependency from ProcessTools
Thu, 25 Aug 2016 14:12:09 +0400 dfazunen 8164133: Tests gc/arguments/TestAlignmentToUseLargePages.java and gc/cms/TestBubbleUpRef.java use too small heap
Thu, 15 Sep 2016 17:15:52 +0000 lana Added tag jdk-9+136 for changeset a20da289f646
Thu, 08 Sep 2016 21:11:53 +0000 lana Added tag jdk-9+135 for changeset 3b1c4562953djdk-9+136
Fri, 02 Sep 2016 02:41:12 +0000 lana Mergejdk-9+135
Wed, 31 Aug 2016 09:22:53 -0700 amurillo Merge
Fri, 26 Aug 2016 10:02:47 -0700 amurillo Merge
Wed, 24 Aug 2016 19:54:03 -0400 dholmes 8157904: Atomic::cmpxchg for jbyte is missing a fence on initial failure
Wed, 24 Aug 2016 20:38:21 +0200 rehn 8164208: Update tests with redefine classes UL options and tags?
Tue, 23 Aug 2016 21:49:33 -0400 ctornqvi 8163146: Remove os::check_heap on Windows
Tue, 23 Aug 2016 22:51:24 +0200 egahlin Merge
Tue, 23 Aug 2016 20:38:19 +0200 egahlin Merge
Tue, 23 Aug 2016 19:21:48 +0200 egahlin 8164523: Clean up metadata for event based tracing
Tue, 23 Aug 2016 19:20:13 +0000 coleenp Merge
Tue, 23 Aug 2016 13:44:59 -0400 coleenp 8038797: JVMTI FollowReferences does not report roots reachable from nmethods
Tue, 23 Aug 2016 17:27:56 +0000 ctornqvi Merge
Tue, 23 Aug 2016 13:20:51 -0400 ctornqvi 8155964: Create a set of tests for verifying the Minimal VM
Mon, 22 Aug 2016 15:54:22 +0000 rprotacio Merge
Mon, 22 Aug 2016 11:06:18 -0400 rprotacio 8163973: VM Anonymous classes should not call Class File Load Hooks
Mon, 22 Aug 2016 16:48:04 +0200 sjohanss 8163413: gc/metaspace/TestMetaspacePerfCounters failure
Thu, 14 Jul 2016 09:52:03 +0200 mlarsson 8061219: Implement unit-tests for UL
Sun, 21 Aug 2016 20:56:37 -0400 dholmes 8157907: Incorrect inclusion of atomic.hpp instead of atomic.inline.hpp
Sun, 21 Aug 2016 06:18:09 +0200 iveresov Merge
Fri, 19 Aug 2016 18:48:25 -0700 iveresov Merge
Fri, 19 Aug 2016 14:33:52 -0700 iveresov Merge
Thu, 18 Aug 2016 11:26:35 +0300 iignatyev 8164035: compiler/profiling/spectrapredefineclass_classloaders/Launcher.java failing with Agent JAR not found or no Agent-Class attribute
Wed, 17 Aug 2016 22:34:33 +0200 neliasso Merge
Mon, 15 Aug 2016 16:04:16 +0200 neliasso 8156659: assert(CodeCache::find_blob_unsafe(_pc) == _cb) failed: inconsistent
Wed, 17 Aug 2016 22:09:57 +0300 vlivanov 8164103: C2: Broken cmpxchgb encoding on x86
Wed, 17 Aug 2016 06:23:04 +0000 thartmann Merge
Wed, 17 Aug 2016 08:19:06 +0200 thartmann 8164091: VM fails during startup with "assert(resolved_method->method_holder()->is_linked()) failed: must be linked"
Tue, 16 Aug 2016 17:54:08 +0000 dlong Merge
Tue, 16 Aug 2016 09:19:13 -0700 dlong 8161598: Kitchensink fails: assert(nm->insts_contains(original_pc)) failed: original PC must be in nmethod/CompiledMethod
Tue, 16 Aug 2016 17:31:57 +0100 aph 8164113: AArch64: follow-up the fix for 8161598
Mon, 15 Aug 2016 14:08:01 -0700 iveresov 8163962: [JVMCI] integrate VarHandles
Sat, 20 Aug 2016 09:35:40 -0400 ctornqvi 8164521: compiler/rangechecks/TestRangeCheckSmearing.java is missing @build for sun.hotspot.WhiteBox
Fri, 19 Aug 2016 23:57:42 +0000 kbarrett Merge
Sun, 14 Aug 2016 21:19:42 -0400 kbarrett 8155043: BitMap set operations assume clear bits beyond unaligned end
Fri, 19 Aug 2016 22:28:32 +0000 amurillo Merge
Fri, 19 Aug 2016 12:17:31 -0700 amurillo Merge
Fri, 19 Aug 2016 22:42:25 +0200 coleenp Merge
Fri, 19 Aug 2016 14:54:31 -0400 coleenp 8145964: NoClassDefFound error in transforming lambdas
Fri, 19 Aug 2016 20:38:30 +0200 acorn Merge
Fri, 19 Aug 2016 11:32:43 -0400 acorn 8163808: Fix asserts and logging for old classfile vtable construction
Fri, 19 Aug 2016 18:20:22 +0200 ctornqvi Merge
Fri, 19 Aug 2016 10:06:30 -0400 ctornqvi 8157957: ClassNotFoundException: jdk.test.lib.JDKToolFinder
Fri, 19 Aug 2016 16:02:21 +0200 erikj 8164297: Jtreg test exeinvoke fails to link on Ubuntu
Fri, 19 Aug 2016 01:20:39 -0400 ysuenaga 8164319: CLHSDB dumpcodecache throws StackOverflowError
Thu, 18 Aug 2016 21:37:26 -0400 dholmes 8152849: share/vm/runtime/mutex.cpp:1161 assert(((uintptr_t(_owner))|(uintptr_t(_LockWord.FullWord))|(uintptr_t(_EntryList))|(uintptr_t(_WaitSet))|(uintptr_t(_OnDeck))) == 0) failed
Thu, 18 Aug 2016 10:47:09 -0400 coleenp 8037138: x86: problem with JVMTI breakpoint
Thu, 18 Aug 2016 11:11:40 +0000 dsamersoff Merge
Thu, 18 Aug 2016 14:07:00 +0300 dsamersoff 8157236: attach on ARMv7 fails with com.sun.tools.attach.AttachNotSupportedException: Unable to open socket file
Thu, 18 Aug 2016 12:10:18 +0300 dsamersoff 8151345: compiler/codecache/jmx/PeakUsageTest.java is failing on jdk9/dev for JPRT -testset hotspot
Tue, 30 Aug 2016 17:48:27 -0700 mchung 8160851: Remove old launcher module-related options
Thu, 01 Sep 2016 23:20:10 +0000 lana Added tag jdk-9+134 for changeset b8b694c6b4d2
Thu, 25 Aug 2016 22:36:30 +0000 lana Mergejdk-9+134
Fri, 19 Aug 2016 17:19:47 +0200 jwilhelm 8164124: [BACKOUT] G1 does not implement millis_since_last_gc which is needed by RMI GC
Thu, 25 Aug 2016 21:18:44 +0000 lana Added tag jdk-9+133 for changeset a25e0fb60332
Fri, 19 Aug 2016 11:22:14 -0700 amurillo Mergejdk-9+133
Tue, 16 Aug 2016 09:56:18 -0400 hseigel 8030221: Checking for anonymous class should check for NULL as well as potential nesting
Mon, 15 Aug 2016 13:14:08 -0700 cjplummer 8133740: NMT for Linux/x86/x64 and bsd/x64 slowdebug builds includes NativeCallStack::NativeCallStack() frame in backtrace
Mon, 15 Aug 2016 13:13:48 -0700 cjplummer 8133747: NMT includes an extra stack frame due to assumption NMT is making on tail calls being used
Mon, 15 Aug 2016 13:06:50 -0700 cjplummer 8133749: os::current_frame() is not returning the proper frame on ARM and solaris-x64
Mon, 15 Aug 2016 16:15:16 +0200 erikj 8069540: Remove universal binaries support from hotspot build
Tue, 09 Aug 2016 21:57:29 +0900 ysuenaga 8163185: jhsdb jstack cannot work with normal mode
Fri, 12 Aug 2016 14:12:55 -0700 amurillo Merge
Fri, 12 Aug 2016 08:46:17 -0700 fparain 8146697: VM crashes in test Test7005594
Fri, 12 Aug 2016 00:19:44 -0400 dholmes 8159461: bigapps/Kitchensink/stressExitCode hits assert: Must be VMThread or JavaThread
Thu, 11 Aug 2016 16:22:08 -0700 iveresov Merge
Tue, 09 Aug 2016 16:47:47 +0300 dpochepk 8160299: Test8015436 doesn't check which method was executed
Tue, 09 Aug 2016 14:17:28 +0300 dpochepk 8163366: compiler/codecache/jmx/ThresholdNotificationsTest.java doesn't set -XX:+UnlockDiagnosticVMOptions while using WB
Tue, 09 Aug 2016 14:16:44 +0300 dpochepk 8160083: compiler.codecache.jmx.InitialAndMaxUsageTest can not be used w/ disabled SegmentedCodeCache
Mon, 08 Aug 2016 17:06:21 +0200 dnsimon 8163105: SIGSEGV: constantPoolHandle::constantPoolHandle(ConstantPool*)
Mon, 08 Aug 2016 11:30:46 +0300 dpochepk 8163243: [TESTBUG] compiler/codecache/jmx/UsageThresholdIncreasedTest.java failed with: Failed to find sun/hotspot/WhiteBox.class
Sat, 06 Aug 2016 11:52:37 -0700 iveresov 8163313: assert(comp != __null) failed: compiler not available
Fri, 05 Aug 2016 13:37:53 -0700 iveresov Merge
Fri, 05 Aug 2016 16:23:44 +0300 dpochepk 8157498: compiler/codecache/jmx/InitialAndMaxUsageTest.java times out on 32-bit platforms
Fri, 05 Aug 2016 16:22:30 +0300 dpochepk 8161279: Various JMX-tests timed out
Thu, 04 Aug 2016 22:42:05 -0400 mdoerr 8162369: PPC64: Wrong ucontext used after SIGTRAP while in HTM critical section
Thu, 04 Aug 2016 10:34:34 +0200 thartmann 8136818: Test compiler/arraycopy/TestEliminatedArrayCopyDeopt.java fails with "m1 failed"
Thu, 04 Aug 2016 08:58:22 +0200 thartmann 8162881: Effect of -XX:CICompilerCount depends on ordering of other flags
Wed, 03 Aug 2016 15:52:38 +0000 never Merge
Tue, 02 Aug 2016 17:12:16 -0700 never 8162477: [JVMCI] assert(wf.check_method_context(ctxk, m)) failed: proper context
Tue, 02 Aug 2016 19:46:29 -0700 kvn 8163018: Slow compiler tests in JPRT
Thu, 11 Aug 2016 21:35:09 +0200 dcubed Merge
Thu, 11 Aug 2016 16:13:05 +0000 lfoltan Merge
Thu, 11 Aug 2016 11:41:11 -0400 lfoltan 8162553: Crash in class unloading due to null CLD having a zero _keep_alive value
Thu, 11 Aug 2016 17:47:25 +0300 dsamersoff 8163143: illegal bci error with interpreted frames in SA due to mirror being stored in interpreted frames
Wed, 10 Aug 2016 21:02:14 -0400 ysuenaga 8163580: Cannot get Monitor Cache Dump in HSDB
Wed, 10 Aug 2016 09:24:42 +0200 rehn 8161026: GPL header missing comma in year
Thu, 18 Aug 2016 21:33:36 +0000 lana Merge
Tue, 16 Aug 2016 08:08:00 -0700 amurillo Merge
Thu, 11 Aug 2016 12:27:20 -0700 dcubed 8163879: quarantine serviceability/sa/sadebugd/SADebugDTest.java since it hangs intermittently
Fri, 12 Aug 2016 13:58:14 -0700 amurillo Merge
Mon, 08 Aug 2016 15:53:02 +0000 dsamersoff Merge
Mon, 08 Aug 2016 21:59:12 +0900 ysuenaga 8163272: jhsdb jinfo cannot show system properties
Mon, 08 Aug 2016 17:15:46 +0300 dsamersoff 8163269: Testcase missed in push for JDK-8160817
Fri, 05 Aug 2016 09:58:09 -0700 amurillo Merge
Thu, 04 Aug 2016 16:11:49 -0700 cjplummer 8162670: make of jtreg_tests fails if no tests are run, causing jprt test runs to also fail
Thu, 04 Aug 2016 23:17:33 +0200 mockner Merge
Thu, 04 Aug 2016 12:55:28 -0400 mockner 8145543: JPRT jobs see intermittent failures in compiler/floatingpoint/ModNaN.java
Thu, 04 Aug 2016 19:50:23 +0000 coleenp Merge
Thu, 04 Aug 2016 10:11:35 -0700 gthornbr 8162999: Build give extraneous find warnings
Thu, 04 Aug 2016 20:28:12 +0200 mockner Merge
Thu, 04 Aug 2016 18:34:40 +0200 mockner Merge
Thu, 04 Aug 2016 12:24:10 -0400 mockner 8159917: Space character is missing in ClassLoaderData::print_value_on
Thu, 04 Aug 2016 14:04:14 +0300 lmesnik 8162852: Mark stress compiler and gc tests with stress keyword
Wed, 03 Aug 2016 15:55:40 -0700 iveresov Merge
Tue, 02 Aug 2016 11:06:25 -0700 dlong 8029441: assert(!((nmethod*)_cb)->is_deopt_pc(_pc)) failed: invariant broken
Mon, 01 Aug 2016 22:34:23 -0700 kvn Merge
Sat, 30 Jul 2016 04:05:28 -0700 roland 8161652: Crash with assert(ft == _type) failed in PhiNode::Value()
Wed, 03 Aug 2016 13:56:27 -0700 cjplummer 8161030: GPL header missing comma after year
Wed, 03 Aug 2016 09:40:21 -0400 coleenp 8159284: bigapps/Jetty - assert(jfa->last_Java_sp() > sp()) failed with JFR in use
Tue, 02 Aug 2016 20:55:27 -0700 dcubed Merge
Tue, 02 Aug 2016 13:48:07 -0700 gthornbr 8161696: [TESTBUG] runtime/StackGuardPages/testme.sh uses invalid argument -Xss328k
Wed, 03 Aug 2016 02:10:23 +0000 jprovino Merge
Tue, 02 Aug 2016 16:39:33 -0400 jprovino 8071770: G1 does not implement millis_since_last_gc which is needed by RMI GC
Thu, 18 Aug 2016 21:01:21 +0000 lana Added tag jdk-9+132 for changeset 713951c08aa2
Fri, 12 Aug 2016 08:59:20 -0700 mhaupt 8163533: jdk.vm.ci.hotspot.test.MethodHandleAccessProviderTest fails on jdk9/devjdk-9+132
Thu, 11 Aug 2016 17:02:27 +0000 lana Merge
Wed, 10 Aug 2016 15:48:04 -0700 hseigel 8136930: Simplify use of module-system options by custom launchers
Thu, 11 Aug 2016 15:47:07 +0000 lana Added tag jdk-9+131 for changeset 943bf73b49c3
Fri, 05 Aug 2016 09:50:25 -0700 amurillo Mergejdk-9+131
Tue, 02 Aug 2016 16:24:04 -0400 dholmes 7008747: Header files with conditional behaviour can not be precompiled
Tue, 02 Aug 2016 15:22:41 +0300 mchernov 8161604: TestNewSizeFlags fails with RuntimeException: max new size != MaxNewSize value
Mon, 01 Aug 2016 20:47:51 -0700 kvn Merge
Fri, 29 Jul 2016 17:41:14 +0300 tpivovarova 8161138: testlibrary_tests/ctw/* failed with "Failed. Unexpected exit from test [exit code: 0]"
Mon, 01 Aug 2016 20:41:15 -0400 clanger 8162869: Small fixes for AIX perf memory and attach listener
Mon, 01 Aug 2016 16:28:23 -0400 coleenp 8161445: [BACKOUT] MemberNameTable doesn't purge stale entries
Mon, 01 Aug 2016 15:38:58 +0300 dsamersoff 8160817: Add jsadebugd functionality to jhsdb
Mon, 01 Aug 2016 10:51:22 +0300 dsamersoff 8158050: Remove SA-JDI
Fri, 29 Jul 2016 16:50:45 -0700 amurillo Merge
Fri, 29 Jul 2016 16:11:55 -0700 amurillo Merge
Fri, 29 Jul 2016 20:23:24 +0000 jmasa Merge
Wed, 08 Jun 2016 14:11:51 -0700 jmasa 8159073: : Error handling incomplete when creating GC threads lazily
Fri, 29 Jul 2016 11:38:07 -0700 dcubed 8161601: Solaris: __USE_LEGACY_PROTOTYPES__ is redundant and should be removed
Fri, 29 Jul 2016 08:17:43 +0000 rbackman Merge
Fri, 29 Jul 2016 09:23:05 +0200 rbackman Merge
Thu, 28 Jul 2016 16:09:31 +0300 dpochepk 8162603: Unrecognized VM option 'UseCountedLoopSafepoints'
Thu, 28 Jul 2016 08:19:35 +0000 zmajo Merge
Wed, 27 Jul 2016 12:33:33 +0200 roland 8162384: Performance regression: bimorphic inlining may be bypassed by type speculation
Wed, 27 Jul 2016 10:56:01 -0700 dlong 8160742: Node::operator new invokes undefined behavior
Wed, 20 Jul 2016 12:34:11 +0200 goetz 8161907: adlc: Fix crash in cisc_spill_match if _rChild == NULL
Mon, 25 Jul 2016 14:31:42 -0700 roland 8161147: jvm crashes when -XX:+UseCountedLoopSafepoints is enabled
Thu, 23 Jun 2016 17:58:59 +0000 aph 8157306: Random infrequent null pointer exceptions in javac
Mon, 25 Jul 2016 21:02:51 +0300 dpochepk 8162376: TestSHA512Intrinsics.java failed with Unexpected count of intrinsic _sha5_implCompress is expected
Fri, 22 Jul 2016 12:47:08 -1000 twisti 8162427: fix indent in CompileTask::print_tty
Mon, 18 Jul 2016 20:45:51 +0200 roland 8161651: Logic in ConnectionGraph::split_unique_types() wrongly assumes node always have memory input
Fri, 22 Jul 2016 17:52:03 +0000 dnsimon Merge
Wed, 20 Jul 2016 22:18:13 +0000 dnsimon 8161265: [JVMCI] EnableJVMCI should only be required when its not implied by other flags
Fri, 22 Jul 2016 17:05:08 +0100 aph 8161190: AArch64: Fix overflow in immediate cmp instruction
Wed, 20 Jul 2016 19:35:08 +0300 dpochepk 8071652: -XX:CompileOnly does not behave as documented
Wed, 20 Jul 2016 19:33:22 +0300 dpochepk 8161695: compiler/jsr292/MHInlineTest.java can't be run on client-only platforms
Wed, 20 Jul 2016 19:31:34 +0300 dpochepk 8158756: [Testbug] serviceability/dcmd/compiler/CompilerQueueTest.java fails with TieredStopAtLevel=1
Wed, 20 Jul 2016 19:29:10 +0300 dpochepk 8161508: JVMCI: MaterializeVirtualObjectTest fails w/ "CASE: invalidate=true: has no virtual object before materialization
Tue, 19 Jul 2016 18:17:40 -0700 never 8161603: [JVMCI] HotSpotVMConfig.baseVtableLength is incorrectly computed
Tue, 19 Jul 2016 18:59:11 +0000 dnsimon 8161274: [JVMCI] compiler/jvmci/events/JvmciNotifyInstallEventTest.java fails with NoClassDefFound
Tue, 19 Jul 2016 18:11:03 +0000 never 8161292: [JVMCI] missing test files from 8159368
Tue, 19 Jul 2016 13:15:46 +0200 rbackman Merge
Thu, 23 Jun 2016 22:33:46 +0200 goetz 8160245: C1: Clean up platform #defines in c1_LIR.hpp.
Thu, 14 Jul 2016 20:11:55 +0300 dpochepk 8157861: [TESTBUG] compiler/jvmci/compilerToVM/ReprofileTest.java failed with RuntimeException
Thu, 14 Jul 2016 20:10:16 +0300 dpochepk 8157984: [TESTBUG] Several compiler tests fails when are executed with -XX:TieredStopAtLevel=1
Thu, 14 Jul 2016 14:44:53 +0000 tpivovarova Merge
Wed, 13 Jul 2016 18:03:15 +0300 tpivovarova 8151280: update hotspot tests to use vm.compMode instead of their own logic
Thu, 14 Jul 2016 15:18:15 +0100 aph Merge
Wed, 13 Jul 2016 15:19:34 +0100 aph 8159467: AArch64: Enable compact strings
Fri, 08 Jul 2016 17:11:37 +0100 aph 8161072: AArch64: jtreg compiler/uncommontrap/TestDeoptOOM failure
Thu, 14 Jul 2016 08:33:08 +0200 mhaupt 8161068: jdk.vm.ci.hotspot.test.MethodHandleAccessProviderTest fails
Wed, 13 Jul 2016 19:08:07 +0300 ppunegov 8160761: [TESTBUG] Several compiler tests fail with product bits
Mon, 04 Jul 2016 16:28:27 +0200 goetz 8056950: Compiled code (64-bit) on SPARC should sign extend INT parameters passed on registers to runtime or native methods.
Tue, 12 Jul 2016 20:42:46 +0000 sanzinger 8159368: [JVMCI] SPARCHotSpotRegisterConfig.callingConvention gives incorrect calling convention for native calls containing fp args
Tue, 12 Jul 2016 18:24:48 +0300 tpivovarova 8132919: Put compiler tests in packages
Tue, 12 Jul 2016 08:42:46 +0000 zmajo Merge
Tue, 12 Jul 2016 10:16:36 +0200 zmajo 8098573: Compiler accesses to shared archive fail if archive is remapped
Tue, 12 Jul 2016 08:57:00 +0200 thartmann 8160898: assert while replaying ciReplay file created using TieredStopAtLevel=1
Mon, 11 Jul 2016 19:15:21 +0000 dnsimon 8160730: [JVMCI] compiler selection should work without -Djvmci.Compiler
Mon, 11 Jul 2016 13:14:19 +0200 rbackman Merge
Fri, 08 Jul 2016 21:26:02 +0300 iignatyev 8160657: Compiler HotSpot tests should use the "run driver" directive where applicable
Fri, 08 Jul 2016 20:14:18 +0300 dpochepk 8160276: Jittester: bytecode tests generation hangs in ClassWriter infinite loop
Fri, 08 Jul 2016 17:02:10 +0100 aph 8160969: aarch64: CDS is broken after 8079507
Thu, 07 Jul 2016 15:39:12 +0100 aph Merge
Thu, 07 Jul 2016 15:07:13 +0100 aph 8141633: Implement VarHandles/Unsafe intrinsics on AArch64
Thu, 07 Jul 2016 13:53:52 +0300 tpivovarova 8160773: error: package jdk.internal.jimage does not exist
Wed, 06 Jul 2016 15:05:28 +0300 vlivanov 8160360: Mismatched field loads are folded in LoadNode::Value
Tue, 05 Jul 2016 17:57:20 -0700 dnsimon 8159888: [JVMCI] the client VM build is broken when INCLUDE_JVMCI is defined
Tue, 05 Jul 2016 07:57:09 +0200 thartmann 8159129: TestStringIntrinsicRangeChecks fails w/ No exception thrown for compressByte/inflateByte
Mon, 04 Jul 2016 09:14:02 +0200 thartmann 8160651: StubRoutines::_dtan does not restore callee save register rbx
Sat, 02 Jul 2016 00:27:19 +0000 dnsimon 8160647: [JVMCI] need to be able to copy internal arrays from LocalVariableTable and LineNumberTable
Thu, 30 Jun 2016 05:05:52 -0700 rraghavan 8153194: PreserveFPRegistersTest.java runs out of memory in the nightlies.
Tue, 24 May 2016 01:13:57 -0700 enevill 8156943: aarch64: string compare does not support CompactStrings
Thu, 30 Jun 2016 08:24:51 +0200 thartmann 8160425: Vectorization with signalling NaN returns wrong result
Wed, 29 Jun 2016 18:04:04 +0300 ppunegov 8160471: compiler/rangechecks/TestRangeCheckEliminationDisabled.java fails after JDK-8150900
Wed, 29 Jun 2016 11:38:58 +0000 tpivovarova Merge
Wed, 29 Jun 2016 14:32:13 +0300 tpivovarova 8153515: [ctw] CompileTheWorld testlibrary should trigger compilation of <clinit> and <init>
Wed, 29 Jun 2016 11:24:13 +0000 enevill 8160534: aarch64: fails to build after 8157834
Tue, 28 Jun 2016 20:08:43 +0000 never Merge
Tue, 28 Jun 2016 17:22:56 +0000 never 8160121: [JVMCI] JvmciNotifyBootstrapFinishedEventTest.java failed NoClassDefFoundError: jdk/vm/ci/runtime/JVMCI
Tue, 28 Jun 2016 19:58:15 +0300 tpivovarova 8143081: [ctw] Test CompileTheWorld.java needs to be updated for Jigsaw
Mon, 27 Jun 2016 17:23:15 +0300 dpochepk 8132318: -XX:TraceJumps is broken on Sparc
Mon, 27 Jun 2016 10:10:11 +0200 thartmann 8159016: Over-unrolled loop is partially removed
Fri, 24 Jun 2016 15:30:50 -0700 kvn Merge
Fri, 24 Jun 2016 19:06:00 +0000 iveresov Merge
Fri, 24 Jun 2016 11:22:08 -0700 iveresov 8157249: [JVMCI] remove ConstantReflectionProvider.isEmbeddable method
Fri, 24 Jun 2016 17:12:50 +0000 ppunegov Merge
Fri, 24 Jun 2016 19:06:15 +0300 ppunegov 8160085: @library' must appear before first `@run'
Fri, 24 Jun 2016 17:11:17 +0000 rschatz Merge
Fri, 24 Jun 2016 15:45:47 +0000 rschatz 8160177: [JVMCI] race condition in HotSpotMemoryAccessProviderImpl.verifyReadRawObject
Thu, 16 Jun 2016 06:42:08 -0400 enevill 8159063: aarch64: optimise unaligned array copy long
Wed, 22 Jun 2016 17:05:40 +0200 simonis 8159620: -XX:-UseOnStackReplacement does not work together with -XX:+TieredCompilation on ppc64 and sparc
Fri, 29 Jul 2016 08:36:13 +0200 thartmann 8162540: Crash in C2 escape analysis with assert: "node should be registered"
Thu, 28 Jul 2016 09:57:49 -0400 lfoltan 8160487: JVM should validate a module by checking for an instance of java.lang.reflect.Module
Wed, 27 Jul 2016 18:43:52 +0300 mchernov 8159606: gc/g1/TestShrinkAuxiliaryData* tests fail because GC triggered before VM initialization completed
Wed, 27 Jul 2016 21:16:38 +0400 dfazunen 8161990: Un-quarantine TestParallelHeapSizeFlags.java and TestSmallHeap.java.
Wed, 27 Jul 2016 13:33:52 +0000 acorn Merge
Wed, 27 Jul 2016 08:31:48 -0400 acorn 8162340: Better class stream parsing
Tue, 26 Jul 2016 23:52:25 -0400 dholmes 8140723: Remove source code conditionalized on JAVASE_EMBEDDED
Tue, 26 Jul 2016 17:25:58 -0400 jiangli 8156959: compiler/codecache/jmx/UsageThresholdExceededSeveralTimesTest.java fails with exit 134.
Tue, 26 Jul 2016 10:29:27 -0400 lfoltan 8154239: -Xbootclasspath/a breaks exploded build
Tue, 26 Jul 2016 11:04:20 +0200 tschatzl 8161993: G1 crashes if active_processor_count changes during startup
Tue, 26 Jul 2016 11:04:20 +0200 tschatzl 8147910: Cache initial active_processor_count
Wed, 13 Jul 2016 12:23:05 +0200 goetz 8161258: Simplify including platform files.
Mon, 25 Jul 2016 18:52:59 +0000 amurillo Merge
Mon, 25 Jul 2016 15:30:23 +0000 amurillo Merge
Fri, 22 Jul 2016 19:04:38 +0000 amurillo Merge
Fri, 22 Jul 2016 10:35:46 -0700 amurillo Merge
Fri, 22 Jul 2016 10:14:23 -0700 amurillo Merge
Mon, 25 Jul 2016 17:35:25 +0200 ddmitriev Merge
Fri, 22 Jul 2016 16:55:55 +0300 akulyakh 8153978: New test to verify the modules info as returned by the JVMTI
Mon, 25 Jul 2016 09:40:31 -0400 mockner 8038332: The trace event vm/class/load is not always being sent
Fri, 22 Jul 2016 10:15:42 -0700 bchristi 8161028: GPL header missing comma after year
Thu, 21 Jul 2016 14:55:54 +0200 ehelin 8159464: DumpHeap.java hits assert in G1 code
Fri, 22 Jul 2016 02:36:39 -0700 sspitsyn 8145627: sun.jvm.hotspot.oops.InstanceKlass::getSize() returns the incorrect size and has no test
Fri, 22 Jul 2016 04:05:04 +0000 amurillo Merge
Thu, 21 Jul 2016 20:09:19 -0700 amurillo Merge
Thu, 21 Jul 2016 19:50:41 -0700 amurillo Merge
Thu, 21 Jul 2016 19:29:33 -0700 ccheung 8161539: 8159666 breaks minimal VM
Thu, 21 Jul 2016 16:45:56 +0000 dfazunen Merge
Thu, 21 Jul 2016 17:12:35 +0400 dfazunen 8161552: Test issue: VM init failed: GC triggered before VM initialization completed. Try increasing NewSize, current value 768K.
Thu, 21 Jul 2016 16:29:21 +0200 psandoz 8161947: runtime/Unsafe/GetUnsafe.java is failing on jdk9/dev
Thu, 21 Jul 2016 14:06:22 +0200 mgerdin 8161915: Linking gtestLauncher may end up linking with non-gtest libjvm
Wed, 20 Jul 2016 14:47:53 +0300 bmoloden 8160119: Utils.tryFindJvmPid sometimes find incorrect pid
Tue, 19 Jul 2016 22:14:22 +0200 jiangli Merge
Tue, 19 Jul 2016 20:39:23 +0200 jiangli Merge
Tue, 19 Jul 2016 20:07:06 +0200 jiangli Merge
Tue, 19 Jul 2016 13:52:14 -0400 jiangli 8141341: CDS should be disabled if JvmtiExport::should_post_class_file_load_hook() is true.
Tue, 19 Jul 2016 19:05:06 +0000 jmasa Merge
Wed, 06 Jul 2016 13:23:10 -0700 jmasa 8155263: DisableStartThread should not be applied to GC worker threads
Tue, 19 Jul 2016 17:26:51 +0000 gziemski Merge
Tue, 19 Jul 2016 11:00:45 -0500 gziemski 8138760: [JVMCI] VM warning: Performance bug: SystemDictionary lookup_count=21831450 lookup_length=1275207287 average=58.411479 load=5.572844
Tue, 19 Jul 2016 18:15:46 +0300 mchernov 8160827: gc/stress/TestStressG1Humongous.java fails with OOME
Tue, 19 Jul 2016 09:30:30 +0200 tschatzl 8157459: G1 IHOP JFR event attribute with incorrect content type
Tue, 19 Jul 2016 10:31:41 +0200 tschatzl 8034842: Parallelize the Free CSet phase in G1
Mon, 18 Jul 2016 14:20:30 -0700 dcubed 8161173: quarantine compiler/arraycopy/TestEliminatedArrayCopyDeopt.java
Mon, 18 Jul 2016 14:30:39 +0200 mgerdin 8161027: GPL header missing comma after year
Sat, 16 Jul 2016 23:10:00 +0300 igerasim 8160892: Race at the VM exit causes "WaitForMultipleObjects timed out"
Fri, 15 Jul 2016 17:05:10 -0700 dcubed Merge
Fri, 15 Jul 2016 10:46:08 -0700 gthornbr 8144278: [TESTBUG] hotspot/runtime/StackGuardPages/testme.sh should use native library build support
Fri, 15 Jul 2016 10:31:50 -0700 gthornbr 8144279: [TESTBUG] hotspot/runtime/jsig/Test8017498.sh should use native library build support
Fri, 15 Jul 2016 10:25:16 -0700 gthornbr 8081770: [TESTBUG] regression Test7107135 needs to remove dependence on locally installed gcc
Fri, 15 Jul 2016 18:09:33 +0000 dcubed Merge
Fri, 15 Jul 2016 09:36:28 -0700 dcubed 8160997: Solaris: deprecated <pwd.h> and <gid.h> interfaces should be replaced
Fri, 15 Jul 2016 09:10:36 -0700 amurillo Merge
Fri, 15 Jul 2016 12:40:47 +0000 psandoz Merge
Fri, 15 Jul 2016 12:36:18 +0200 psandoz 8151163: All Buffer implementations should leverage Unsafe unaligned accessors
Fri, 15 Jul 2016 13:33:44 +0200 tschatzl 8160897: Concurrent mark mark stack memory allocation leaks memory
Tue, 12 Jul 2016 15:06:18 +0300 mchernov 8158508: gc/logging/TestUnifiedLoggingSwitchStress.java timeout
Wed, 13 Jul 2016 18:26:51 -0700 ccheung 8159901: missing newline char in the exception messages in diagnosticArgument.cpp
Thu, 07 Jul 2016 18:40:53 +0100 andrew 8156980: Hotspot build doesn't have -std=gnu++98 gcc option
Wed, 13 Jul 2016 10:51:19 +0300 dsamersoff 8134434: JVM_DoPrivileged() fires assert(_exception_caught == false) failed: _exception_caught is out of phase
Tue, 21 Jun 2016 19:37:30 +0200 jwilhelm 8024137: Flags should be set using the proper macro
Tue, 21 Jun 2016 19:35:39 +0200 jwilhelm 8048093: Explicitly setting := vs = in the -XX:+PrintFlagsFinal output
Thu, 04 Aug 2016 15:52:14 -0700 darcy 8163231: A couple of runtime tests failing for the -testset hotspot snapshot job
Thu, 04 Aug 2016 17:32:52 +0000 amurillo Added tag jdk-9+130 for changeset 7d54c7056328
Thu, 28 Jul 2016 16:08:14 +0000 amurillo Added tag jdk-9+129 for changeset e96b34b76d86jdk-9+130
Thu, 21 Jul 2016 21:42:16 +0000 vlivanov Mergejdk-9+129
Thu, 21 Jul 2016 20:18:11 +0300 vlivanov 8155781: C2: opaque unsafe access triggers an assert
Thu, 21 Jul 2016 17:14:02 +0000 amurillo Merge
Wed, 20 Jul 2016 10:55:32 -0700 dcubed 8161949: quarantine runtime/Unsafe/GetUnsafe.java to allow sync with JDK9-dev
Wed, 11 May 2016 12:03:46 -0400 hseigel 8155981: Bolster bytecode verification
Wed, 20 Apr 2016 16:39:37 -0400 jiangli 8153312: Constrain AppCDS behavior
Wed, 06 Apr 2016 21:53:44 -0700 iklam 8150752: Share Class Data
Wed, 06 Apr 2016 07:55:32 -0400 hseigel 8152479: Coded byte streams
Tue, 19 Jul 2016 11:02:28 +0200 zmajo Merge
Tue, 19 Jul 2016 10:14:34 +0200 zmajo 8161660: Quarantine TestParallelHeapSizeFlags.java and TestSmallHeap.java
Mon, 18 Jul 2016 15:53:56 +0200 zmajo 8161581: Quarantine compiler/jvmci/jdk.vm.ci.runtime.test/src/jdk/vm/ci/runtime/test/TestResolvedJavaType.java
Fri, 15 Jul 2016 09:05:33 -0700 amurillo Merge
Wed, 06 Jul 2016 20:58:08 +0900 ysuenaga 8153074: UL: Show output option in VM.log jcmd
Sat, 09 Jul 2016 19:20:38 -0700 sspitsyn 8159145: Add JVMTI function GetNamedModule
Fri, 08 Jul 2016 12:17:10 -0700 amurillo Merge
Thu, 19 May 2016 13:59:50 -0700 jmasa 8157240: GC task trace logging is incomprehensible
Tue, 21 Jun 2016 14:00:18 +0200 stefank 8159893: StringTable cleaning log line lacks the GC ID prefix
Thu, 07 Jul 2016 14:58:17 -0700 dcubed 8068592: Remove unused code in objectMonitor.hpp
Thu, 07 Jul 2016 15:40:36 -0400 kbarrett 8160350: cannot truss jdk9 [ solaris ]
Wed, 06 Jul 2016 12:01:07 +0000 zmajo Merge
Wed, 06 Jul 2016 11:16:36 +0200 zmajo 8160527: Check for final instance field updates can be omitted
Wed, 06 Jul 2016 11:22:55 +0200 tschatzl 8159978: Use an array to store the collection set regions instead of linking through regions
Tue, 05 Jul 2016 21:24:24 +0000 dcubed Merge
Tue, 05 Jul 2016 14:00:21 -0700 dcubed 8160739: quarantine tests failing due to -XX:TieredStopAtLevel=1
Tue, 05 Jul 2016 15:34:06 -0400 drwhite 8158946: btree009 fails with assert(s > 0) failed: Bad size calculated
Tue, 05 Jul 2016 20:09:21 +0200 kbarrett Merge
Mon, 04 Jul 2016 12:43:01 +0900 ysuenaga 8160353: narrowing conversion error is occurred with GCC 6
Mon, 13 Jun 2016 14:10:09 -0700 jmasa 8024945: Remove check on minimum size of MetaspaceSize
Tue, 28 Jun 2016 00:24:10 +0900 ysuenaga 8160361: SEGV occurred at JNIHandleBlock::oops_do(OopClosure*)
Mon, 04 Jul 2016 11:27:11 +0200 pliden 8159974: G1 String deduplication logging not aligned with the rest of G1
Sat, 02 Jul 2016 00:26:51 +0000 amurillo Merge
Fri, 01 Jul 2016 16:55:44 -0700 amurillo Merge
Thu, 21 Jul 2016 16:42:57 +0000 amurillo Added tag jdk-9+128 for changeset 22bf6db9767b
Thu, 14 Jul 2016 16:21:57 +0000 amurillo Mergejdk-9+128
Tue, 12 Jul 2016 10:03:30 -0700 amurillo Merge
Fri, 08 Jul 2016 12:12:54 -0700 amurillo Merge
Fri, 01 Jul 2016 23:11:45 +0000 poonam Merge
Fri, 01 Jul 2016 12:51:29 -0700 poonam 8064814: Print more helpful error message when getting OOM due to low Java Heap base when running with CompressedOops
Thu, 30 Jun 2016 19:16:14 -0400 kbarrett 8160356: invalid suffix on literal warning is occurred with GCC 6
Fri, 01 Jul 2016 13:39:36 +0200 ctornqvi Merge
Fri, 01 Jul 2016 07:21:33 -0400 ctornqvi 8160484: Implement Hotspot Runtime tier 2
Fri, 01 Jul 2016 11:55:25 +0200 erikj 8158629: bash >(...) construct still causes race conditions
Wed, 29 Jun 2016 16:11:50 +0200 mlarsson 8159695: Arguments::atojulong() fails to detect overflows
Thu, 30 Jun 2016 00:19:48 +0000 coleenp Merge
Wed, 29 Jun 2016 20:16:05 -0400 coleenp 8160551: assert(c == Bytecodes::_putfield) failed: must be putfield
Wed, 29 Jun 2016 18:40:28 +0300 kzhaldyb 8132711: Add tests which check that Humongous objects behave as expected after Mixed GC
Wed, 29 Jun 2016 17:01:55 +0300 kzhaldyb 8132715: Add tests which check that no allocations allowed in any of humongous regions
Tue, 28 Jun 2016 10:11:01 -0400 lfoltan 8159262: Walking PackageEntry Export and ModuleEntry Reads Must Occur Only When Neccessary And Wait Until ClassLoader's Aliveness Determined
Tue, 28 Jun 2016 10:37:52 +0200 pliden 8159890: SIGSEGV with UseStringDeduplication and UseSharedSpaces/RequireSharedSpaces
Tue, 12 Jul 2016 10:39:46 +0200 mhaupt 8161032: GPL header incorrect - address wrong - not swapped in licensee bundles
Thu, 14 Jul 2016 15:47:44 +0000 amurillo Added tag jdk-9+127 for changeset 352357128f60
Tue, 12 Jul 2016 21:14:52 +0000 amurillo Mergejdk-9+127
Fri, 08 Jul 2016 20:11:22 +0300 dsamersoff 8161074: Quarantine jdk/vm/ci/hotspot/test/MethodHandleAccessProviderTest.java in JDK9-dev
Thu, 07 Jul 2016 18:35:44 +0000 amurillo Merge
Thu, 07 Jul 2016 19:00:43 +0000 amurillo Merge
Fri, 01 Jul 2016 16:50:34 -0700 amurillo Merge
Mon, 27 Jun 2016 09:35:18 +0200 pliden 8158871: Long response times with G1 and StringDeduplication
Sun, 26 Jun 2016 20:00:45 -0700 iklam 8148813: Windows os::check_heap needs more information
Fri, 24 Jun 2016 15:09:00 -0700 kvn Merge
Thu, 23 Jun 2016 10:22:36 -0700 never 8160197: [JVMCI] AllocatableValue.toString overrides are missing reference information
Thu, 23 Jun 2016 15:41:33 +0000 dpochepk Merge
Thu, 23 Jun 2016 17:40:20 +0300 dpochepk 8159730: compiler/jvmci/compilerToVM/IsMatureTest failed with "Multiple times invoked method should have method data (assert failed: 0 != 0)"
Thu, 23 Jun 2016 17:39:49 +0300 dpochepk 8159803: Jittester: FileAlreadyExists exception during tests generation
Thu, 23 Jun 2016 17:39:06 +0300 dpochepk 8158650: [jittester] when generating tests with default parameters, generation hangs after 98 test
Thu, 23 Jun 2016 17:38:29 +0200 mdoerr 8159976: PPC64: Add missing intrinsics for sub-word atomics
Thu, 23 Jun 2016 05:13:55 +0000 dnsimon 8159613: [Findbugs] various warnings reported for JVMCI sources
Wed, 22 Jun 2016 23:31:33 +0000 never Merge
Wed, 22 Jun 2016 22:39:32 +0000 never 8158850: [JVMCI] be more precise when enforcing OopMapValue encoding limitations
Thu, 23 Jun 2016 00:37:25 +0200 iignatyev Merge
Wed, 22 Jun 2016 20:06:39 +0300 lmesnik 8158581: ciReplay can not be run w/ JFR enabled
Wed, 22 Jun 2016 00:29:32 +0300 iignatyev 8132920: use package in compiler testlibraries
Wed, 22 Jun 2016 21:24:07 +0300 iignatyev 8160025: compiler/testlibrary/uncommontrap/Verifier doesn't close FileReader
Wed, 22 Jun 2016 21:13:52 +0000 never 8159856: [JVMCI] InterpreterFrameSizeTest.java failed compilation
Wed, 22 Jun 2016 13:29:09 +0300 shade 8156803: Turn StressLCM/StressGCM flags to diagnostic
Tue, 21 Jun 2016 13:15:56 -0400 adinn 8160006: Fix AArch64 after changes made by 8151661
Tue, 21 Jun 2016 13:14:33 -0400 adinn 8151661: Performance regression on Solaris-SPARC in 9-b103
Mon, 20 Jun 2016 13:06:33 +0200 psandoz 8158039: VarHandle float/double field/array access should support CAS/set/add atomics
Mon, 20 Jun 2016 08:11:22 -0400 cvarming 8159720: Failure of C2 compilation with tiered prevents some C1 compilations.
Wed, 15 Jun 2016 09:46:15 +0200 rbackman 8139379: Tests fail with assert(nm->insts_contains(original_pc)) failed: original PC must be in nmethod
Mon, 20 Jun 2016 09:32:44 +0200 thartmann 8159715: Fix for 8072422 is incorrect
Thu, 16 Jun 2016 01:43:11 +0300 iignatyev 8159149: Several compiler tests fail with minimal VM
Wed, 15 Jun 2016 22:58:04 +0300 iignatyev 8158754: compilercontrol tests: RandomCommandsTest.java and RandomValidCommandsTest.java - fail in PIT
Mon, 13 Jun 2016 17:36:57 -0700 never 8159010: [JVMCI] crashes with class redefinition
Fri, 17 Jun 2016 16:50:49 +0000 gdub 8159236: [JVMCI] Window-saved SPARC registers should not be considered callee-save
Fri, 17 Jun 2016 11:31:24 +0200 simonis 8158260: PPC64: unaligned Unsafe.getInt can lead to the generation of illegal instructions
Thu, 16 Jun 2016 16:41:50 +0000 rschatz 8159167: [JVMCI] fix HotSpotVMConfig startup performance
Wed, 01 Jun 2016 09:13:10 +0300 iignatyev 8149043: Fix code indentation in test/compiler/stable tests
Wed, 15 Jun 2016 14:27:58 +0200 zmajo 8157181: Compilers accept modification of final fields outside initializer methods
Wed, 15 Jun 2016 13:47:17 +0200 mdoerr 8158232: PPC64: improve byte, int and long array copy stubs by using VSX instructions
Wed, 15 Jun 2016 11:21:36 +0300 shade 8157726: VarHandles/Unsafe should support sub-word atomic ops
Wed, 15 Jun 2016 07:58:56 +0200 thartmann 8159244: Partially initialized string object created by C2's string concat optimization may escape
Tue, 14 Jun 2016 18:07:41 -0700 dlong 8158360: C1: SEGV in generated code
Tue, 14 Jun 2016 15:10:05 -0700 dlong 8159282: quarantine compiler/jvmci/compilerToVM/ReprofileTest.java
Fri, 24 Jun 2016 16:21:57 +0000 dfazunen Merge